{"text_format":"1","workbook":"xlsx","n_sheets":46,"sheets":["Indice","BG","ER","EVPN","EFE","Nota1","Nota 2","Nota 3","Nota 4","Nota 5","Nota 6","Nota 7","Nota 8","Nota 9","Nota 10","Nota 11","Nota 12","Nota 13","Nota 14","Nota 15","Nota 16","Nota 17","Nota 18","Nota 19","Nota 20"," Nota 21","Nota 22","Nota 23","Nota 24","Nota 25","Nota 26","Nota 27","Nota 28","Nota 29","Nota 30","Nota 31","Nota 32","Nota 33","Nota 34","Nota 35","Nota 36","Nota 37","Nota 38","Nota 39","Nota 40","Base de Monedas"],"not_rendered":{"charts":0,"images":5,"macros":0,"external_links":1,"defined_names":9,"comments":0,"pivot_tables":0},"unopened":[],"bounds":{"document_bytes":16777216,"sheet_cells":100000,"rows_first":2000,"rows_last":500,"rows_between":2000,"halvings":0,"cell_chars":16384,"cell_head_chars":4096},"cells_cut":0,"cells_raw":0,"read":"whole","date_system":"1900"}

{"sheet":"Indice","index":0,"n_rows":64,"n_cols":20,"rows_kept":64,"cut":false,"hidden":false,"merged":[]}
[null,"Sociedad:","ATLANTIC S.A.E."]
[null,null,null,null,null,null,null,null,null,null,null,null,null,null,null,null,null,null,1,"Enero"]
[null,null,null,null,null,null,null,null,null,null,null,null,null,null,null,null,null,null,2,"Febrero"]
[null,null,null,null,null,null,null,null,null,null,null,null,null,null,null,null,null,null,3,"Marzo"]
[null,null,null,null,null,null,null,null,null,null,null,null,null,null,null,null,null,null,4,"Abril"]
["Fecha Presentación:","2021-09-30",null,null,null,null,null,null,null,null,null,null,null,null,null,null,null,null,5,"Mayo"]
[null,null,null,null,null,null,null,null,null,null,null,null,null,null,null,null,null,null,6,"Junio"]
[null,null,null,null,null,null,null,null,null,null,null,null,null,null,null,null,null,null,7,"Julio"]
[null,null,"INDICE","REF.",null,null,null,null,null,null,null,null,null,null,null,null,null,null,8,"Agosto"]
[null,"Informacion General",null,null,null,null,null,null,null,null,null,null,null,null,null,null,null,null,9,"Septiembre"]
[null,null,"Descripción de la naturaleza y del negocio de la Sociedad","Nota 1",null,null,null,null,null,null,null,null,null,null,null,null,null,null,10,"Octubre"]
[null,null,"Resumen de las principales políticas contables","Nota 2",null,null,null,null,null,null,null,null,null,null,null,null,null,null,11,"Noviembre"]
[null,"Balance General",null,"BG",null,null,null,null,null,null,null,null,null,null,null,null,null,null,12,"Diciembre"]
[null,null,"Efectivo y equivalente de efectivo","Nota 3"]
[null,null,"Inversiones temporales","Nota 4"]
[null,null,"Cuentas por cobrar comerciales","Nota 5"]
[null,null,"Otros créditos","Nota 6"]
[null,null,"Cuentas por cobrar comerciales","Nota 5"]
[null,null,"Inventarios","Nota 7"]
[null,null,"Inversión en asociadas","Nota 8"]
[null,null,"Propiedades, planta y equipo","Nota 9"]
[null,null,"Activos disponibles para la venta","Nota 10"]
[null,null,"Activos intangibles","Nota 11"]
[null,null,"Goodwill","Nota 12"]
[null,null,"Cuentas por pagar comerciales","Nota 13"]
[null,null,"Préstamos a corto plazo","Nota 14"]
[null,null,"Porción corriente de la deuda a largo plazo","Nota 15"]
[null,null,"Remuneraciones y cargas sociales a pagar","Nota 16"]
[null,null,"Impuestos a pagar","Nota 17"]
[null,null,"Provisiones","Nota 18"]
[null,null,"Otros pasivos corrientes","Nota 19"]
[null,null,"Prestamos a largo plazo","Nota 14"]
[null,null,"Otros pasivos no corrientes","Nota 19"]
[null,null,"Capital integrado","Nota 20"]
[null,null,"Reserva de revalúo","Nota 21"]
[null,null,"Reserva legal","Nota 21"]
[null,null,"Reservas estatutarias","Nota 21"]
[null,null,"Reservas facultativas","Nota 21"]
[null,null,"Diferencia transitoria por conversión","Nota 22"]
[null,null,"Resultados acumulados","Nota 23"]
[null,null,"Interés minoritario","Nota 24"]
[null,"Estado de Resultados ",null,"ER"]
[null,null,"Ventas","Nota 25"]
[null,null,"Costo de ventas","Nota 26"]
[null,null,"Gastos de ventas","Nota 27"]
[null,null,"Gastos administrativos","Nota 27"]
[null,null,"Otros ingresos y gastos operativos","Nota 28"]
[null,null,"Ingresos financieros - neto","Nota 29"]
[null,null,"Gastos financieros - neto","Nota 29"]
[null,null,"Resultado de inversiones en asociadas","Nota 30"]
[null,null,"Resultado participación minoritaria","Nota 31"]
[null,null,"Impuesto a la renta","Nota 32"]
[null,null,"Resultado extraordinario neto de impuesto a la renta","Nota 33"]
[null,null,"Resultado sobre actividades discontinuadas neto de impuesto a la renta","Nota 34"]
[null,null,"Utilidad/(Pérdida) neta del año","Nota 35"]
[null,null,"Utilidad neta por acción ordinaria","Nota 35"]
[null,"Estado de Evolución del Patrimonio Neto",null,"EVPN"]
[null,"Estado de Flujos de Efectivo",null,"EFE"]
[null,"Otras Notas de los Estados Financieros"]
[null,null,"Activos gravados","Nota 36"]
[null,null,"Contingencias y compromisos","Nota 37"]
[null,null,"Impuesto diferido","Nota 38"]
[null,null,"Hechos posteriores","Nota 39"]
[null,null,"Saldos y transacciones con partes relacionadas","Nota 40"]

{"sheet":"BG","index":1,"n_rows":60,"n_cols":7,"rows_kept":60,"cut":false,"hidden":false,"merged":[[70,5,70,6],[71,1,71,3],[12,1,12,3],[30,1,30,3],[46,1,46,3],[45,1,45,3],[56,1,56,3],[69,5,69,6],[29,1,29,3],[57,1,57,3],[38,2,38,3],[41,2,41,3],[42,2,42,3],[47,2,47,3],[49,2,49,3],[48,2,48,3],[6,0,6,6],[9,0,9,6],[64,5,64,6],[53,2,53,3],[54,2,54,3],[28,2,28,3],[25,2,25,3],[26,2,26,3],[21,2,21,3],[23,2,23,3],[24,2,24,3],[33,2,33,3],[7,0,7,6],[8,0,8,6],[65,5,65,6],[14,2,14,3],[15,2,15,3],[16,2,16,3],[17,2,17,3],[18,2,18,3],[27,2,27,3],[32,2,32,3],[34,2,34,3],[35,2,35,3],[36,2,36,3],[37,2,37,3],[55,2,55,3],[50,2,50,3],[51,2,51,3],[52,2,52,3]]}
[null,null,null,"ATLANTIC S.A.E.","Indice"]
[]
[]
[]
[]
[]
["BALANCE GENERAL"]
[{"$f":"IFERROR(IF(Indice!B6=\"\",\"Al dia... de mes… de año 2XX2…\",\"Al \"&DAY(Indice!B6)&\" de \"&VLOOKUP(MONTH(Indice!B6),Indice!S:T,2,0)&\" de \"&YEAR(Indice!B6)),\"Al dia... de mes… de año 2XX2…\")","v":"Al 30 de Septiembre de 2021"}]
["Con cifras comparativas al 31 de diciembre de 2020"]
["(En miles de guaraníes)"]
[]
[null,null,null,null,"Nota",{"$f":"IFERROR(IF(Indice!B6=\"\",\"2XX2\",YEAR(Indice!B6)),\"2XX2\")","v":2021},{"$f":"IFERROR(YEAR(Indice!B6-365),\"2XX1\")","v":2020}]
[null,"ACTIVOS"]
[null,"Activos Corrientes"]
[null,null,"Efectivo y equivalente de efectivo",null,3,17648624208.828003,15439836619]
[null,null,"Inversiones temporales",null,4,0,0]
[null,null,"Cuentas por cobrar comerciales",null,5,62311392549.082001,39695884908.680405]
[null,null,"Otros créditos",null,6,3620282485,4359906361]
[null,null,"Inventarios",null,7,91867922815,77293982983]
[null,null,"Total activos corrientes",null,null,{"$f":"SUM(F15:F19)","v":175448222057.91},{"$f":"SUM(G15:G19)","v":136789610871.6804}]
[null,"Activos no Corrientes"]
[null,null,"Otros créditos ",null,6,0,380118966]
[null,null,"Cuentas por cobrar comerciales",null,5,0,0]
[null,null,"Inversión en asociadas",null,8,0,0]
[null,null,"Propiedades, planta y equipo/Bienes de uso, neto",null,9,48554580123,50569349859]
[null,null,"Activos disponibles para la venta",null,10,0,0]
[null,null,"Activos intangibles",null,11,1202418790,1181658488]
[null,null,"Goodwill",null,12,0,0]
[null,null,"Total activos no corrientes",null,null,{"$f":"SUM(F22:F28)","v":49756998913},{"$f":"SUM(G22:G28)","v":52131127313}]
[null,"Total Activos",null,null,null,{"$f":"+F20+F29","v":225205220970.91},{"$f":"+G20+G29","v":188920738184.68042}]
[null,"PASIVOS Y PATRIMONIO NETO"]
[null,"Pasivos corrientes",null,null,null,-1]
[null,null,"Cuentas por pagar comerciales",null,13,31215038120.877201,27231621593]
[null,null,"Préstamos a corto plazo ",null,14,2505167807,2505753423]
[null,null,"Porción corriente de la deuda a largo plazo",null,15,0,0]
[null,null,"Remuneraciones y cargas sociales a pagar",null,16,1497838573,265312197]
[null,null,"Impuestos a pagar",null,17,4930007014,2460376636]
[null,null,"Provisiones",null,18,0,0]
[null,null,"Otros pasivos corrientes",null,19,1744996917,12825815815]
[null,null,"Total Pasivos Corrientes",null,null,{"$f":"SUM(F33:F39)","v":41893048431.877197},{"$f":"+SUM(G32:G39)","v":45288879664}]
[null,"Pasivos no corrientes"]
[null,null,"Préstamos a largo plazo ",null,14,12750000000,15000000000]
[null,null,"Otros pasivos  no corrientes",null,19,0,0]
[null,null,"Total pasivos no corrientes",null,null,{"$f":"SUM(F42:F43)","v":12750000000},{"$f":"SUM(G42:G43)","v":15000000000}]
[]
[null,"Total Pasivos",null,null,null,{"$f":"+F40+F44","v":54643048431.877197},{"$f":"+G40+G44","v":60288879664}]
[null,"Patrimonio Neto"]
[null,null,"Capital integrado",null,20,89040000000,89040000000]
[null,null,"Reserva de revalúo",null,21,19301479530,19301479530]
[null,null,"Reserva legal",null,21,9789783914,9237272666]
[null,null,"Reservas estatutarias",null,21,0,0]
[null,null,"Reservas facultatitvas",null,21,10500595077,2881363]
[null,null,"Diferencia transitoria por conversión",null,22,0,0]
[null,null,"Resultados acumulados",null,23,41930314018,11050224962]
[null,null,"Subtotal",null,null,{"$f":"SUM(F48:F54)","v":170562172539},{"$f":"SUM(G48:G54)","v":128631858521}]
[null,null,"Interés minoritario",null,24,{"$f":"'Nota 24'!B8","v":0},{"$f":"'Nota 24'!C8","v":0}]
[null,"Total Patrimonio Neto",null,null,null,{"$f":"F55","v":170562172539},{"$f":"G55","v":128631858521}]
[null,"Total Pasivos y Patrimonio Neto",null,null,null,{"$f":"+F46+F57","v":225205220970.8772},{"$f":"+G46+G57","v":188920738185}]
[]
[null,"Las notas que se acompañan forman parte integrante de estos estados."]

{"sheet":"ER","index":2,"n_rows":35,"n_cols":4,"rows_kept":35,"cut":false,"hidden":false,"merged":[[46,2,46,3],[6,0,6,3],[7,0,7,3],[8,0,8,3],[9,0,9,3]]}
["ATLANTIC S.A.E.","Indice",null,{"$f":"ER!A4","v":" "}]
[]
[]
[" "]
[]
[]
["ESTADO DE RESULTADOS"]
[{"$f":"IFERROR(IF(Indice!B6=\"\",\"Al dia... de mes… de año 2XX2…\",\"Al \"&DAY(Indice!B6)&\" de \"&VLOOKUP(MONTH(Indice!B6),Indice!S:T,2,0)&\" de \"&YEAR(Indice!B6)),\"Al dia... de mes… de año 2XX2…\")","v":"Al 30 de Septiembre de 2021"}]
["Comparativo con igual período del año anterior"]
[" (En miles de guaraníes)"]
[]
[null,"Nota",{"$f":"IFERROR(IF(Indice!B6=\"\",\"2XX2\",YEAR(Indice!B6)),\"2XX2\")","v":2021},{"$f":"IFERROR(YEAR(Indice!B6-365),\"2XX1\")","v":2020}]
["Ventas",25,{"$f":"219189315306-34465677194","v":184723638112},156194556543]
["Costo de ventas",26,-144561759133,-123538262610]
["Utilidad bruta",null,{"$f":"C13+C14","v":40161878979},{"$f":"D13+D14","v":32656293933}]
["Gastos de ventas",27,{"$f":"-'Nota 27'!B30","v":-10420643983},-10056036060]
["Gastos administrativos ",27,{"$f":"-'Nota 27'!C30","v":-20968611843},-15649358481]
["Otros ingresos y gastos operativos",28,41207726553,2148933329]
["Resultado operativo",null,{"$f":"SUM(C15:C18)","v":49980349706},{"$f":"SUM(D15:D18)","v":9099832721}]
["Ingresos financieros - neto",29,322159475,1557394]
["Gastos financieros -  neto",29,-3442188149,-287915803]
["Subtotal",null,{"$f":"SUM(C19:C21)","v":46860321032},{"$f":"SUM(D19:D21)","v":8813474312}]
["Resultado de inversiones en asociadas",30,0,0]
["Resultados ordinarios antes de impuesto a la renta y participación minoritaria",null,{"$f":"C22+C23","v":46860321032},{"$f":"D22+D23","v":8813474312}]
["Resultado participación minoritaria",31,{"$f":"'Nota 31'!B16","v":0},{"$f":"'Nota 31'!C16","v":0}]
["Resultado ordinario antes del impuesto a la renta",null,{"$f":"+C24+C25","v":46860321032},{"$f":"+D24+D25","v":8813474312}]
["Impuesto a la renta",32,-4930007014,-883352598]
["Resultado neto de actividades ordinarias",null,{"$f":"+C26+C27","v":41930314018},{"$f":"+D26+D27","v":7930121714}]
["Resultado extraordinario neto de impuesto a la renta",33,0,0]
["Resultado sobre actividades discontinuadas neto de impuesto a la renta",34,0,0]
["Utilidad/(Pérdida) neta del año ",null,{"$f":"C28+C29+C30","v":41930314018},{"$f":"D28+D29+D30","v":7930121714}]
["Utilidad neta por acción ordinaria",35,419303.14017999999,79304.979420000003]
[]
[]
["Las notas que se acompañan forman parte integrante de estos estados."]

{"sheet":"EVPN","index":3,"n_rows":36,"n_cols":20,"rows_kept":36,"cut":false,"hidden":false,"merged":[[3,0,3,19],[4,0,4,19],[5,0,5,19],[6,0,6,19],[10,17,11,17],[10,19,11,19],[10,2,11,2],[10,5,11,5],[10,7,11,7],[10,9,11,9],[10,11,11,11],[10,13,11,13],[10,15,11,15],[10,0,11,0],[9,2,9,5],[9,11,9,15]]}
["ATLANTIC S.A.E.",null,null,null,null,null,null,"Indice"]
[]
[]
["ESTADO DE EVOLUCIÓN DEL PATRIMONIO NETO"]
[{"$f":"IFERROR(IF(Indice!B6=\"\",\"Al dia... de mes… de año 2XX2…\",\"Al \"&DAY(Indice!B6)&\" de \"&VLOOKUP(MONTH(Indice!B6),Indice!S:T,2,0)&\" de \"&YEAR(Indice!B6)),\"Al dia... de mes… de año 2XX2…\")","v":"Al 30 de Septiembre de 2021"}]
["Comparativo con igual periodo del año anterior"]
["(En miles de guaraníes)"]
[]
[]
[null,null,"Aporte de los propietarios",null,null,null,null,null,null,null,null,"Ganancias reservadas"]
[null,null,"Capital suscripto e integrado","Aporte para",null,"Primas de emisión",null,"Reserva de revalúo",null,"Reserva de revalúo técnico",null,"Reserva legal",null,"Reserva facultativa",null,"Resultados acumulados",null,"Interes Minoritario",null,"Total"]
[null,null,null,"aumento de capital",null,null,null,null,null,null,null,null,null,null,null,"Total"]
[]
["Saldo al 31 de Diciembre de 2019",null,{"$f":"75000000000-1720000000","v":73280000000},null,null,0,null,19301479530,null,0,null,8848880557,null,26804483923,null,7767842181,null,0,null,{"$f":"+SUM(C14:R14)","v":136002686191}]
["Cambio en política contable",null,0,null,null,0,null,0,null,0,null,0,null,0,null,0,null,0,null,{"$f":"+SUM(C15:R15)","v":0}]
["Saldo reestructurado",null,{"$f":"+C14+C15","v":73280000000},null,null,{"$f":"+F14+F15","v":0},null,{"$f":"+H14+H15","v":19301479530},null,{"$f":"+J14+J15","v":0},null,{"$f":"+L14+L15","v":8848880557},null,{"$f":"+N14+N15","v":26804483923},null,{"$f":"+P14+P15","v":7767842181},null,{"$f":"+R14+R15","v":0},null,{"$f":"+T14+T15","v":136002686191}]
["Distribución de dividendos",null,0,null,null,0,null,0,null,0,null,0,null,-18421052632,null,null,null,0,null,{"$f":"+SUM(C17:R17)","v":-18421052632}]
["Integración del capital social",null,{"$f":"-[1]VPN!$F$16","v":15760000000},null,null,0,null,0,null,0,null,0,null,{"$f":"+[1]VPN!$F$16","v":-15760000000},null,0,null,0,null,0]
["Reducción del capital social",null,0,null,null,0,null,0,null,0,null,0,null,0,null,0,null,0,null,0]
["Constitución de reservas",null,0,null,null,0,null,0,null,0,null,388392109,null,7379450072,null,{"$f":"-N20-L20","v":-7767842181},null,0,null,0]
["Revalúo técnico",null,0,null,null,0,null,0,null,0,null,0,null,0,null,0,null,0,null,0]
["Resultado del año",null,0,null,null,0,null,0,null,0,null,0,null,0,null,{"$f":"+[1]VPN!$G$19","v":7930497942},null,0,null,7930497942]
[]
[{"$f":"IFERROR(IF(Indice!B6=\"\",\"Saldo al .. de  de 20X1 \",\"Saldo al \"&DAY(Indice!B6)&\" de \"&VLOOKUP(MONTH(Indice!B6),Indice!S:T,2,0)&\" de \"&YEAR(Indice!B6-365)),\"Saldo al .. de  de 20X1 \")","v":"Saldo al 30 de Septiembre de 2020"},null,{"$f":"C16+C17+C18+C19+C20+C21+C22","v":89040000000},{"$f":"SUM(D14:D22)","v":0},null,{"$f":"F16+F17+F18+F19+F20+F21+F22","v":0},{"$f":"SUM(G14:G23)","v":0},{"$f":"H16+H17+H18+H19+H20+H21+H22","v":19301479530},null,{"$f":"J16+J17+J18+J19+J20+J21+J22","v":0},null,{"$f":"L16+L17+L18+L19+L20+L21+L22","v":9237272666},null,{"$f":"N16+N17+N18+N19+N20+N21+N22","v":2881363},null,{"$f":"P16+P17+P18+P19+P20+P21+P22","v":7930497942},null,{"$f":"R16+R17+R18+R19+R20+R21+R22","v":0},null,{"$f":"+SUM(C24:R24)","v":125512131501}]
[]
["Saldo al 31 de Diciembre de 2020",null,{"$f":"+'Nota 20'!C8","v":89040000000},{"$f":"SUM(D16:D24)","v":0},null,{"$f":"F18+F19+F20+F21+F22+F23+F24","v":0},{"$f":"SUM(G16:G25)","v":0},{"$f":"H18+H19+H20+H21+H22+H23+H24","v":19301479530},null,{"$f":"J18+J19+J20+J21+J22+J23+J24","v":0},null,9237272666,null,2881363,null,11050224962,null,{"$f":"R18+R19+R20+R21+R22+R23+R24","v":0},null,{"$f":"+SUM(C26:R26)","v":128631858521}]
["Cambio en política contable",null,0,null,null,0,null,0,null,0,null,0,null,0,null,0,null,0,null,{"$f":"+SUM(C27:R27)","v":0}]
["Saldo reestructurado",null,{"$f":"+C26+C27","v":89040000000},null,null,{"$f":"+F26+F27","v":0},null,{"$f":"+H26+H27","v":19301479530},null,{"$f":"+J26+J27","v":0},null,{"$f":"+L26","v":9237272666},null,{"$f":"+N26","v":2881363},null,{"$f":"+P26+P27","v":11050224962},null,{"$f":"+R26+R27","v":0},null,{"$f":"+SUM(C28:R28)","v":128631858521}]
["Distribución de dividendos",null,0,null,null,0,null,0,null,0,null,0,null,0,null,0,null,0,null,0]
["Constitución de reservas",null,0,null,null,0,null,0,null,0,null,552511248,null,10497713714,null,{"$f":"-N30-L30","v":-11050224962},null,0,null,{"$f":"+SUM(C30:R30)","v":0}]
["Desafectación de la reserva de revalúo técnico",null,0,null,null,0,null,0,null,0,null,0,null,0,null,0,null,0,null,0]
["Resultado del año",null,0,null,null,0,null,0,null,0,null,0,null,0,null,{"$f":"+'Nota 23'!B9","v":41930314018},null,0,null,{"$f":"+SUM(C32:R32)","v":41930314018}]
[]
[{"$f":"IFERROR(IF(Indice!B6=\"\",\"Saldo al .. de  de 20X2 \",\"Saldo al \"&DAY(Indice!B6)&\" de \"&VLOOKUP(MONTH(Indice!B6),Indice!S:T,2,0)&\" de \"&YEAR(Indice!B6)),\"Saldo al .. de  de 20X2 \")","v":"Saldo al 30 de Septiembre de 2021"},null,{"$f":"C28+C29+C30+C31+C32","v":89040000000},{"$f":"SUM(D24:D32)","v":0},null,{"$f":"F28+F29+F30+F31+F32","v":0},null,{"$f":"H28+H29+H30+H31+H32","v":19301479530},null,{"$f":"J28+J29+J30+J31+J32","v":0},null,{"$f":"L28+L29+L30+L31+L32","v":9789783914},null,{"$f":"N28+N29+N30+N31+N32","v":10500595077},null,{"$f":"P28+P29+P30+P31+P32","v":41930314018},null,{"$f":"R28+R29+R30+R31+R32","v":0},null,{"$f":"+SUM(C34:R34)","v":170562172539}]
[null,null," ",null,null,null,null," "]
["Las notas que se acompañan forman parte integrante de estos estados."]

{"sheet":"EFE","index":4,"n_rows":43,"n_cols":3,"rows_kept":43,"cut":false,"hidden":false,"merged":[[2,0,2,2],[4,0,4,2],[5,0,5,2],[6,0,6,2],[7,0,7,2]]}
["ATLANTIC S.A.E."]
[]
[]
[]
["ESTADO DE FLUJOS DE EFECTIVO (Método directo)"]
[{"$f":"IFERROR(IF(Indice!B6=\"\",\"Al dia... de mes… de año 2XX2…\",\"Al \"&DAY(Indice!B6)&\" de \"&VLOOKUP(MONTH(Indice!B6),Indice!S:T,2,0)&\" de \"&YEAR(Indice!B6)),\"Al dia... de mes… de año 2XX2…\")","v":"Al 30 de Septiembre de 2021"}]
["Comparativo con igual periodo del año anterior"]
["(En miles de guaraníes)"]
[]
[]
[null,{"$f":"IFERROR(IF(Indice!B6=\"\",\"2XX2\",YEAR(Indice!B6)),\"2XX2\")","v":2021},{"$f":"IFERROR(YEAR(Indice!B6-365),\"2XX1\")","v":2020}]
[]
["FLUJO DE EFECTIVO DE ACTIVIDADES OPERATIVAS"]
["Cobranzas efectuadas a clientes",{"$f":"184971061900.918-8899137736","v":176071924164.918},153949085408]
["Pagos efectuados a proveedores y empleados",-163639393582,-124752606998]
["Efectivo generado por las operaciones",{"$f":"+B14+B15","v":12432530582.917999},{"$f":"+C14+C15","v":29196478410}]
["Intereses pagados",0,0]
["Otros ingresos y (egresos) - neto",{"$f":"-14502035767+8899137736","v":-5602898031},{"$f":"-15447438437+2148933329","v":-13298505108}]
["Pagos de impuesto a la renta",-1557107986,0]
["Flujo neto de efectivo de actividades operativas",{"$f":"+SUM(B16:B19)","v":5272524565.9179993},{"$f":"+SUM(C16:C19)","v":15897973302}]
[]
["FLUJO DE EFECTIVO DE ACTIVIDADES DE INVERSIÓN "]
["Adquisición de bienes de uso",0,-258930360]
["Adquisición de intangibles",-20760302,-172021831]
["Ventas de bienes de uso",1042619809,0]
["Intereses cobrados sobre inversiones",0,0]
["Aquisición de inversiones",0,0]
["Flujo neto de efectivo de actividades de inversión",{"$f":"SUM(B23:B27)","v":1021859507},{"$f":"SUM(C23:C27)","v":-430952191}]
[]
["FLUJO DE EFECTIVO DE ACTIVIDADES DE FINANCIACIÓN"]
["(Disminución) Incremento de préstamos",-2250000000,-10000000000]
["Intereses Pagados sobre préstamos ",-1498589041,-253410823]
["Aportes de capital recibidos",0,0]
["Dividendos pagados",0,0]
["Flujo neto de efectivo de actividades de financiamiento",{"$f":"B31+B33+B34+B32","v":-3748589041},{"$f":"C31+C33+C34+C32","v":-10253410823}]
[]
["(Disminución) Incremento neto de efectivo",{"$f":"+B35+B28+B20","v":2545795031.9179993},{"$f":"+C35+C28+C20","v":5213610288}]
["Efecto estimado de la diferencia de cambio sobre el saldo de efectivo",-337007442,-287915803]
["Efectivo al principio del año",{"$f":"+BG!G15","v":15439836619},2686643948]
[]
["Efectivo al final del periodo",{"$f":"+SUM(B37:B39)","v":17648624208.917999},{"$f":"+SUM(C37:C39)","v":7612338433}]
[]
["Las notas que se acompañan forman parte integrante de estos estados."]

{"sheet":"Nota1","index":5,"n_rows":34,"n_cols":9,"rows_kept":34,"cut":false,"hidden":false,"merged":[[31,0,31,8],[32,0,32,8],[33,0,33,8],[34,0,34,8],[26,0,26,8],[27,0,27,8],[28,0,28,8],[29,0,29,8],[30,0,30,8],[21,0,21,8],[22,0,22,8],[23,0,23,8],[24,0,24,8],[25,0,25,8],[7,0,7,8],[0,0,0,1],[12,0,12,8],[13,0,13,8],[15,0,15,8],[10,9,10,11],[14,0,14,8],[16,0,16,8],[18,0,18,8],[20,0,20,8],[19,0,19,8],[11,0,11,8],[17,0,17,8]]}
["ATLANTIC S.A.E.",null,null,null,null,null,null,null,"BG"]
[]
[]
[]
[]
["NOTAS A LOS ESTADOS FINANCIEROS CORRESPONDIENTES AL PERIODO TERMINADO",null,null,null,null,null,null,{"$f":"IFERROR(IF(Indice!B6=\"\",\"Al dia... de mes… de año 2XX2…\",\"Al \"&DAY(Indice!B6)&\" de \"&VLOOKUP(MONTH(Indice!B6),Indice!S:T,2,0)&\" de \"&YEAR(Indice!B6)),\"Al dia... de mes… de año 2XX2…\")","v":"Al 30 de Septiembre de 2021"}]
["Presentadas en forma comparativa con el periodo terminado ",null,null,null,null,{"$f":"IFERROR(\"Al \"&DAY(Indice!B6)&\" de \"&VLOOKUP(MONTH(Indice!B6),Indice!S:T,2,0)&\" de \"&YEAR(Indice!B6-365),\"Al dia... de mes… de año 2XX1…\")","v":"Al 30 de Septiembre de 2020"}]
[" "]
[]
[]
["NOTA 1 – DESCRIPCIÓN DE LA NATURALEZA Y DEL NEGOCIO DE LA COMPAÑÍA"]
["ATLANTIC SOCIEDAD ANONIMA EMISORA fue constituida originalmente bajo la denominación de ATLANTIC S.R.L. por Escritura Pública N°2, de fecha 15 de marzo de 1973 pasada ante el Escribano Público César Alberto Riart, inscripta en el Registro Público de Comercio bajo el N° 230, el folio 309, del Libro Sección al respectivo, el 26 de abril de 1973."]
["Sus Estatutos Sociales fueron modificados por Escritura Pública N° 190, de fecha 2 de agosto de 1977, pasada ante el Escribano Público Lorenzo N. Livieres, habiéndose inscrito en el Registro Público de Comercio bajo el N° 699 al folio 123 y siguiente del Libro Seccional respectivo el 12 de agosto de 1977. Posteriormente fue modificado por Escritura Pública N° 256, de la fecha 23 de agosto de 1978, autorizado por el Escribano Público Lorenzo N. Livieres, siendo inscrito en el Registro Público de Comercio bajo el N° 993 al folio 55 y siguiente del Libro Seccional respectivo, el 27 de septiembre de 1978."]
["Una nueva modificación fue realizada por Escritura Pública N° 420 de fecha 5 de diciembre de 1978, pasada también ante el Escribano Público Lorenzo N. Livieres inscripto en el Registro Público de Comercio bajo el N° 36, al folio 234 y siguientes del Libro Seccional respectivo el 14 de enero de 1979. Luego fueron modificados por Escritura Pública N° 52 de fecha 12 de diciembre de 1980, pasada ante el mismo Escribano inscripta en el Registro Público de Comercio bajo el N° 81, folio 154 y siguiente de fecha 23 de enero de 1981. "]
["Otra modificación se dio por Escritura Pública N° 94 de fecha 20 de marzo de 1984, pasada ante el Escribano Público Lorenzo N. Livieres, siendo inscripta en el Registro Público de comercio bajo el N° 647 de la fecha 9 de julio de 1984. Por Escritura Pública N° 6, de fecha 12 de noviembre de 1985, pasada ante el Escribano Público Federico José Franco, inscripto en el Registro Público de Comercio bajo el N° 1214 de fecha 12 de diciembre de 1985. "]
["Luego fue modificado por Escritura Pública N° 7 de fecha 12 de diciembre de 1985 e inscrita en el Registro Público de Comercio bajo el N° 1237 de fecha 31 de diciembre de 1985."]
["También fue modificado por Escritura Pública N° 636 de fecha 30 de diciembre de 1989, pasada ante el Escribano Público Lorenzo N. Livieres, inscripta en el Registro Público de Comercio bajo N° 128, de fecha 20 de febrero de 1990. Igualmente, por Escritura Pública N° 129, de fecha 20 de agosto de 1991, inscripta en el Registro Público de Comercio bajo el N° 1155 de fecha 24 de octubre de 1991. Por Escritura Pública N° 251, de fecha 26 de octubre de 1991, inscrita en el Registro Público de Comercio bajo el N° 367 de fecha 3 de julio de 1992.También por Escritura Pública N° 108 de fecha 30 de junio de 1993 inscripta en el Registro Público de Comercio bajo el N° 650 de fecha 3 de agosto de 1993.  "]
["Por Escritura Pública N° 126 de la fecha 5 de agosto de 1994 fue transformada “ATLANTIC S.A.”, inscripta en el Registro Público de Comercio bajo el N° 286 de la fecha 3 de marzo de 1995. "]
["A través de la Escritura Pública N° 441 de la fecha 7 de diciembre de 1995 pasó a denominarse “ATLANTIC SOCIEDAD ANONIMA EMISORA DE CAPITAL ABIERTO”, inscripta en el Registro de Comercio bajo el N° 842 de fecha 22 de diciembre de 1995."]
[]
["Por Escritura Pública N° 420 de fecha 15 de diciembre de 2000, inscripta en el Registro Público de Comercio bajo el N° 845 de fecha 9 de noviembre de 2001. Por Escritura Pública Complementaria N° 35 de la fecha 15 de diciembre de 2000 inscripta bajo el N° 846 de la fecha 9 de noviembre del 2001. "]
[]
["También se modificó por Escritura Pública N° 63 de la fecha del 10 de abril del 2007, inscripta en el Registro Público de Comercio bajo el N° 431 de fecha 25 de julio de 2007, por Escritura Pública N° 221 de fecha 30 de diciembre de 2009, inscripta en el Registro Público de Comercio bajo el N° 77 de la fecha 3 de marzo de 2010. Modificado nuevamente por Escritura Pública N° 41 de fecha 1 de noviembre del 2011, inscripta en el Registro Público de Comercio bajo el N° 65 del 11 de enero del 2012. "]
[]
["Por Escritura Pública N° 159 de fecha 11 de agosto de 2014, pasada ante la Escribana Pública Basilia Irene Ibarra, se modifica a la denominación de “ATLANTIC SOCIEDAD ANONIMA EMISORA”, fue inscripta en el Registro Público de Comercio bajo el N° 629, serie “A” 10.016 de fecha 24 de septiembre de 2014."]
[]
["Por último, según Escritura Pública N° 84 de fecha 7 de septiembre de 2017, pasada ante la Notaria y Escribana Pública Clara Susana Duarte de Piñeiro, se modificó el Estatuto Social a efectos de elevar el capital social de la Sociedad a la suma de 75.000.000.000 (guaraníes Setenta y cinco mil millones). Fue inscripta en el Registro Público de Comercio bajo N°1, folio 1 de fecha 29 de septiembre del 2007. "]
["Por Acta de Asamblea Extraodinaria N° 44 de fecha 23/09/2020 , la Sociedad ha autorizado el aumento del capital social de G. 75.000.000.000 (guaraníes setenta y cinco millones) a G. 100.000.000.000 (guaraníes cien mil millones), cuyo proceso de inscripción se encuentra en el Registro Público de Comercio."]
[]
["La Sociedad tiene su domicilio legal y asiento del Directorio en la ciudad de Asunción, Capital de la República del Paraguay. "]
[]
["El plazo de duración de la Sociedad será por noventa y nueve (99) años contados a partir de la inscripción en el Registro de Personería Jurídica y Asociaciones, dicho plazo podrá ser prorrogado o suspendido por la Asamblea General Extraordinaria de Accionistas. "]
[]
["La sociedad tiene por OBJETO PRINCIPAL realizar por cuenta propia o de terceros, en su nombre o tercero asociado a tercero, actividades de: REPRESENTACION, IMPORTACION, EXPORTACIÓN, PRESTACION DE SERVICIO, TRANSFORMACIÓN E INDUSTRIALIZACION, DISTRIBUCION, al por mayor y detalle, de productos, artículos y géneros de: ferretería, herramientas y maquinarias, herramientas manuales y electromecánica y eléctricas, de carpintería, para autos mecánica y mecánica en general; caza, pesca y deportes en general; de electricidad; de limpieza y terminación, cepillería y abrasivos; tubos y conexiones; bazar y juguetería en las diferentes clases y modalidades de realización y contratación; y todas de las demás actividades relacionadas, directa o indirectamente con su objetivo principal. "]

{"sheet":"Nota 2","index":6,"n_rows":75,"n_cols":9,"rows_kept":75,"cut":false,"hidden":false,"merged":[[42,0,42,8],[16,0,16,8],[17,0,17,8],[33,0,33,1],[12,0,12,8],[30,0,30,8],[31,2,32,2],[31,3,31,4],[31,5,31,6],[13,0,13,8],[19,0,19,8],[5,0,5,8],[41,0,41,8],[51,0,51,8],[50,0,50,8],[52,0,52,8],[15,0,15,8],[6,0,6,8],[14,0,14,8],[10,0,10,8],[11,0,11,8],[39,0,39,8],[44,0,44,8],[9,0,9,8],[34,0,34,1],[46,0,46,8],[47,0,47,8],[49,0,49,8],[65,0,65,8],[18,0,18,8],[92,5,92,12],[73,0,73,8],[55,0,55,8],[56,0,56,8],[61,0,61,8],[62,0,62,8],[58,0,58,8],[59,0,59,8],[63,0,63,8],[48,0,48,8],[38,0,38,8],[45,0,45,8],[36,0,36,8],[75,0,75,8],[74,0,74,8],[68,0,68,8],[57,0,57,8],[54,0,54,8],[69,0,69,8],[71,0,71,8],[66,0,66,8]]}
["ATLANTIC S.A.E.",null,null,null,null,null,null,null,"BG"]
[]
[]
[]
[]
["NOTA 2 - RESUMEN DE LAS PRINCIPALES POLÍTICAS CONTABLES"]
["Resumen de las principales políticas contables: a modo referencial, se incluyen las siguientes revelaciones de políticas contables en estados financieros de uso general que podrá ser tenida en consideración por las sociedades emisoras para la preparación de este capítulo de los estados financieros:"]
[]
[]
["a.   Bases de contabilización"]
["Los estados financieros se han preparado siguiendo los criterios de las Normas de Información Financiera (NIF) emitidas por el Consejo de Contadores Públicos del Paraguay sobre la base de costos históricos, excepto para el caso de activos y pasivos en moneda extranjera  y las propiedades, planta y equipo según se explica en los puntos c ) y k), y no reconocen en forma integral los efectos de la inflación sobre la situación patrimonial y financiera de la sociedad, sobre los resultados de sus operaciones y los flujos de efectivo, en atención a que la corrección monetaria no constituye una práctica contable obligatoria en el Paraguay. \n"]
["De haberse aplicado una corrección monetaria integral de los estados financieros, podrían haber surgido diferencias en la presentación de la situación patrimonial y financiera de la sociedad, en los resultados de sus operaciones y en los flujos de efectivo al ….., y por los ejercicios cerrados el, 31 de ………. de 20X2 y 20X1. Según el índice general de precios del consumo (IPC) publicado por el Banco Central del Paraguay, la inflación fue de 00,0% en el año 20X2 y 00,0% en el año 20X1. Obs: Datos a incorporar para cierre del ejercicio\n\n"]
["Algunas cifras correspondientes al periodo del 2021 fueron reclasificadas en los presentes estados financieros con el fin de hacerlas comparables con las del periodo actual y adecuarse al nuevo formato de presentación exigido por la Comisión Nacional de Valores."]
[]
["b.   Uso de estimaciones contables"]
["La preparación de los presentes estados financieros requiere que la Gerencia de la sociedad realice estimaciones y evaluaciones que afectan el monto de los activos y pasivos registrados y contingentes, como así también los ingresos y egresos registrados en el ejercicio. Los resultados reales futuros pueden diferir de las estimaciones y evaluaciones realizadas a la fecha de preparación de los presentes estados financieros."]
[]
["c.   Moneda extranjera"]
["Los activos y pasivos en moneda extranjera se valúan a los tipos de cambio vigentes a la fecha de cierre del ejercicio."]
["Las diferencias de cambio originadas por fluctuaciones en los tipos de cambio producidos entre las fechas de concertación de las operaciones y su liquidación o valuación al cierre del ejercicio, son reconocidas en resultados."]
[]
[]
[null,null,{"$f":"IFERROR(IF(Indice!B6=\"\",\"2XX2\",YEAR(Indice!B6)),\"2XX2\")","v":2021},null,null,null,{"$f":"IFERROR(YEAR(Indice!B6-365),\"2XX1\")","v":2020}]
[null,"Indicar moneda","Simbología según ISO 4217","Guaraníes",null,"Indicar moneda","Simbología según ISO 4217","Guaraníes"]
["Activos","USD",null,51485739798.809998,null,"USD",{"$f":"IFERROR(VLOOKUP(F25,'Base de Monedas'!E:F,2,0),\"\")","v":""},24587311757.381199]
[]
["Pasivos","USD",null,-28875770000.322201,null,"USD",null,-23877939605]
[null,"BRL",null,-4585318.5549999997,null,"BRL",null,-5509806]
["Posición neta",null,null,{"$f":"+SUM(D25:D28)","v":22605384479.932796},null,null,null,{"$f":"+SUM(H25:H28)","v":703862346.38119888}]
[]
["El detalle de las cotizaciones de la moneda extranjera operada por la sociedad es el siguiente:"]
[null,null,"Simbología ","2021-09-30",null,"2020-12-31"]
[null,null,null,"ACTIVOS","PASIVOS","ACTIVOS","PASIVOS"]
["Dólar Americano",null,"$",6895.8,6918.66,6891.96,6941.65]
["Real",null,"R$",1264.24,1268.5899999999999,1328.08,1337.84]
[]
["A la fecha de emisión de estos estados financieros, el tipo de cambio de la moneda extranjera………………………..(mencionar la moneda) no/si varió sustancialmente (varió en un 0,00%) con respecto al vigente al …..de…………….20X1"]
[]
["d. Efectivo y equivalentes de efectivo"]
["Se considerarán dentro del concepto los fondos de libre disponibilidad en poder de la Sociedad y en Bancos de plaza, en las modalidades de cuentas corrientes y cajas de ahorros en guaraníes y en moneda extranjera"]
[]
["e. Previsión para cuentas de dudoso cobro/incobrables"]
["Las previsiones para cuentas de dudoso cobro se determinan al cierre de cada ejercicio y/o mensualmente sobre la base del estudio de la cartera de créditos realizado con el objeto de determinar la porción no recuperable de las cuentas a cobrar. La Sociedad constituye previsiones sobre las cuentas de dudoso cobro o de difícil recuperabilidad, teniendo en cuenta el análisis de la Gerencia sobre la antigüedad y cobrabilidad de cada uno de los créditos."]
[]
["Criterio para Previsiones                                                                                                                                                  "]
["1. Clientes que registran atrasos y estan por ser demandados. "]
["2. Clientes que tienen cuentas con otros proveedores y no estan pudiendo pagar."]
["3. Clientes con cheque devueltos."]
["4. Clientes que presentan atrasos normales."]
["6. Clientes que refinancian sus cuentas. "]
[]
["f. Inventarios"]
["Las existencias se valúan al menor entre su costo de adquisición o de producción y su valor neto de realización (NIF 12, párrafo 5). Para determinar el consumo (baja de inventarios) se aplica la fórmula de costeo PPP (Precio Promedio Ponderado)."]
[]
["g. Previsiones para desvalorización y deterioro de inventarios"]
["Las previsiones para desvalorización y deterioro de inventarios han sido estimadas tomando como base la valorización del stock deteriorado existente al cierre del ejercicio."]
[]
["h. Propiedades, planta y equipo"]
["Las propiedades, planta y equipo se exponen a su costo histórico ajustado por el coeficiente de revalúo emitido por la Autoridad Tributaria, menos la correspondiente depreciación acumulada. El incremento neto por la re-expresión se acredita a la respectiva reserva patrimonial, cuyo saldo puede ser utilizado únicamente para  aumentar el capital."]
["El costo de las mejoras que extienden la vida útil de los bienes o aumentan su capacidad productiva es imputado a las cuentas respectivas del activo. Los gastos de mantenimiento son cargados a resultados."]
[]
[]
["i. Intangibles"]
["Los intangibles se exponen a su costo incurrido menos las correspondientes amortizaciones acumuladas al cierre del año."]
[]
["j. Reconocimiento de ingresos y egresos"]
["Los ingresos y egresos son reconocidos en función de su devengamiento."]
[]
["n. Impuesto a la renta"]
["El impuesto a la renta que se carga a los resultados del año se basa en la utilidad contable antes de este concepto, ajustada por las partidas que la ley incluye o excluye para la determinación de la utilidad gravable a la que se aplica la tasa legal vigente del impuesto (10%, Ley 6.380/19) y por el reconocimiento del cargo."]
[]
["o. Restricciones a la distribución de utilidades"]
["A continuación se mencionan las restricciones vigentes a distribución de utilidades:"]
["•  La legislación paraguaya establece una transferencia del 5% de las utilidades del ejercicio para la constitución de una reserva legal hasta completar el 20% del capital integrado."]
["•  Ley Nº 6380/19 dispone aplicar dentro del primer año de vigencia una tasa única y extraordinaria de retención equivalente al 5% de Impuesto a los dividendos (IDU) sobre los importes netos de las utilidades a ser distribuidas. Además, de una retención sujeta a una tasa equivalente al 10% para las utilidades que sean remesadas o acreditadas a beneficiarios radicados en el exterior. "]

{"sheet":"Nota 3","index":7,"n_rows":22,"n_cols":5,"rows_kept":22,"cut":false,"hidden":true,"merged":[]}
["ATLANTIC S.A.E.",null,null,null,"BG"]
[]
[]
[]
[]
[]
["NOTA 3 - EFECTIVO Y EQUIVALENTE DE EFECTIVO"]
["En miles de guaranies"]
[]
["La composición de la cuenta es la siguiente:"]
[]
["Concepto",null,{"$f":"IFERROR(IF(Indice!B6=\"\",\"2XX2\",YEAR(Indice!B6)),\"2XX2\")","v":2021},{"$f":"IFERROR(YEAR(Indice!B6-365),\"2XX1\")","v":2020}]
[]
["Caja -Dólares",null,231126529,356738520]
["Valores a Rendir",null,-15500000,0]
["Bancos Locales - Moneda local Guaraníes",null,2363356532,3023432640]
["Bancos Locales - Moneda extranjera Dólares",null,495000729,870383148]
["Bancos Locales - Moneda extranjera otros",null,0,0]
["Bancos en el Extranjero - Moneda extranjera Dólares",null,0,0]
["Fondo Fijo",null,56894336,65000000]
["Investor Casa de Bolsa M/E Fondo Mutuo",null,14517746082.828001,11124282311]
["Total",null,{"$f":"SUM(C14:C21)","v":17648624208.828003},{"$f":"SUM(D14:D21)","v":15439836619}]

{"sheet":"Nota 4","index":8,"n_rows":18,"n_cols":4,"rows_kept":18,"cut":false,"hidden":true,"merged":[[3,0,3,2],[6,1,6,2]]}
["ATLANTIC S.A.E.",null,null,"BG"]
[]
[]
["NOTA 4 - INVERSIONES TEMPORALES"]
[]
["Al 30 de setiembre de 2021 y 31 de diciembre de 2020 la Sociedad no cuenta con Inversiones Temporales."]
[null,"En miles de guaranies"]
["Concepto",{"$f":"IFERROR(IF(Indice!B6=\"\",\"2XX2\",YEAR(Indice!B6)),\"2XX2\")","v":2021},{"$f":"IFERROR(YEAR(Indice!B6-365),\"2XX1\")","v":2020}]
["Inversiones en Titulos del Sistema Financiero Local - Moneda Local Guaraníes",0,0]
["Inversiones en Titulos del Sistema Financiero Local - Moneda Extranjera Dólares",0,0]
["Inversiones en Titulos del Sistema Financiero Local - Moneda Extranjera otros",0,0]
["Inversiones en Mercado Bursatil Local - Moneda Local Guaraníes",0,0]
["Inversiones en Mercado Bursatil Local - Moneda Extranjera Dólares",0,0]
["Inversiones en Mercado Bursatil Extranjera - Moneda Extranjera Dólares",0,0]
["Inversiones en Mercado Bursatil Extranjera - Moneda Extranjera otros",0,0]
["Otras inversiones - Moneda Local Guaraníes",0,0]
["Otras inversiones - Moneda Extranjera Dólares",0,0]
["Total",{"$f":"SUM($B$9:B17)","v":0},{"$f":"SUM($C$9:C17)","v":0}]

{"sheet":"Nota 5","index":9,"n_rows":54,"n_cols":8,"rows_kept":54,"cut":false,"hidden":true,"merged":[[6,2,6,3],[30,2,30,3],[2,0,2,3]]}
["ATLANTIC S.A.E.",null,null,null,null,"BG"]
[]
["En este rubro se registran los derechos de la Sociedad con los clientes locales, deudores varios y otros. La cuenta \"Valores a vencer\" representa cheques adelantados de los clientes."]
[]
["NOTA  5 – CUENTAS POR COBRAR COMERCIALES"]
["Las cuentas a cobrar comerciales a corto plazo se integran como sigue:"]
[null,null,"En miles de guaraníes"]
[null,null,{"$f":"IFERROR(IF(Indice!B6=\"\",\"2XX2\",YEAR(Indice!B6)),\"2XX2\")","v":2021},{"$f":"IFERROR(YEAR(Indice!B6-365),\"2XX1\")","v":2020},null,"Composición de la cartera de créditos por ventas","2021-09-30"]
["Deudores por ventas locales","Moneda Local Guaraníes",25431734286,22600151790,null,"Situación","Monto","% Previsiones sobre Cartera"]
["Deudores por ventas locales","Moneda Extranjera Dólares",25681723361.798,4227647065.0455999,null,"A  Total Cartera no Vencida",62921462042.082001]
["Deudores por ventas locales","Moneda Extranjera otros",0,0,null,"B. Total Cartera Vencida",{"$f":"+G14+G15","v":1295578966},0.03]
["Deudores por ventas en el exterior","Moneda Local Guaraníes",0,0,null,"Composición Cartera Vencida"]
["Deudores por ventas en el exterior","Moneda Extranjera Dólares",0,0,null,"Normal",0]
["Deudores por ventas en el exterior","Moneda Extranjera otros",0,0,null,"En Gestión de Cobro",506145039,0.03]
["Deudores - Entidad relacionada","Moneda Local Guaraníes",0,15770000,null,"En Gestión de Cobro Judicial",789433927,0.03]
["Deudores - Entidad relacionada","Moneda Extranjera Dólares",1514448562.2840002,2110546482.6348]
["Deudores - Entidad relacionada","Moneda Extranjera otros",0,0,null,"Total de la cartera de créditos (A+B)",{"$f":"+G11+G10","v":64217041008.082001}]
["Cheques adelantados recibidos de clientes","Moneda Local Guaraníes",10001924901.1,9137468541]
["Cheques adelantados recibidos de clientes","Moneda Extranjera Dólares",29207160.900000002,0,null,"(-) Total Previsiones",-1905648459]
["Cheques adelantados recibidos de clientes","Moneda Extranjera otros",0,0]
["Cheques rechazados","Moneda Local Guaraníes",439464446,917167728,null,"TOTAL  NETO DE LA CARTERA DE CRÉDITOS",{"$f":"+G19+G17","v":62311392549.082001}]
["Cheques rechazados","Moneda Extranjera Dólares",66680593,0]
["Valores en Gestión Judicial","Moneda Local Guaraníes",789433927,826244367,null,"Observaciones"]
["Otros","Moneda Extranjera Dólares",0,0,null,"Criterios de Clasificación utilizados","De","A"]
["Valores retenidos","Moneda Local Guaraníes",262423770,219587277,null,"Normal"]
["Menos Previsiones",null,-1905648459,-358698342,null,"En Gestión de Cobro",1,"-"]
["Total",null,{"$f":"SUM(C9:C26)","v":62311392549.082001},{"$f":"SUM(D9:D26)","v":39695884908.680405},null,"En Gestión de Cobro Judicial",1,"-"]
[]
[]
["Las cuentas a cobrar comerciales a largo plazo se integran como sigue:"]
[null,null,"En miles de guaraníes"]
[null,null,{"$f":"IFERROR(IF(Indice!B6=\"\",\"2XX2\",YEAR(Indice!B6)),\"2XX2\")","v":2021},{"$f":"IFERROR(YEAR(Indice!B6-365),\"2XX1\")","v":2020}]
["Deudores por ventas locales","Moneda Local Guaraníes",0,0]
["Deudores por ventas locales","Moneda Extranjera Dólares",0,0]
["Deudores por ventas locales","Moneda Extranjera otros",0,0]
["Deudores por ventas en el exterior","Moneda Local Guaraníes",0,0]
["Deudores por ventas en el exterior","Moneda Extranjera Dólares",0,0]
["Deudores por ventas en el exterior","Moneda Extranjera otros",0,0]
["Deudores - Entidad relacionada","Moneda Local Guaraníes",0,0]
["Deudores - Entidad relacionada","Moneda Extranjera Dólares",0,0]
["Deudores - Entidad relacionada","Moneda Extranjera otros",0,0]
["Cheques adelantados recibidos de clientes","Moneda Local Guaraníes",0,0]
["Cheques adelantados recibidos de clientes","Moneda Extranjera Dólares",0,0]
["Cheques adelantados recibidos de clientes","Moneda Extranjera otros",0,0]
["Deudores en gestión judicial","Moneda Local Guaraníes",0,0]
["Deudores en gestión judicial","Moneda Extranjera Dólares",0,0]
["Deudores en gestión judicial","Moneda Extranjera otros",0,0]
["Cheques rechazados","Moneda Local Guaraníes",0,0]
["Cheques rechazados","Moneda Extranjera Dólares",0,0]
["Otros","Moneda Local Guaraníes",0,0]
["Otros","Moneda Extranjera Dólares",0,0]
["Otros","Moneda Extranjera otros",0,0]
["Menos Previsiones",null,0,0]
["Total",null,{"$f":"+SUM($C$33:C53)","v":0},{"$f":"+SUM($D$33:D53)","v":0}]

{"sheet":"Nota 6","index":10,"n_rows":23,"n_cols":7,"rows_kept":23,"cut":false,"hidden":true,"merged":[[4,0,4,2]]}
["ATLANTIC S.A.E.",null,null,"BG"]
[]
[]
["NOTA 6 - OTROS CRÉDITOS"]
["En miles de guaranies"]
["El rubro de otros créditos se compone como sigue:"]
[]
["Corrientes",null,null,null,"No corrientes"]
[]
["Concepto",{"$f":"IFERROR(IF(Indice!B6=\"\",\"2XX2\",YEAR(Indice!B6)),\"2XX2\")","v":2021},{"$f":"IFERROR(YEAR(Indice!B6-365),\"2XX1\")","v":2020},null,"Concepto",{"$f":"IFERROR(IF(Indice!B6=\"\",\"2XX2\",YEAR(Indice!B6)),\"2XX2\")","v":2021},{"$f":"IFERROR(YEAR(Indice!B6-365),\"2XX1\")","v":2020}]
["Anticipos a proveedores",0,0,null,"Garantía de Alquiler",0,0]
["Gastos pagados por adelantado",661712387,207581624,null,"Anticipos a proveedores ",0,0]
["Anticipo Impuesto a la Renta",515005269,1418273919,null,"Activos restringidos por Embargo Judicial",0,380118966]
["Retención Impuesto a la Renta",562876195,1280673215,null,"Total",{"$f":"+F13","v":0},{"$f":"+G13","v":380118966}]
["Impuesto a la Renta saldo a favor",238570498,0]
["I.V.A. Crédito fiscal",900854413,741472525]
["Anticipo a Empleados",100000,2200000]
["Créditos Varios - IPS Reposo",0,458794]
["Débitos a Regularizar",2165087,3003550]
["Deudores Varios",555081577,547325675]
["Impuesto a Recuperar",42160182,42160182]
["Garantía de alquiler",141756877,116756877]
["Total",{"$f":"SUM(B11:B22)","v":3620282485},{"$f":"SUM(C11:C22)","v":4359906361}]

{"sheet":"Nota 7","index":11,"n_rows":15,"n_cols":4,"rows_kept":15,"cut":false,"hidden":true,"merged":[[6,1,6,2],[5,0,5,6],[3,0,3,2]]}
["ATLANTIC S.A.E.",null,null,"BG"]
[]
[]
["NOTA 7 – INVENTARIOS"]
[]
["Los bienes de cambio están compuestos de la siguiente manera:"]
[null,"En miles de guaranies"]
["Concepto",{"$f":"IFERROR(IF(Indice!B6=\"\",\"2XX2\",YEAR(Indice!B6)),\"2XX2\")","v":2021},{"$f":"IFERROR(YEAR(Indice!B6-365),\"2XX1\")","v":2020}]
["Mercaderías",83733184397,71675838697]
["Productos terminados",0,0]
["Productos en proceso",0,0]
["Materia prima",0,0]
["Importaciones en Curso",8949806780,6433212648]
["(-) Previsión para desvalorización y deterioro de inventario",-815068362,-815068362]
["Total ",{"$f":"+SUM(B9:B14)","v":91867922815},{"$f":"+SUM(C9:C14)","v":77293982983}]

{"sheet":"Nota 8","index":12,"n_rows":20,"n_cols":12,"rows_kept":20,"cut":false,"hidden":true,"merged":[[3,0,3,5]]}
["ATLANTIC S.A.E.",null,null,"BG"]
[]
[]
["Nota 8 - INVERSIONES EN ASOCIADAS"]
["En miles de guaraníes"]
[]
["La Sociedad no cuenta con inversiones en otras entidades al 30 de setiembre de 2021 y 31 de diciembre de 2020."]
[]
["Periodo",{"$f":"IFERROR(IF(Indice!B6=\"\",\"2XX2\",YEAR(Indice!B6)),\"2XX2\")","v":2021},{"$f":"IFERROR(YEAR(Indice!B6-365),\"2XX1\")","v":2020}]
["Total Inversión",{"$f":"SUM($I$15:I20)","v":0},0]
[]
["a) Datos sobre la sociedad:",null,null,null,null,null,"a) Datos sobre la inversión:"]
[null,null,null,{"$f":"IFERROR(IF(Indice!B6=\"\",\"2XX2\",YEAR(Indice!B6)),\"2XX2\")","v":2021}]
["Nombre de Sociedad","RUC","Cantidad de acciones","Total Patrimonio neto","Total del resultado",null,"Cantidad de acciones","Participación sobre los votos (%)","Total Inversión (miles de Gs)","Participación sobre el Patrimonio Neto (%)","Total valuación patrimonial proporcional","Resultado sobre inversiones"]
[0,0,0,0,0,null,0,0,0,0,{"$f":"J15*D15","v":0},{"$f":"J15*E15","v":0}]
[0,0,0,0,0,null,0,0,0,0,{"$f":"J16*D16","v":0},{"$f":"J16*E16","v":0}]
[0,0,0,0,0,null,0,0,0,0,0,0]
[0,0,0,0,0,null,0,0,0,0,0,0]
[0,0,0,0,0,null,0,0,0,0,0,0]
[0,0,0,0,0,null,0,0,0,0,0,0]

{"sheet":"Nota 9","index":13,"n_rows":27,"n_cols":13,"rows_kept":27,"cut":false,"hidden":true,"merged":[[11,0,11,12],[14,11,14,12]]}
["ATLANTIC S.A.E.",null,null,null,null,null,null,null,null,null,null,"BG"]
[]
[]
[]
["Obs.:"]
["Incluir aclaraciones en los siguientes casos:"]
["1.      Cuando los bienes de uso tienen alguna restricción sobre su utilización, como por ejemplo cuando están garantizando obligaciones. En su caso también hacer referencia a la nota correspondiente."]
["2.      Cuando exista alguna previsión por desvalorización (“deterioro”), detallando la evolución de la misma en el transcurso del año."]
["3.      Si se están capitalizando intereses al costo de bienes de uso. En su caso deberá aclararse la tasa utilizada para la capitalización."]
["Ver adicionalmente Norma de Información Financiera N° 11 Propiedades, planta y equipo"]
[]
["NOTA 9 - PROPIEDADES, PLANTA Y EQUIPO - NETO"]
["En miles de guaraníes",null,null,null,null,null,null,null,null,-1]
[]
[null,"Costo histórico revaluado al inicio del año","Adquisiciones","Bajas","Revalúo del año","Valor de origen revaluado al final del año","Depreciación acumulada revaluada al inicio del año","Depreciación del año","Bajas de depreciaciones acumuladas","Revalúo depreciación acumulada del año","Depreciación acumulada revaluada al final del año","Valor neto contable"]
[null,null,null,null,null,null,null,null,null,null,null,{"$f":"IFERROR(IF(Indice!B6=\"\",\"2XX2\",YEAR(Indice!B6)),\"2XX2\")","v":2021},{"$f":"IFERROR(YEAR(Indice!B6-365),\"2XX1\")","v":2020}]
["Instalaciones",57963300,0,0,0,{"$f":"+B17+C17-D17+E17","v":57963300},-44545,-3477798,0,0,{"$f":"+H17+G17","v":-3522343},{"$f":"+SUM(K17+F17)","v":54440957},57918755]
["Rodados",441293864,0,0,0,441293864,-432232463,0,0,0,{"$f":"+H18+G18","v":-432232463},{"$f":"+SUM(K18+F18)","v":9061401},9061401]
["Equipos de computación",706003595,129189285,0,0,835192880,-360176655,-134090529,0,0,-494267184,340925696,345826940]
["Muebles y útiles",3329937189,12822316,0,0,3342759505,-1042350246,-299341458,0,0,-1341691704,2001067801,2287586943]
["Equipos de comunicación",0,0,0,0,0,0,0,0,0,0,0,0]
["Maquinarias y herramientas",213183550,296031007,0,0,509214557,-100003902,-21948617,0,0,-121952519,387262038,113179648]
["Obras en curso",0,7286188054,0,0,7286188054,0,0,0,0,0,7286188054,0]
["Edificios",16409098437,146898150,0,0,16555996587,-1791646084,-422386649,0,0,-2214032733,14341963854,14617452353]
["Inmuebles",32670295678,4418894684,13334761487,0,23754428875,0,0,0,0,0,23754428875,32670295678]
["Mejoras en Propiedad de Terceros",726653634,2118182,0,0,{"$f":"+B26+C26-D26+E26","v":728771816},-258625493,-90904876,0,0,-349530369,379241447,468028141]
["Totales",{"$f":"+SUM(B17:B26)","v":54554429247},12292141678,13334761487,0,53511809438,-3985079388,-972149927,0,0,-4957229315,{"$f":"+SUM(L17:L26)","v":48554580123},{"$f":"+SUM(M17:M26)","v":50569349859}]

{"sheet":"Nota 10","index":14,"n_rows":21,"n_cols":3,"rows_kept":21,"cut":false,"hidden":true,"merged":[[4,1,4,2],[11,16120,11,16125],[11,16126,11,16131],[11,16132,11,16137],[11,16138,11,16143],[11,16144,11,16149],[11,16150,11,16155],[11,16084,11,16089],[11,16090,11,16095],[11,16096,11,16101],[11,16102,11,16107],[11,16108,11,16113],[11,16114,11,16119],[11,16048,11,16053],[11,16054,11,16059],[11,16060,11,16065],[11,16066,11,16071],[11,16072,11,16077],[11,16078,11,16083],[11,16012,11,16017],[11,16018,11,16023],[11,16024,11,16029],[11,16030,11,16035],[11,16036,11,16041],[11,16042,11,16047],[11,15976,11,15981],[11,16372,11,16377],[11,16378,11,16381],[11,16336,11,16341],[11,16342,11,16347],[11,16348,11,16353],[11,16354,11,16359],[11,16360,11,16365],[11,16366,11,16371],[11,16300,11,16305],[11,16306,11,16311],[11,16312,11,16317],[11,16318,11,16323],[11,16324,11,16329],[11,16330,11,16335],[11,16264,11,16269],[11,16270,11,16275],[11,16276,11,16281],[11,16282,11,16287],[11,16288,11,16293],[11,16294,11,16299],[11,16228,11,16233],[11,16234,11,16239],[11,16240,11,16245],[11,16246,11,16251],[11,16252,11,16257],[11,16258,11,16263],[11,16192,11,16197],[11,16198,11,16203],[11,16204,11,16209],[11,16210,11,16215],[11,16216,11,16221],[11,16222,11,16227],[11,16156,11,16161],[11,16162,11,16167],[11,16168,11,16173],[11,16174,11,16179],[11,16180,11,16185],[11,16186,11,16191],[11,15982,11,15987],[11,15988,11,15993],[11,15994,11,15999],[11,16000,11,16005],[11,16006,11,16011],[11,15940,11,15945],[11,15946,11,15951],[11,15952,11,15957],[11,15958,11,15963],[11,15964,11,15969],[11,15970,11,15975],[11,15904,11,15909],[11,15910,11,15915],[11,15916,11,15921],[11,15922,11,15927],[11,15928,11,15933],[11,15934,11,15939],[11,15868,11,15873],[11,15874,11,15879],[11,15880,11,15885],[11,15886,11,15891],[11,15892,11,15897],[11,15898,11,15903],[11,15832,11,15837],[11,15838,11,15843],[11,15844,11,15849],[11,15850,11,15855],[11,15856,11,15861],[11,15862,11,15867],[11,15796,11,15801],[11,15802,11,15807],[11,15808,11,15813],[11,15814,11,15819],[11,15820,11,15825],[11,15826,11,15831],[11,15760,11,15765],[11,15766,11,15771],[11,15772,11,15777],[11,15778,11,15783],[11,15784,11,15789],[11,15790,11,15795],[11,15724,11,15729],[11,15730,11,15735],[11,15736,11,15741],[11,15742,11,15747],[11,15748,11,15753],[11,15754,11,15759],[11,15688,11,15693],[11,15694,11,15699],[11,15700,11,15705],[11,15706,11,15711],[11,15712,11,15717],[11,15718,11,15723],[11,15652,11,15657],[11,15658,11,15663],[11,15664,11,15669],[11,15670,11,15675],[11,15676,11,15681],[11,15682,11,15687],[11,15616,11,15621],[11,15622,11,15627],[11,15628,11,15633],[11,15634,11,15639],[11,15640,11,15645],[11,15646,11,15651],[11,15580,11,15585],[11,15586,11,15591],[11,15592,11,15597],[11,15598,11,15603],[11,15604,11,15609],[11,15610,11,15615],[11,15544,11,15549],[11,15550,11,15555],[11,15556,11,15561],[11,15562,11,15567],[11,15568,11,15573],[11,15574,11,15579],[11,15508,11,15513],[11,15514,11,15519],[11,15520,11,15525],[11,15526,11,15531],[11,15532,11,15537],[11,15538,11,15543],[11,15472,11,15477],[11,15478,11,15483],[11,15484,11,15489],[11,15490,11,15495],[11,15496,11,15501],[11,15502,11,15507],[11,15436,11,15441],[11,15442,11,15447],[11,15448,11,15453],[11,15454,11,15459],[11,15460,11,15465],[11,15466,11,15471],[11,15400,11,15405],[11,15406,11,15411],[11,15412,11,15417],[11,15418,11,15423],[11,15424,11,15429],[11,15430,11,15435],[11,15364,11,15369],[11,15370,11,15375],[11,15376,11,15381],[11,15382,11,15387],[11,15388,11,15393],[11,15394,11,15399],[11,15328,11,15333],[11,15334,11,15339],[11,15340,11,15345],[11,15346,11,15351],[11,15352,11,15357],[11,15358,11,15363],[11,15292,11,15297],[11,15298,11,15303],[11,15304,11,15309],[11,15310,11,15315],[11,15316,11,15321],[11,15322,11,15327],[11,15256,11,15261],[11,15262,11,15267],[11,15268,11,15273],[11,15274,11,15279],[11,15280,11,15285],[11,15286,11,15291],[11,15220,11,15225],[11,15226,11,15231],[11,15232,11,15237],[11,15238,11,15243],[11,15244,11,15249],[11,15250,11,15255],[11,15184,11,15189],[11,15190,11,15195],[11,15196,11,15201],[11,15202,11,15207],[11,15208,11,15213],[11,15214,11,15219],[11,15148,11,15153],[11,15154,11,15159],[11,15160,11,15165],[11,15166,11,15171],[11,15172,11,15177],[11,15178,11,15183],[11,15112,11,15117],[11,15118,11,15123],[11,15124,11,15129],[11,15130,11,15135],[11,15136,11,15141],[11,15142,11,15147],[11,15076,11,15081],[11,15082,11,15087],[11,15088,11,15093],[11,15094,11,15099],[11,15100,11,15105],[11,15106,11,15111],[11,15040,11,15045],[11,15046,11,15051],[11,15052,11,15057],[11,15058,11,15063],[11,15064,11,15069],[11,15070,11,15075],[11,15004,11,15009],[11,15010,11,15015],[11,15016,11,15021],[11,15022,11,15027],[11,15028,11,15033],[11,15034,11,15039],[11,14968,11,14973],[11,14974,11,14979],[11,14980,11,14985],[11,14986,11,14991],[11,14992,11,14997],[11,14998,11,15003],[11,14932,11,14937],[11,14938,11,14943],[11,14944,11,14949],[11,14950,11,14955],[11,14956,11,14961],[11,14962,11,14967],[11,14896,11,14901],[11,14902,11,14907],[11,14908,11,14913],[11,14914,11,14919],[11,14920,11,14925],[11,14926,11,14931],[11,14860,11,14865],[11,14866,11,14871],[11,14872,11,14877],[11,14878,11,14883],[11,14884,11,14889],[11,14890,11,14895],[11,14824,11,14829],[11,14830,11,14835],[11,14836,11,14841],[11,14842,11,14847],[11,14848,11,14853],[11,14854,11,14859],[11,14788,11,14793],[11,14794,11,14799],[11,14800,11,14805],[11,14806,11,14811],[11,14812,11,14817],[11,14818,11,14823],[11,14752,11,14757],[11,14758,11,14763],[11,14764,11,14769],[11,14770,11,14775],[11,14776,11,14781],[11,14782,11,14787],[11,14716,11,14721],[11,14722,11,14727],[11,14728,11,14733],[11,14734,11,14739],[11,14740,11,14745],[11,14746,11,14751],[11,14680,11,14685],[11,14686,11,14691],[11,14692,11,14697],[11,14698,11,14703],[11,14704,11,14709],[11,14710,11,14715],[11,14644,11,14649],[11,14650,11,14655],[11,14656,11,14661],[11,14662,11,14667],[11,14668,11,14673],[11,14674,11,14679],[11,14608,11,14613],[11,14614,11,14619],[11,14620,11,14625],[11,14626,11,14631],[11,14632,11,14637],[11,14638,11,14643],[11,14572,11,14577],[11,14578,11,14583],[11,14584,11,14589],[11,14590,11,14595],[11,14596,11,14601],[11,14602,11,14607],[11,14536,11,14541],[11,14542,11,14547],[11,14548,11,14553],[11,14554,11,14559],[11,14560,11,14565],[11,14566,11,14571],[11,14500,11,14505],[11,14506,11,14511],[11,14512,11,14517],[11,14518,11,14523],[11,14524,11,14529],[11,14530,11,14535],[11,14464,11,14469],[11,14470,11,14475],[11,14476,11,14481],[11,14482,11,14487],[11,14488,11,14493],[11,14494,11,14499],[11,14428,11,14433],[11,14434,11,14439],[11,14440,11,14445],[11,14446,11,14451],[11,14452,11,14457],[11,14458,11,14463],[11,14392,11,14397],[11,14398,11,14403],[11,14404,11,14409],[11,14410,11,14415],[11,14416,11,14421],[11,14422,11,14427],[11,14356,11,14361],[11,14362,11,14367],[11,14368,11,14373],[11,14374,11,14379],[11,14380,11,14385],[11,14386,11,14391],[11,14320,11,14325],[11,14326,11,14331],[11,14332,11,14337],[11,14338,11,14343],[11,14344,11,14349],[11,14350,11,14355],[11,14284,11,14289],[11,14290,11,14295],[11,14296,11,14301],[11,14302,11,14307],[11,14308,11,14313],[11,14314,11,14319],[11,14248,11,14253],[11,14254,11,14259],[11,14260,11,14265],[11,14266,11,14271],[11,14272,11,14277],[11,14278,11,14283],[11,14212,11,14217],[11,14218,11,14223],[11,14224,11,14229],[11,14230,11,14235],[11,14236,11,14241],[11,14242,11,14247],[11,14176,11,14181],[11,14182,11,14187],[11,14188,11,14193],[11,14194,11,14199],[11,14200,11,14205],[11,14206,11,14211],[11,14140,11,14145],[11,14146,11,14151],[11,14152,11,14157],[11,14158,11,14163],[11,14164,11,14169],[11,14170,11,14175],[11,14104,11,14109],[11,14110,11,14115],[11,14116,11,14121],[11,14122,11,14127],[11,14128,11,14133],[11,14134,11,14139],[11,14068,11,14073],[11,14074,11,14079],[11,14080,11,14085],[11,14086,11,14091],[11,14092,11,14097],[11,14098,11,14103],[11,14032,11,14037],[11,14038,11,14043],[11,14044,11,14049],[11,14050,11,14055],[11,14056,11,14061],[11,14062,11,14067],[11,13996,11,14001],[11,14002,11,14007],[11,14008,11,14013],[11,14014,11,14019],[11,14020,11,14025],[11,14026,11,14031],[11,13960,11,13965],[11,13966,11,13971],[11,13972,11,13977],[11,13978,11,13983],[11,13984,11,13989],[11,13990,11,13995],[11,13924,11,13929],[11,13930,11,13935],[11,13936,11,13941],[11,13942,11,13947],[11,13948,11,13953],[11,13954,11,13959],[11,13888,11,13893],[11,13894,11,13899],[11,13900,11,13905],[11,13906,11,13911],[11,13912,11,13917],[11,13918,11,13923],[11,13852,11,13857],[11,13858,11,13863],[11,13864,11,13869],[11,13870,11,13875],[11,13876,11,13881],[11,13882,11,13887],[11,13816,11,13821],[11,13822,11,13827],[11,13828,11,13833],[11,13834,11,13839],[11,13840,11,13845],[11,13846,11,13851],[11,13780,11,13785],[11,13786,11,13791],[11,13792,11,13797],[11,13798,11,13803],[11,13804,11,13809],[11,13810,11,13815],[11,13744,11,13749],[11,13750,11,13755],[11,13756,11,13761],[11,13762,11,13767],[11,13768,11,13773],[11,13774,11,13779],[11,13708,11,13713],[11,13714,11,13719],[11,13720,11,13725],[11,13726,11,13731],[11,13732,11,13737],[11,13738,11,13743],[11,13672,11,13677],[11,13678,11,13683],[11,13684,11,13689],[11,13690,11,13695],[11,13696,11,13701],[11,13702,11,13707],[11,13636,11,13641],[11,13642,11,13647],[11,13648,11,13653],[11,13654,11,13659],[11,13660,11,13665],[11,13666,11,13671],[11,13600,11,13605],[11,13606,11,13611],[11,13612,11,13617],[11,13618,11,13623],[11,13624,11,13629],[11,13630,11,13635],[11,13564,11,13569],[11,13570,11,13575],[11,13576,11,13581],[11,13582,11,13587],[11,13588,11,13593],[11,13594,11,13599],[11,13528,11,13533],[11,13534,11,13539],[11,13540,11,13545],[11,13546,11,13551],[11,13552,11,13557],[11,13558,11,13563],[11,13492,11,13497],[11,13498,11,13503],[11,13504,11,13509],[11,13510,11,13515],[11,13516,11,13521],[11,13522,11,13527],[11,13456,11,13461],[11,13462,11,13467],[11,13468,11,13473],[11,13474,11,13479],[11,13480,11,13485],[11,13486,11,13491],[11,13420,11,13425],[11,13426,11,13431],[11,13432,11,13437],[11,13438,11,13443],[11,13444,11,13449],[11,13450,11,13455],[11,13384,11,13389],[11,13390,11,13395],[11,13396,11,13401],[11,13402,11,13407],[11,13408,11,13413],[11,13414,11,13419],[11,13348,11,13353],[11,13354,11,13359],[11,13360,11,13365],[11,13366,11,13371],[11,13372,11,13377],[11,13378,11,13383],[11,13312,11,13317],[11,13318,11,13323],[11,13324,11,13329],[11,13330,11,13335],[11,13336,11,13341],[11,13342,11,13347],[11,13276,11,13281],[11,13282,11,13287],[11,13288,11,13293],[11,13294,11,13299],[11,13300,11,13305],[11,13306,11,13311],[11,13240,11,13245],[11,13246,11,13251],[11,13252,11,13257],[11,13258,11,13263],[11,13264,11,13269],[11,13270,11,13275],[11,13204,11,13209],[11,13210,11,13215],[11,13216,11,13221],[11,13222,11,13227],[11,13228,11,13233],[11,13234,11,13239],[11,13168,11,13173],[11,13174,11,13179],[11,13180,11,13185],[11,13186,11,13191],[11,13192,11,13197],[11,13198,11,13203],[11,13132,11,13137],[11,13138,11,13143],[11,13144,11,13149],[11,13150,11,13155],[11,13156,11,13161],[11,13162,11,13167],[11,13096,11,13101],[11,13102,11,13107],[11,13108,11,13113],[11,13114,11,13119],[11,13120,11,13125],[11,13126,11,13131],[11,13060,11,13065],[11,13066,11,13071],[11,13072,11,13077],[11,13078,11,13083],[11,13084,11,13089],[11,13090,11,13095],[11,13024,11,13029],[11,13030,11,13035],[11,13036,11,13041],[11,13042,11,13047],[11,13048,11,13053],[11,13054,11,13059],[11,12988,11,12993],[11,12994,11,12999],[11,13000,11,13005],[11,13006,11,13011],[11,13012,11,13017],[11,13018,11,13023],[11,12952,11,12957],[11,12958,11,12963],[11,12964,11,12969],[11,12970,11,12975],[11,12976,11,12981],[11,12982,11,12987],[11,12916,11,12921],[11,12922,11,12927],[11,12928,11,12933],[11,12934,11,12939],[11,12940,11,12945],[11,12946,11,12951],[11,12880,11,12885],[11,12886,11,12891],[11,12892,11,12897],[11,12898,11,12903],[11,12904,11,12909],[11,12910,11,12915],[11,12844,11,12849],[11,12850,11,12855],[11,12856,11,12861],[11,12862,11,12867],[11,12868,11,12873],[11,12874,11,12879],[11,12808,11,12813],[11,12814,11,12819],[11,12820,11,12825],[11,12826,11,12831],[11,12832,11,12837],[11,12838,11,12843],[11,12772,11,12777],[11,12778,11,12783],[11,12784,11,12789],[11,12790,11,12795],[11,12796,11,12801],[11,12802,11,12807],[11,12736,11,12741],[11,12742,11,12747],[11,12748,11,12753],[11,12754,11,12759],[11,12760,11,12765],[11,12766,11,12771],[11,12700,11,12705],[11,12706,11,12711],[11,12712,11,12717],[11,12718,11,12723],[11,12724,11,12729],[11,12730,11,12735],[11,12664,11,12669],[11,12670,11,12675],[11,12676,11,12681],[11,12682,11,12687],[11,12688,11,12693],[11,12694,11,12699],[11,12628,11,12633],[11,12634,11,12639],[11,12640,11,12645],[11,12646,11,12651],[11,12652,11,12657],[11,12658,11,12663],[11,12592,11,12597],[11,12598,11,12603],[11,12604,11,12609],[11,12610,11,12615],[11,12616,11,12621],[11,12622,11,12627],[11,12556,11,12561],[11,12562,11,12567],[11,12568,11,12573],[11,12574,11,12579],[11,12580,11,12585],[11,12586,11,12591],[11,12520,11,12525],[11,12526,11,12531],[11,12532,11,12537],[11,12538,11,12543],[11,12544,11,12549],[11,12550,11,12555],[11,12484,11,12489],[11,12490,11,12495],[11,12496,11,12501],[11,12502,11,12507],[11,12508,11,12513],[11,12514,11,12519],[11,12448,11,12453],[11,12454,11,12459],[11,12460,11,12465],[11,12466,11,12471],[11,12472,11,12477],[11,12478,11,12483],[11,12412,11,12417],[11,12418,11,12423],[11,12424,11,12429],[11,12430,11,12435],[11,12436,11,12441],[11,12442,11,12447],[11,12376,11,12381],[11,12382,11,12387],[11,12388,11,12393],[11,12394,11,12399],[11,12400,11,12405],[11,12406,11,12411],[11,12340,11,12345],[11,12346,11,12351],[11,12352,11,12357],[11,12358,11,12363],[11,12364,11,12369],[11,12370,11,12375],[11,12304,11,12309],[11,12310,11,12315],[11,12316,11,12321],[11,12322,11,12327],[11,12328,11,12333],[11,12334,11,12339],[11,12268,11,12273],[11,12274,11,12279],[11,12280,11,12285],[11,12286,11,12291],[11,12292,11,12297],[11,12298,11,12303],[11,12232,11,12237],[11,12238,11,12243],[11,12244,11,12249],[11,12250,11,12255],[11,12256,11,12261],[11,12262,11,12267],[11,12196,11,12201],[11,12202,11,12207],[11,12208,11,12213],[11,12214,11,12219],[11,12220,11,12225],[11,12226,11,12231],[11,12160,11,12165],[11,12166,11,12171],[11,12172,11,12177],[11,12178,11,12183],[11,12184,11,12189],[11,12190,11,12195],[11,12124,11,12129],[11,12130,11,12135],[11,12136,11,12141],[11,12142,11,12147],[11,12148,11,12153],[11,12154,11,12159],[11,12088,11,12093],[11,12094,11,12099],[11,12100,11,12105],[11,12106,11,12111],[11,12112,11,12117],[11,12118,11,12123],[11,12052,11,12057],[11,12058,11,12063],[11,12064,11,12069],[11,12070,11,12075],[11,12076,11,12081],[11,12082,11,12087],[11,12016,11,12021],[11,12022,11,12027],[11,12028,11,12033],[11,12034,11,12039],[11,12040,11,12045],[11,12046,11,12051],[11,11980,11,11985],[11,11986,11,11991],[11,11992,11,11997],[11,11998,11,12003],[11,12004,11,12009],[11,12010,11,12015],[11,11944,11,11949],[11,11950,11,11955],[11,11956,11,11961],[11,11962,11,11967],[11,11968,11,11973],[11,11974,11,11979],[11,11908,11,11913],[11,11914,11,11919],[11,11920,11,11925],[11,11926,11,11931],[11,11932,11,11937],[11,11938,11,11943],[11,11872,11,11877],[11,11878,11,11883],[11,11884,11,11889],[11,11890,11,11895],[11,11896,11,11901],[11,11902,11,11907],[11,11836,11,11841],[11,11842,11,11847],[11,11848,11,11853],[11,11854,11,11859],[11,11860,11,11865],[11,11866,11,11871],[11,11800,11,11805],[11,11806,11,11811],[11,11812,11,11817],[11,11818,11,11823],[11,11824,11,11829],[11,11830,11,11835],[11,11764,11,11769],[11,11770,11,11775],[11,11776,11,11781],[11,11782,11,11787],[11,11788,11,11793],[11,11794,11,11799],[11,11728,11,11733],[11,11734,11,11739],[11,11740,11,11745],[11,11746,11,11751],[11,11752,11,11757],[11,11758,11,11763],[11,11692,11,11697],[11,11698,11,11703],[11,11704,11,11709],[11,11710,11,11715],[11,11716,11,11721],[11,11722,11,11727],[11,11656,11,11661],[11,11662,11,11667],[11,11668,11,11673],[11,11674,11,11679],[11,11680,11,11685],[11,11686,11,11691],[11,11620,11,11625],[11,11626,11,11631],[11,11632,11,11637],[11,11638,11,11643],[11,11644,11,11649],[11,11650,11,11655],[11,11584,11,11589],[11,11590,11,11595],[11,11596,11,11601],[11,11602,11,11607],[11,11608,11,11613],[11,11614,11,11619],[11,11548,11,11553],[11,11554,11,11559],[11,11560,11,11565],[11,11566,11,11571],[11,11572,11,11577],[11,11578,11,11583],[11,11512,11,11517],[11,11518,11,11523],[11,11524,11,11529],[11,11530,11,11535],[11,11536,11,11541],[11,11542,11,11547],[11,11476,11,11481],[11,11482,11,11487],[11,11488,11,11493],[11,11494,11,11499],[11,11500,11,11505],[11,11506,11,11511],[11,11440,11,11445],[11,11446,11,11451],[11,11452,11,11457],[11,11458,11,11463],[11,11464,11,11469],[11,11470,11,11475],[11,11404,11,11409],[11,11410,11,11415],[11,11416,11,11421],[11,11422,11,11427],[11,11428,11,11433],[11,11434,11,11439],[11,11368,11,11373],[11,11374,11,11379],[11,11380,11,11385],[11,11386,11,11391],[11,11392,11,11397],[11,11398,11,11403],[11,11332,11,11337],[11,11338,11,11343],[11,11344,11,11349],[11,11350,11,11355],[11,11356,11,11361],[11,11362,11,11367],[11,11296,11,11301],[11,11302,11,11307],[11,11308,11,11313],[11,11314,11,11319],[11,11320,11,11325],[11,11326,11,11331],[11,11260,11,11265],[11,11266,11,11271],[11,11272,11,11277],[11,11278,11,11283],[11,11284,11,11289],[11,11290,11,11295],[11,11224,11,11229],[11,11230,11,11235],[11,11236,11,11241],[11,11242,11,11247],[11,11248,11,11253],[11,11254,11,11259],[11,11188,11,11193],[11,11194,11,11199],[11,11200,11,11205],[11,11206,11,11211],[11,11212,11,11217],[11,11218,11,11223],[11,11152,11,11157],[11,11158,11,11163],[11,11164,11,11169],[11,11170,11,11175],[11,11176,11,11181],[11,11182,11,11187],[11,11116,11,11121],[11,11122,11,11127],[11,11128,11,11133],[11,11134,11,11139],[11,11140,11,11145],[11,11146,11,11151],[11,11080,11,11085],[11,11086,11,11091],[11,11092,11,11097],[11,11098,11,11103],[11,11104,11,11109],[11,11110,11,11115],[11,11044,11,11049],[11,11050,11,11055],[11,11056,11,11061],[11,11062,11,11067],[11,11068,11,11073],[11,11074,11,11079],[11,11008,11,11013],[11,11014,11,11019],[11,11020,11,11025],[11,11026,11,11031],[11,11032,11,11037],[11,11038,11,11043],[11,10972,11,10977],[11,10978,11,10983],[11,10984,11,10989],[11,10990,11,10995],[11,10996,11,11001],[11,11002,11,11007],[11,10936,11,10941],[11,10942,11,10947],[11,10948,11,10953],[11,10954,11,10959],[11,10960,11,10965],[11,10966,11,10971],[11,10900,11,10905],[11,10906,11,10911],[11,10912,11,10917],[11,10918,11,10923],[11,10924,11,10929],[11,10930,11,10935],[11,10864,11,10869],[11,10870,11,10875],[11,10876,11,10881],[11,10882,11,10887],[11,10888,11,10893],[11,10894,11,10899],[11,10828,11,10833],[11,10834,11,10839],[11,10840,11,10845],[11,10846,11,10851],[11,10852,11,10857],[11,10858,11,10863],[11,10792,11,10797],[11,10798,11,10803],[11,10804,11,10809],[11,10810,11,10815],[11,10816,11,10821],[11,10822,11,10827],[11,10756,11,10761],[11,10762,11,10767],[11,10768,11,10773],[11,10774,11,10779],[11,10780,11,10785],[11,10786,11,10791],[11,10720,11,10725],[11,10726,11,10731],[11,10732,11,10737],[11,10738,11,10743],[11,10744,11,10749],[11,10750,11,10755],[11,10684,11,10689],[11,10690,11,10695],[11,10696,11,10701],[11,10702,11,10707],[11,10708,11,10713],[11,10714,11,10719],[11,10648,11,10653],[11,10654,11,10659],[11,10660,11,10665],[11,10666,11,10671],[11,10672,11,10677],[11,10678,11,10683],[11,10612,11,10617],[11,10618,11,10623],[11,10624,11,10629],[11,10630,11,10635],[11,10636,11,10641],[11,10642,11,10647],[11,10576,11,10581],[11,10582,11,10587],[11,10588,11,10593],[11,10594,11,10599],[11,10600,11,10605],[11,10606,11,10611],[11,10540,11,10545],[11,10546,11,10551],[11,10552,11,10557],[11,10558,11,10563],[11,10564,11,10569],[11,10570,11,10575],[11,10504,11,10509],[11,10510,11,10515],[11,10516,11,10521],[11,10522,11,10527],[11,10528,11,10533],[11,10534,11,10539],[11,10468,11,10473],[11,10474,11,10479],[11,10480,11,10485],[11,10486,11,10491],[11,10492,11,10497],[11,10498,11,10503],[11,10432,11,10437],[11,10438,11,10443],[11,10444,11,10449],[11,10450,11,10455],[11,10456,11,10461],[11,10462,11,10467],[11,10396,11,10401],[11,10402,11,10407],[11,10408,11,10413],[11,10414,11,10419],[11,10420,11,10425],[11,10426,11,10431],[11,10360,11,10365]],"merged_total":13651,"flags":["merged_cut"]}
["ATLANTIC S.A.E.",null,"BG"]
[]
[]
["NOTA 10 – ACTIVOS DISPONIBLES PARA LA VENTA"]
[null,"En miles de guaranies"]
[null,{"$f":"IFERROR(IF(Indice!B6=\"\",\"2XX2\",YEAR(Indice!B6)),\"2XX2\")","v":2021},{"$f":"IFERROR(YEAR(Indice!B6-365),\"2XX1\")","v":2020}]
["Propiedad, planta y equipo"]
["(Detallar bienes de uso)",0,0]
["Total",{"$f":"B8","v":0},{"$f":"C8","v":0}]
[]
["Activos intangibles"]
["(Detallar activos intangibles)",0,0]
["Total",{"$f":"B12","v":0},{"$f":"C12","v":0}]
[]
["Inversiones"]
["(Detallar Inversiones",0,0]
["Total",{"$f":"B16","v":0},{"$f":"C16","v":0}]
[]
["Total general",{"$f":"B9+B13+B17","v":0},{"$f":"C9+C13+C17","v":0}]
[]
["La Sociedad no cuenta con Activos Disponibles para la Venta a la fecha de los presentes estados financieros."]

{"sheet":"Nota 11","index":15,"n_rows":10,"n_cols":6,"rows_kept":10,"cut":false,"hidden":true,"merged":[[3,0,3,3],[4,1,4,2]]}
["ATLANTIC S.A.E.",null,null,null,null,"BG"]
[]
[]
["NOTA 11 – ACTIVOS INTANGIBLES"]
[null,"En miles de guaranies"]
["Activos intangibles",2021,2020]
["Licencia Software ",1097793941,1074915291]
["Llave de Negocio",107603046,107603046]
["Menos amortización acumulada",-2978197,-859849]
["Total general",{"$f":"+SUM(B7:B9)","v":1202418790},{"$f":"+SUM(C7:C9)","v":1181658488}]

{"sheet":"Nota 12","index":16,"n_rows":11,"n_cols":5,"rows_kept":11,"cut":false,"hidden":true,"merged":[[5,1,5,2],[8,0,8,2]]}
["ATLANTIC S.A.E.",null,null,null,"BG"]
[]
[]
[]
["NOTA 12 – GOODWILL"]
[null,"En miles de guaranies"]
["Goodwill",{"$f":"IFERROR(IF(Indice!B6=\"\",\"2XX2\",YEAR(Indice!B6)),\"2XX2\")","v":2021},{"$f":"IFERROR(YEAR(Indice!B6-365),\"2XX1\")","v":2020}]
[]
["La Sociedad no cuenta con Goodwill registrado a la fecha de los estados financieros."]
[]
["Total general",0,0]

{"sheet":"Nota 13","index":17,"n_rows":25,"n_cols":5,"rows_kept":25,"cut":false,"hidden":true,"merged":[]}
["ATLANTIC S.A.E.",null,"BG"]
[]
[]
["NOTA 13 – CUENTAS POR PAGAR COMERCIALES"]
["En miles de guaranies"]
["Las cuentas por pagar comerciales se componen como sigue:"]
[]
["Corrientes","Simbología según ISO 4217","Indicación de Moneda",{"$f":"IFERROR(IF(Indice!B6=\"\",\"2XX2\",YEAR(Indice!B6)),\"2XX2\")","v":2021},{"$f":"IFERROR(YEAR(Indice!B6-365),\"2XX1\")","v":2020}]
["Proveedores - Entidades Relacionadas","PYG",{"$f":"IFERROR(VLOOKUP(B9,'Base de Monedas'!A:B,2,0),\"\")","v":"Guaraní"},12192792,686400]
["Proveedores - Entidades Relacionadas","USD",{"$f":"IFERROR(VLOOKUP(B10,'Base de Monedas'!A:B,2,0),\"\")","v":"Dólar estadounidense"},148116541.31819999,17290887]
["Otros proveedores del exterior","PYG",{"$f":"IFERROR(VLOOKUP(B11,'Base de Monedas'!A:B,2,0),\"\")","v":"Guaraní"},2312152,0]
["Otros proveedores del exterior","USD",{"$f":"IFERROR(VLOOKUP(B12,'Base de Monedas'!A:B,2,0),\"\")","v":"Dólar estadounidense"},27774926184.2598,23860648718]
["Proveedores locales","PYG",{"$f":"IFERROR(VLOOKUP(B13,'Base de Monedas'!A:B,2,0),\"\")","v":"Guaraní"},2320177858,2210831070]
["Proveedores locales","BRL",{"$f":"IFERROR(VLOOKUP(B14,'Base de Monedas'!A:B,2,0),\"\")","v":"Real brasileño"},4585318.5549999997,5509806]
["Proveedores locales","USD",{"$f":"IFERROR(VLOOKUP(B15,'Base de Monedas'!A:B,2,0),\"\")","v":"Dólar estadounidense"},952727274.74419999,1136654712]
["Total cuentas a pagar por comerciales",null,null,{"$f":"+SUM(D9:D15)","v":31215038120.877201},{"$f":"+SUM(E9:E15)","v":27231621593}]
[]
[]
[]
["No Corrientes","Simbología según ISO 4217","Indicación de Moneda",{"$f":"IFERROR(YEAR(Indice!B6),\"2XX2\")","v":2021},{"$f":"IFERROR(YEAR(Indice!B6-365),\"2XX1\")","v":2020}]
["Proveedores - Entidades Relacionadas",null,{"$f":"IFERROR(VLOOKUP(B21,'Base de Monedas'!A:B,2,0),\"\")","v":""},0,0]
["Otros proveedores del exterior",null,{"$f":"IFERROR(VLOOKUP(B22,'Base de Monedas'!A:B,2,0),\"\")","v":""},0,0]
["Proveedores locales",null,{"$f":"IFERROR(VLOOKUP(B23,'Base de Monedas'!A:B,2,0),\"\")","v":""},0,0]
["(nuevas cuentas a incluir)",null,{"$f":"IFERROR(VLOOKUP(B24,'Base de Monedas'!A:B,2,0),\"\")","v":""},0,0]
["Total cuentas a pagar por comerciales",null,null,{"$f":"SUM($D$21:D24)","v":0},{"$f":"SUM($D$21:E24)","v":0}]

{"sheet":"Nota 14","index":18,"n_rows":55,"n_cols":12,"rows_kept":55,"cut":false,"hidden":true,"merged":[]}
["ATLANTIC S.A.E.",null,null,null,"BG",null,null,null,null,null,null,"BG"]
[]
[]
["NOTA 14 –  PRESTAMOS A CORTO Y LARGO PLAZO"]
["En miles de guaranies"]
["(a) Equivalentes al tipo de cambio referencial de la fecha de presentacion"]
["(b) Obligaciones garantizadas por valor de guaraníes……….."]
[]
["Corrientes"]
[null,null,null,{"$f":"IFERROR(IF(Indice!B6=\"\",\"2XX2\",YEAR(Indice!B6)),\"2XX2\")","v":2021},null,null,null,null,null,{"$f":"IFERROR(YEAR(Indice!B6-365),\"2XX1\")","v":2020}]
["Préstamos de Entidades Locales","Vencimiento","Símbolo de Moneda","Moneda","Importe (miles de Gs)","Tipo de Garantía",null,"Vencimiento","Símbolo de Moneda","Moneda","Importe (miles de Gs)","Tipo de Garantía"]
["Nombre de la entidad financiera",null,null,{"$f":"IFERROR(VLOOKUP(C12,'Base de Monedas'!A:B,2,0),\"\")","v":""},0,null,null,null,null,{"$f":"IFERROR(VLOOKUP(I12,'Base de Monedas'!A:B,2,0),\"\")","v":""},0]
["Nombre de la entidad financiera",null,null,{"$f":"IFERROR(VLOOKUP(C13,'Base de Monedas'!A:B,2,0),\"\")","v":""},0,null,null,null,null,{"$f":"IFERROR(VLOOKUP(I13,'Base de Monedas'!A:B,2,0),\"\")","v":""},0]
["(incluir otras entidades)",null,null,{"$f":"IFERROR(VLOOKUP(C14,'Base de Monedas'!A:B,2,0),\"\")","v":""},0,null,null,null,null,{"$f":"IFERROR(VLOOKUP(I14,'Base de Monedas'!A:B,2,0),\"\")","v":""},0]
["Deudas bursátiles",null,null,{"$f":"IFERROR(VLOOKUP(C15,'Base de Monedas'!A:B,2,0),\"\")","v":""}]
["Programa Global-G3- Serie 1","2022-10-28","PYG",{"$f":"IFERROR(VLOOKUP(C16,'Base de Monedas'!A:B,2,0),\"\")","v":"Guaraní"},2500000000,"A sola firma",null,"2022-10-28","PYG",{"$f":"IFERROR(VLOOKUP(I16,'Base de Monedas'!A:B,2,0),\"\")","v":"Guaraní"},2500000000,"A sola firma"]
["Préstamos de Entidades en el Exterior",null,null,{"$f":"IFERROR(VLOOKUP(C17,'Base de Monedas'!A:B,2,0),\"\")","v":""},null,null,null,null,null,{"$f":"IFERROR(VLOOKUP(I17,'Base de Monedas'!A:B,2,0),\"\")","v":""}]
["Nombre de la entidad financiera",null,null,{"$f":"IFERROR(VLOOKUP(C18,'Base de Monedas'!A:B,2,0),\"\")","v":""},0,null,null,null,null,{"$f":"IFERROR(VLOOKUP(I18,'Base de Monedas'!A:B,2,0),\"\")","v":""},0]
["Nombre de la entidad financiera",null,null,{"$f":"IFERROR(VLOOKUP(C19,'Base de Monedas'!A:B,2,0),\"\")","v":""},0,null,null,null,null,{"$f":"IFERROR(VLOOKUP(I19,'Base de Monedas'!A:B,2,0),\"\")","v":""},0]
["(incluir otras entidades)",null,null,{"$f":"IFERROR(VLOOKUP(C20,'Base de Monedas'!A:B,2,0),\"\")","v":""},null,null,null,null,null,{"$f":"IFERROR(VLOOKUP(I20,'Base de Monedas'!A:B,2,0),\"\")","v":""}]
["Deudas bursátiles",null,null,{"$f":"IFERROR(VLOOKUP(C21,'Base de Monedas'!A:B,2,0),\"\")","v":""},0,null,null,null,null,{"$f":"IFERROR(VLOOKUP(I21,'Base de Monedas'!A:B,2,0),\"\")","v":""},0]
["(Incluir programas de forma individual)",null,null,{"$f":"IFERROR(VLOOKUP(C22,'Base de Monedas'!A:B,2,0),\"\")","v":""},null,null,null,null,null,{"$f":"IFERROR(VLOOKUP(I22,'Base de Monedas'!A:B,2,0),\"\")","v":""}]
["Intereses préstamos entidades financieras a pagar",null,null,{"$f":"IFERROR(VLOOKUP(C23,'Base de Monedas'!A:B,2,0),\"\")","v":""},null,null,null,null,null,{"$f":"IFERROR(VLOOKUP(I23,'Base de Monedas'!A:B,2,0),\"\")","v":""}]
["Intereses a pagar",null,null,{"$f":"IFERROR(VLOOKUP(C24,'Base de Monedas'!A:B,2,0),\"\")","v":""},0,null,null,null,null,{"$f":"IFERROR(VLOOKUP(I24,'Base de Monedas'!A:B,2,0),\"\")","v":""},0]
["(-) Intereses a Devengar",null,null,null,0,null,null,null,null,null,0]
["Intereses deudas bursátiles a pagar",null,null,{"$f":"IFERROR(VLOOKUP(C26,'Base de Monedas'!A:B,2,0),\"\")","v":""}]
["Intereses a pagar",null,"PYG",{"$f":"IFERROR(VLOOKUP(C27,'Base de Monedas'!A:B,2,0),\"\")","v":"Guaraní"},1788294521,null,null,null,"PYG","Guaraní",1965476027]
["(-) Intereses a Devengar",null,"PYG",{"$f":"IFERROR(VLOOKUP(C28,'Base de Monedas'!A:B,2,0),\"\")","v":"Guaraní"},-1783126714,null,null,null,"PYG","Guaraní",-1959722604]
["Total",null,null,{"$f":"IFERROR(VLOOKUP(C29,'Base de Monedas'!A:B,2,0),\"\")","v":""},{"$f":"SUM(E10:E28)","v":2505167807},null,null,null,null,null,{"$f":"SUM(K10:K28)","v":2505753423}]
[]
[]
["No Corrientes"]
[null,null,null,{"$f":"IFERROR(YEAR(Indice!B6),\"2XX2\")","v":2021},null,null,null,null,null,{"$f":"IFERROR(YEAR(Indice!B6-365),\"2XX1\")","v":2020}]
["Préstamos de Entidades Locales","Vencimiento","Símbolo de Moneda","Moneda","Importe (miles de Gs)","Tipo de garantía",null,"Vencimiento","Símbolo de Moneda","Moneda","Importe (miles de Gs)","Tipo de Garantía"]
["Nombre de la entidad financiera",null,null,{"$f":"IFERROR(VLOOKUP(C35,'Base de Monedas'!A:B,2,0),\"\")","v":""},null,null,null,null,null,{"$f":"IFERROR(VLOOKUP(I35,'Base de Monedas'!A:B,2,0),\"\")","v":""}]
["Nombre de la entidad financiera",null,null,{"$f":"IFERROR(VLOOKUP(C36,'Base de Monedas'!A:B,2,0),\"\")","v":""},null,null,null,null,null,{"$f":"IFERROR(VLOOKUP(I36,'Base de Monedas'!A:B,2,0),\"\")","v":""}]
["(incluir otras entidades)",null,null,{"$f":"IFERROR(VLOOKUP(C37,'Base de Monedas'!A:B,2,0),\"\")","v":""},null,null,null,null,null,{"$f":"IFERROR(VLOOKUP(I37,'Base de Monedas'!A:B,2,0),\"\")","v":""}]
["Deudas bursátiles",null,null,{"$f":"IFERROR(VLOOKUP(C38,'Base de Monedas'!A:B,2,0),\"\")","v":""},null,null,null,null,null,{"$f":"IFERROR(VLOOKUP(I38,'Base de Monedas'!A:B,2,0),\"\")","v":""}]
["Programa Global-G3- Serie 1","2022-10-28","PYG",{"$f":"IFERROR(VLOOKUP(C39,'Base de Monedas'!A:B,2,0),\"\")","v":"Guaraní"},250000000,"A sola firma",null,"2022-10-28","PYG",{"$f":"IFERROR(VLOOKUP(I39,'Base de Monedas'!A:B,2,0),\"\")","v":"Guaraní"},2500000000,"A sola firma"]
["Programa Global-G3- Serie 2","2024-10-25","PYG",{"$f":"IFERROR(VLOOKUP(C40,'Base de Monedas'!A:B,2,0),\"\")","v":"Guaraní"},5000000000,"A sola firma",null,"2024-10-25","PYG",{"$f":"IFERROR(VLOOKUP(I40,'Base de Monedas'!A:B,2,0),\"\")","v":"Guaraní"},5000000000,"A sola firma"]
["Programa Global-G3- Serie 3","2027-10-22","PYG",{"$f":"IFERROR(VLOOKUP(C41,'Base de Monedas'!A:B,2,0),\"\")","v":"Guaraní"},7500000000,"A sola firma",null,"2027-10-22","PYG",{"$f":"IFERROR(VLOOKUP(I41,'Base de Monedas'!A:B,2,0),\"\")","v":"Guaraní"},7500000000,"A sola firma"]
["Préstamos de Entidades en el Exterior",null,null,{"$f":"IFERROR(VLOOKUP(C42,'Base de Monedas'!A:B,2,0),\"\")","v":""},null,null,null,null,null,{"$f":"IFERROR(VLOOKUP(I42,'Base de Monedas'!A:B,2,0),\"\")","v":""}]
["Nombre de la entidad financiera",null,null,{"$f":"IFERROR(VLOOKUP(C43,'Base de Monedas'!A:B,2,0),\"\")","v":""},0,null,null,null,null,{"$f":"IFERROR(VLOOKUP(I43,'Base de Monedas'!A:B,2,0),\"\")","v":""},0]
["Nombre de la entidad financiera",null,null,{"$f":"IFERROR(VLOOKUP(C44,'Base de Monedas'!A:B,2,0),\"\")","v":""},0,null,null,null,null,{"$f":"IFERROR(VLOOKUP(I44,'Base de Monedas'!A:B,2,0),\"\")","v":""},0]
["(incluir otras entidades)",null,null,{"$f":"IFERROR(VLOOKUP(C45,'Base de Monedas'!A:B,2,0),\"\")","v":""},null,null,null,null,null,{"$f":"IFERROR(VLOOKUP(I45,'Base de Monedas'!A:B,2,0),\"\")","v":""}]
["Deudas bursátiles",null,null,{"$f":"IFERROR(VLOOKUP(C46,'Base de Monedas'!A:B,2,0),\"\")","v":""},0,null,null,null,null,{"$f":"IFERROR(VLOOKUP(I46,'Base de Monedas'!A:B,2,0),\"\")","v":""},0]
["(Incluir programas de forma individual)",null,null,{"$f":"IFERROR(VLOOKUP(C47,'Base de Monedas'!A:B,2,0),\"\")","v":""},null,null,null,null,null,{"$f":"IFERROR(VLOOKUP(I47,'Base de Monedas'!A:B,2,0),\"\")","v":""}]
["Intereses préstamos entidades financieras a pagar",null,null,{"$f":"IFERROR(VLOOKUP(C48,'Base de Monedas'!A:B,2,0),\"\")","v":""},null,null,null,null,null,{"$f":"IFERROR(VLOOKUP(I48,'Base de Monedas'!A:B,2,0),\"\")","v":""}]
["Intereses a pagar",null,null,{"$f":"IFERROR(VLOOKUP(C49,'Base de Monedas'!A:B,2,0),\"\")","v":""},0,null,null,null,null,{"$f":"IFERROR(VLOOKUP(I49,'Base de Monedas'!A:B,2,0),\"\")","v":""},0]
["(-) Intereses a Devengar",null,null,null,0,null,null,null,null,null,0]
["Intereses deudas bursátiles a pagar",null,null,{"$f":"IFERROR(VLOOKUP(C51,'Base de Monedas'!A:B,2,0),\"\")","v":""},null,null,null,null,null,{"$f":"IFERROR(VLOOKUP(I51,'Base de Monedas'!A:B,2,0),\"\")","v":""}]
["Intereses a pagar",null,"PYG",{"$f":"IFERROR(VLOOKUP(C52,'Base de Monedas'!A:B,2,0),\"\")","v":"Guaraní"},4577773974,null,null,null,"PYG","Guaraní",5899767125]
["(-) Intereses a Devengar",null,"PYG",{"$f":"IFERROR(VLOOKUP(C53,'Base de Monedas'!A:B,2,0),\"\")","v":"Guaraní"},-4577773974,null,null,null,"PYG","Guaraní",-5899767125]
["Total",null,null,{"$f":"IFERROR(VLOOKUP(C54,'Base de Monedas'!A:B,2,0),\"\")","v":""},{"$f":"SUM(E35:E53)","v":12750000000},null,null,null,null,"",{"$f":"SUM(K35:K53)","v":15000000000}]
[null,null,null,null,null,null,null,null,null,{"$f":"IFERROR(VLOOKUP(I55,'Base de Monedas'!H:I,2,0),\"\")","v":""}]

{"sheet":"Nota 15","index":19,"n_rows":15,"n_cols":4,"rows_kept":15,"cut":false,"hidden":true,"merged":[[6,1,6,2]]}
["ATLANTIC S.A.E.",null,null,"BG"]
[]
[]
[]
["NOTA 15 – PORCION CORRIENTE DE LA DEUDA A LARGO PLAZO"]
[]
[null,"En miles de guaranies"]
["Porción corriente de la deuda a largo plazo",{"$f":"IFERROR(IF(Indice!B6=\"\",\"2XX2\",YEAR(Indice!B6)),\"2XX2\")","v":2021},{"$f":"IFERROR(YEAR(Indice!B6-365),\"2XX1\")","v":2020}]
["Cuentas por pagar comerciales",0,0]
["Préstamos bancarios",0,0]
["Bonos bursátiles",0,0]
["Intereses bancarios a pagar",0,0]
["Intereses bursatiles a pagar",0,0]
[{"$f":"+'Nota 14'!A53","v":"(-) Intereses a Devengar"},0,0]
["Total general",{"$f":"SUM($B$9:B14)","v":0},{"$f":"SUM($C$9:C14)","v":0}]

{"sheet":"Nota 16","index":20,"n_rows":12,"n_cols":6,"rows_kept":12,"cut":false,"hidden":true,"merged":[[5,1,5,2]]}
["ATLANTIC S.A.E.",null,null,null,null,"BG"]
[]
[]
["NOTA 16 – REMUNERACIONES Y CARGAS SOCIALES A PAGAR"]
[]
[null,"En miles de guaranies"]
["Remuneraciones y cargas sociales a pagar",{"$f":"IFERROR(IF(Indice!B6=\"\",\"2XX2\",YEAR(Indice!B6)),\"2XX2\")","v":2021},{"$f":"IFERROR(YEAR(Indice!B6-365),\"2XX1\")","v":2020}]
["Sueldo y otras remuneraciones a pagar",61169720,42482247]
["Aportes y retenciones a pagar",244897416,222829950]
["Remuneraciones al personal superior a pagar",0,0]
["Aguinaldos a Pagar",1191771437,0]
["Total",{"$f":"+SUM(B8:B11)","v":1497838573},{"$f":"+SUM(C8:C11)","v":265312197}]

{"sheet":"Nota 17","index":21,"n_rows":12,"n_cols":7,"rows_kept":12,"cut":false,"hidden":true,"merged":[[6,1,6,2]]}
["ATLANTIC S.A.E.",null,null,null,null,null,"BG"]
[]
[]
[]
["NOTA 17 –  IMPUESTOS A PAGAR"]
[]
[null,"En miles de guaranies"]
["Impuestos a pagar",{"$f":"IFERROR(IF(Indice!B6=\"\",\"2XX2\",YEAR(Indice!B6)),\"2XX2\")","v":2021},{"$f":"IFERROR(YEAR(Indice!B6-365),\"2XX1\")","v":2020}]
["Impuesto a la renta a pagar",4930007014,2460376636]
["Otros impuestos a pagar",0,0]
[]
["Total",{"$f":"+B10+B9","v":4930007014},{"$f":"+C10+C9","v":2460376636}]

{"sheet":"Nota 18","index":22,"n_rows":13,"n_cols":4,"rows_kept":13,"cut":false,"hidden":true,"merged":[[3,0,3,3],[6,0,7,0],[5,1,5,2]]}
["ATLANTIC S.A.E.",null,null,"BG"]
[]
[]
["NOTA 18 -  PROVISIONES"]
[]
[null,"En miles de guaranies"]
["Provisiones",{"$f":"IFERROR(IF(Indice!B6=\"\",\"2XX2\",YEAR(Indice!B6)),\"2XX2\")","v":2021},{"$f":"IFERROR(YEAR(Indice!B6-365),\"2XX1\")","v":2020}]
[]
["Alquileres a Pagar",0,0]
["Servicios Basicos a Pagar",0,0]
["Honorarios Profesionales a Pagar",0,0]
["(Indicar cuentas)",0,0]
["Total",{"$f":"SUM($B$9:B12)","v":0},{"$f":"SUM($C$9:C12)","v":0}]

{"sheet":"Nota 19","index":23,"n_rows":19,"n_cols":7,"rows_kept":19,"cut":false,"hidden":true,"merged":[[3,0,3,2]]}
["ATLANTIC S.A.E.",null,null,"BG"]
[]
["NOTA 19 – OTROS PASIVOS CORRIENTES y NO CORRIENTES"]
["En miles de guaranies"]
[]
["Corrientes",{"$f":"IFERROR(IF(Indice!B6=\"\",\"2XX2\",YEAR(Indice!B6)),\"2XX2\")","v":2021},{"$f":"IFERROR(YEAR(Indice!B6-365),\"2XX1\")","v":2020},null,"No Corrientes",{"$f":"IFERROR(IF(Indice!B6=\"\",\"2XX2\",YEAR(Indice!B6)),\"2XX2\")","v":2021},{"$f":"IFERROR(YEAR(Indice!B6-365),\"2XX1\")","v":2020}]
["Retencion de IVA a pagar",230949743,0,null,"Retencion de IVA a pagar",0,0]
["Retencion Impuesto a la renta a Pagar",50922534,142633739,null,"Retencion Impuesto a la renta a Pagar",0,0]
["Impuestos diferidos",0,0,null,"Impuestos diferidos",0,0]
["Otros ingresos diferidos (detallar cuenta)",0,0,null,"Otros ingresos diferidos",0,0]
["Otros Pasivos con Entidades relacionadas ",0,0,null,"Otros Pasivos con Entidades relacionadas ",0,0]
["Previsiones para contingencias/Indemnizaciones y despidos",0,0,null,"Previsiones para contingencias/Indemnizaciones y despidos",0,0]
["Anticipos de Clientes ",0,704553077,null,"(nuevas cuentas a incluir)"]
["Anticipos de clientes M.E",110907013,10355172398,null,"Total ",{"$f":"SUM(F7:F13)","v":0},{"$f":"SUM(G7:G13)","v":0}]
["Créditos a Regularizar",7425688,16203330]
["Revalorizacion Otros Pasivos",0,-96576355]
["Cheques Emitidos",1344791939,1703829626]
[]
["Total ",{"$f":"+SUM(B7:B17)","v":1744996917},{"$f":"+SUM(C7:C17)","v":12825815815}]

{"sheet":"Nota 20","index":24,"n_rows":11,"n_cols":4,"rows_kept":11,"cut":false,"hidden":true,"merged":[[3,0,3,3]]}
["ATLANTIC S.A.E.",null,null,"BG"]
[]
[]
["NOTA 20 – CAPITAL INTEGRADO"]
[]
["Fecha",{"$f":"IFERROR(IF(Indice!B6=\"\",\"2XX2\",YEAR(Indice!B6)),\"2XX2\")","v":2021},{"$f":"IFERROR(YEAR(Indice!B6-365),\"2XX1\")","v":2020}]
["Monto Capital Social",100000000000,100000000000]
["Monto Capital Integrado",89040000000,89040000000]
["Cantidad de Acciones",100000,100000]
["Valor Nominal de Acciones",1000000,1000000]
["Total",{"$f":"+B8","v":89040000000},{"$f":"+C8","v":89040000000}]

{"sheet":" Nota 21","index":25,"n_rows":22,"n_cols":6,"rows_kept":22,"cut":false,"hidden":false,"merged":[[3,0,3,5],[5,1,5,2]]}
["ATLANTIC S.A.E.",null,null,null,null,"BG"]
[]
[]
["NOTA 21 – RESERVAS"]
[]
[null,"En miles de guaranies"]
[null,{"$f":"IFERROR(IF(Indice!B6=\"\",\"2XX2\",YEAR(Indice!B6)),\"2XX2\")","v":2021},{"$f":"IFERROR(YEAR(Indice!B6-365),\"2XX1\")","v":2020}]
["a  Reserva de revalúo",19301479530,19301479530]
[]
[]
[]
["b Reserva legal",9789783914,9237272666]
[]
[]
[]
["c Reservas estatutarias"]
[]
[]
[]
["d Reservas facultativas",10500595077,2881363]
["d.1. (nuevas cuentas a incluir)"]
["d.2. (nuevas cuentas a incluir)"]

{"sheet":"Nota 22","index":26,"n_rows":10,"n_cols":6,"rows_kept":10,"cut":false,"hidden":false,"merged":[[5,1,5,2]]}
["ATLANTIC S.A.E.",null,null,null,null,"BG"]
[]
[]
["NOTA 21 –  DIFERENCIA TRANSITORIA POR CONVERSION"]
[]
[null,"En miles de guaranies"]
[null,{"$f":"IFERROR(IF(Indice!B6=\"\",\"2XX2\",YEAR(Indice!B6)),\"2XX2\")","v":2021},{"$f":"+IFERROR(YEAR(Indice!B6-365),\"2XX1\")","v":2020}]
["Diferencia transitoria por conversión"]
[]
["No aplicable a la Sociedad."]

{"sheet":"Nota 23","index":27,"n_rows":12,"n_cols":6,"rows_kept":12,"cut":false,"hidden":false,"merged":[[5,1,5,2]]}
["ATLANTIC S.A.E.",null,null,null,null,"BG"]
[]
[]
["NOTA 23 –  RESULTADOS ACUMULADOS"]
[]
[null,"En miles de guaranies"]
[null,{"$f":"IFERROR(IF(Indice!B6=\"\",\"2XX2\",YEAR(Indice!B6)),\"2XX2\")","v":2021},{"$f":"+IFERROR(YEAR(Indice!B6-365),\"2XX1\")","v":2020}]
["Resultado de ejercicios anteriores",0,0]
["Resultado del ejercicio actual",41930314018,11050224962]
["Totales",{"$f":"+B9+B8","v":41930314018},{"$f":"+C9+C8","v":11050224962}]
[]
["La Sociedad adopta como política dar destino a su utilidad del ejercicio anterior, posterior a la realización de la Asamblea General Ordinaria."]

{"sheet":"Nota 24","index":28,"n_rows":10,"n_cols":6,"rows_kept":10,"cut":false,"hidden":false,"merged":[[5,1,5,2]]}
["ATLANTIC S.A.E.",null,null,null,null,"BG"]
[]
[]
["NOTA 24 –  INTERES MINORITARIO"]
[]
[null,"En miles de guaranies"]
[null,{"$f":"IFERROR(IF(Indice!B6=\"\",\"2XX2\",YEAR(Indice!B6)),\"2XX2\")","v":2021},{"$f":"+IFERROR(YEAR(Indice!B6-365),\"2XX1\")","v":2020}]
["Interes Minoritario"]
[]
["No aplicable a la Sociedad."]

{"sheet":"Nota 25","index":29,"n_rows":26,"n_cols":5,"rows_kept":26,"cut":false,"hidden":false,"merged":[[7,1,7,2]]}
["ATLANTIC S.A.E.",null,null,null,"ER"]
[]
[]
[]
["NOTA 25 –  VENTAS"]
[]
[]
[null,"En miles de guaranies"]
[null,{"$f":"IFERROR(IF(Indice!B6=\"\",\"2XX2\",YEAR(Indice!B6)),\"2XX2\")","v":2021},{"$f":"+IFERROR(YEAR(Indice!B6-365),\"2XX1\")","v":2020}]
["Ventas"]
["Ventas linea de negocio 1"]
["Local",{"$f":"+B13+B14","v":184723638112},156194556543]
["Contado",28906892456,0]
["Crédito",{"$f":"190282422850-34465677194","v":155816745656},0]
["Exterior",0,0]
["Contado",0,0]
["Crédito",0,0]
["Ventas linea de negocio 2"]
["Local",0,0]
["Contado",0,0]
["Crédito",0,0]
["Exterior",0,0]
["Contado",0,0]
["Crédito",0,0]
["(nuevas lineas de negocio a incluir)"]
["Total",{"$f":"+B12","v":184723638112},{"$f":"+C12","v":156194556543}]

{"sheet":"Nota 26","index":30,"n_rows":21,"n_cols":5,"rows_kept":21,"cut":false,"hidden":false,"merged":[[4,0,4,5],[6,1,6,2],[7,1,7,2]]}
["ATLANTIC S.A.E.",null,null,null,"ER"]
[]
[]
[]
["NOTA 26 - COSTO DE VENTAS"]
[]
[]
[null,"Miles de guaraníes"]
["Costo de ventas",{"$f":"IFERROR(IF(Indice!B6=\"\",\"2XX2\",YEAR(Indice!B6)),\"2XX2\")","v":2021},{"$f":"+IFERROR(YEAR(Indice!B6-365),\"2XX1\")","v":2020}]
["Linea de negocio 1"]
["Existencia inicial del inventario",71675838697,69022171199]
["+ Compra de bienes y servicios",156619104833,117063648998]
["+ Costo de producción",0,0]
["- Existencia final de inventario",-83733184397,-62547557587]
["Linea de negocio 2"]
["Existencia inicial del inventario"]
["+ Compra de bienes y servicios"]
["+ Costo de producción"]
["- Existencia final de inventario"]
["(nuevas lineas de negocio a incluir)"]
["Total costo de ventas",{"$f":"SUM(B11:B20)","v":144561759133},{"$f":"SUM(C11:C20)","v":123538262610}]

{"sheet":"Nota 27","index":31,"n_rows":30,"n_cols":7,"rows_kept":30,"cut":false,"hidden":false,"merged":[[5,0,5,7],[10,0,11,0]]}
["ATLANTIC S.A.E.",null,null,null,null,null,"ER"]
[]
[]
[]
["NOTA 27 - GASTOS"]
["(Esta nota deberá ser incluida cuando en el estado de resultados se haga mención a una cuenta de carácter general o cuyo nombre no permita una adecuada identificación de la naturaleza del gasto y su importe sea significativo) "]
[]
["El rubro está compuesto de la siguiente forma: "]
[]
["Miles de guaraníes"]
[null,null,{"$f":"IFERROR(IF(Indice!B6=\"\",\"2XX2\",YEAR(Indice!B6)),\"2XX2\")","v":2021},null,null,{"$f":"+IFERROR(YEAR(Indice!B6-365),\"2XX1\")","v":2020}]
[null,"Gastos de Ventas","Gastos Administrativos","Total","Gastos de Ventas","Gastos Administrativos","Total"]
["Movilidad y viáticos",262100814,1974488,{"$f":"+C13+B13","v":264075302},26861482,224459919,{"$f":"+F13+E13","v":251321401}]
["Gastos de alquiler",0,1386864593,1386864593,0,1042340352,1042340352]
["Computación y redes",606482475,336273922,942756397,387792123,871784620,1259576743]
["Impuestos y tasas",20041237,753039172,773080409,18604517,404143844,422748361]
["Gastos de reparación y mantenimiento",52734348,299495210,352229558,8596939,245977529,254574468]
["Seguros pagados",18830778,17958767,36789545,14256597,18817182,33073779]
["Gastos de Rodados",467103486,34378972,501482458,5128671,557751489,562880160]
["Remuneraciones de administradores, directores, síndicos y consejo de vigilancia",0,2612241673,2612241673,0,2487591370,2487591370]
["Sueldos y Jornales",3188788647,2043475332,5232263979,2809099485,3861140371,6670239856]
["Contribuciones Sociales",789989225,426046917,1216036142,460031376,604658356,1064689732]
["Regalías y Honorarios por servicios técnicos",3265890688,8974163912,12240054600,3823147799,1861107934,5684255733]
["Gastos de Publicidad y Propaganda",673519402,9653231,683172633,658148329,3352429,661500758]
["Intereses a bancos e instituciones financieras",0,1498589041,1498589041,0,253410823,253410823]
["Depreciación bienes de uso",189506847,782643080,972149927,156731782,717690843,874422625]
["Servicios básicos",58834618,196209163,255043781,38897182,194373013,233270195]
["Donaciones",1515247,736287682,737802929,25535100,451312955,476848055]
["Otros gastos",{"$f":"783492408+41813183+580","v":825306171},{"$f":"859316688","v":859316688},1684622859,{"$f":"1623204678","v":1623204678},1849445452,{"$f":"+F29+E29","v":3472650130}]
["Total",{"$f":"SUM(B13:B29)","v":10420643983},20968611843,31389255826,10056036060,15649358481,25705394541]

{"sheet":"Nota 28","index":32,"n_rows":16,"n_cols":7,"rows_kept":16,"cut":false,"hidden":false,"merged":[[3,0,3,4],[5,1,5,2]]}
["ATLANTIC S.A.E.",null,null,null,"ER"]
[]
[]
["Nota 28 - Otros Ingresos y gastos operativos"]
[]
["Miles de guaraníes"]
[]
["Otros ingresos",{"$f":"IFERROR(IF(Indice!B6=\"\",\"2XX2\",YEAR(Indice!B6)),\"2XX2\")","v":2021},{"$f":"+IFERROR(YEAR(Indice!B6-365),\"2XX1\")","v":2020},null,"Otros gastos",{"$f":"IFERROR(IF(Indice!B6=\"\",\"2XX2\",YEAR(Indice!B6)),\"2XX2\")","v":2021},{"$f":"+IFERROR(YEAR(Indice!B6-365),\"2XX1\")","v":2020}]
[]
["Ingresos Varios",406305971,534885820,null,"Egresos no operativos",899340524,0]
["Ingresos por Ventas Varias",{"$f":"9792369831+36784386-242735650","v":9586418567},1002873279]
["Gastos Recuperados",47425184,23173364]
["Ingresos por Flete",6639434,4852372]
["Descuentos Obtenidos",972535442,583148494]
["Utilidad por Venta de Activo",31087742479,0]
["Total",{"$f":"SUM(B10:B15)","v":42107067077},{"$f":"+SUM(C10:C15)","v":2148933329},null,"Total",{"$f":"+SUM(F10:F14)","v":899340524},{"$f":"+SUM(G10:G14)","v":0}]

{"sheet":"Nota 29","index":33,"n_rows":15,"n_cols":7,"rows_kept":15,"cut":false,"hidden":false,"merged":[]}
["ATLANTIC S.A.E.",null,null,null,"ER"]
[]
[]
[]
["NOTA 29 - INGRESOS Y GASTOS FINANCIEROS NETOS"]
["Miles de guaraníes"]
[]
["Ingresos Financieros netos",{"$f":"IFERROR(IF(Indice!B6=\"\",\"2XX2\",YEAR(Indice!B6)),\"2XX2\")","v":2021},{"$f":"+IFERROR(YEAR(Indice!B6-365),\"2XX1\")","v":2020},null,"Gastos Financieros netos",{"$f":"IFERROR(IF(Indice!B6=\"\",\"2XX2\",YEAR(Indice!B6)),\"2XX2\")","v":2021},{"$f":"+IFERROR(YEAR(Indice!B6-365),\"2XX1\")","v":2020}]
[]
["Intereses Cobrados Por C/A",280335712,1557394,null,"Intereses Pagados ",1498589041,0]
["Diferencias de Cambios",0,0,null,"Comisión y Gastos Financieros",10615976,0]
["Recupero por Incobrable",41818182,null,null,"Creditos Liquidados por Incobrables",1595975690,0]
["INTERESES FINANCIEROS",5581,null,null,"Diferencia de Cambios",337007442,287915803]
[null,null,null,null,"Total gastos financieros",{"$f":"SUM(F10:F13)","v":3442188149},287915803]
["Total ingresos financieros",{"$f":"SUM(B10:B14)","v":322159475},1557394]

{"sheet":"Nota 30","index":34,"n_rows":16,"n_cols":5,"rows_kept":16,"cut":false,"hidden":false,"merged":[[5,1,5,2]]}
["ATLANTIC S.A.E.",null,null,null,"ER"]
[]
[]
["Nota 34 - Resultado de inversiones en asociadas"]
["Miles de guaraníes"]
[]
[]
["Resultado de inversiones en asociadas",{"$f":"IFERROR(IF(Indice!B6=\"\",\"2XX2\",YEAR(Indice!B6)),\"2XX2\")","v":2021},{"$f":"+IFERROR(YEAR(Indice!B6-365),\"2XX1\")","v":2020}]
[]
["No aplicable a la Sociedad"]
[]
[]
[]
[]
[]
["Total",{"$f":"SUM($B9:B15)","v":0},{"$f":"SUM($C9:C15)","v":0}]

{"sheet":"Nota 31","index":35,"n_rows":16,"n_cols":5,"rows_kept":16,"cut":false,"hidden":false,"merged":[[4,0,4,1],[5,1,5,2]]}
["ATLANTIC S.A.E.",null,null,null,"ER"]
[]
[]
["Nota 31 - Resultado participación minoritaria"]
["Miles de guaraníes"]
[]
[]
["Resultado participación minoritaria",{"$f":"IFERROR(IF(Indice!B6=\"\",\"2XX2\",YEAR(Indice!B6)),\"2XX2\")","v":2021},{"$f":"+IFERROR(YEAR(Indice!B6-365),\"2XX1\")","v":2020}]
[]
["No aplicable a la Sociedad"]
[]
[]
[]
[]
[]
["Total",{"$f":"SUM($B9:B15)","v":0},{"$f":"SUM($C9:C15)","v":0}]

{"sheet":"Nota 32","index":36,"n_rows":14,"n_cols":5,"rows_kept":14,"cut":false,"hidden":false,"merged":[[5,1,5,2]]}
["ATLANTIC S.A.E.",null,null,null,"ER"]
[]
[]
["Nota 32 - IMPUESTO A LA RENTA"]
["En miles de guaraníes"]
[]
[null,{"$f":"IFERROR(IF(Indice!B6=\"\",\"2XX2\",YEAR(Indice!B6)),\"2XX2\")","v":2021},{"$f":"+IFERROR(YEAR(Indice!B6-365),\"2XX1\")","v":2020}]
["Impuesto a la renta",4930007014,883352598]
[]
[]
[]
[]
[]
["Total",{"$f":"+B8","v":4930007014},{"$f":"+C8","v":883352598}]

{"sheet":"Nota 33","index":37,"n_rows":15,"n_cols":5,"rows_kept":15,"cut":false,"hidden":false,"merged":[[4,0,4,1]]}
["ATLANTIC S.A.E.",null,null,null,"ER"]
[]
[]
["Nota 33 - Resultado extraordinario neto de impuesto a la renta"]
["En miles de guaraníes"]
[]
[null,{"$f":"IFERROR(IF(Indice!B6=\"\",\"2XX2\",YEAR(Indice!B6)),\"2XX2\")","v":2021},{"$f":"+IFERROR(YEAR(Indice!B6-365),\"2XX1\")","v":2020}]
["Conceptos"]
["(Detallar)"]
[]
["Al 30 de setiembre de 2021 y 2020 la Sociedad no ha tenido ingresos ni egresos extraordinarios."]
[]
[]
[]
["Total",{"$f":"SUM($B8:B14)","v":0},{"$f":"SUM($C8:C14)","v":0}]

{"sheet":"Nota 34","index":38,"n_rows":14,"n_cols":5,"rows_kept":14,"cut":false,"hidden":false,"merged":[[4,0,4,1]]}
["ATLANTIC S.A.E.",null,null,null,"ER"]
[]
[]
["Nota 34 - Resultado sobre actividades discontinuadas neto de impuesto a la renta"]
["En miles de guaraníes"]
[]
["Resultado sobre actividades discontinuadas neto de impuesto a la renta",{"$f":"IFERROR(IF(Indice!B6=\"\",\"2XX2\",YEAR(Indice!B6)),\"2XX2\")","v":2021},{"$f":"+IFERROR(YEAR(Indice!B6-365),\"2XX1\")","v":2020}]
[]
["(nueva cuenta a incluir)",0,0]
["Subtotal",0,0]
["- Impuesto a la renta",0,0]
["Total",{"$f":"SUM($B8:B11)","v":0},{"$f":"SUM($C8:C11)","v":0}]
[]
["Al 30 de setiembre de 2021 y 2020 la Sociedad no ha tenido actividades discontinuadas."]

{"sheet":"Nota 35","index":39,"n_rows":10,"n_cols":5,"rows_kept":10,"cut":false,"hidden":false,"merged":[[4,0,4,2]]}
["ATLANTIC S.A.E.",null,null,null,"ER"]
[]
[]
["NOTA 35- UTILIDAD (PÉRDIDA) NETA DEL AÑO Y POR ACCION ORDINARIA"]
["La Sociedad calcula la utilidad (pérdida) neta por acción sobre la base de la utilidad (pérdida) del año y 100.000 acciones ordinarias (aclarar las características de las acciones) de valor nominal Gs. 1.000.000 cada una con derecho a 1 voto por acción (aclarar el derecho de voto que tiene cada tipo de acción)."]
[]
[null,{"$f":"IFERROR(IF(Indice!B6=\"\",\"2XX2\",YEAR(Indice!B6)),\"2XX2\")","v":2021},{"$f":"+IFERROR(YEAR(Indice!B6-365),\"2XX1\")","v":2020}]
["Cantidad de Acciones Ordinarias en Circulación",100000,100000]
["Utilidad Neta",41930314018,7930497942]
["Utilidad Neta por Acción Ordinaria",419303.14017999999,79304.979420000003]

{"sheet":"Nota 36","index":40,"n_rows":17,"n_cols":5,"rows_kept":17,"cut":false,"hidden":false,"merged":[[5,0,5,8],[3,0,3,4],[9,0,12,4],[16,0,19,4]]}
["ATLANTIC S.A.E.",null,null,null,"Indice"]
[]
[]
["NOTA 36 - ACTIVOS GRAVADOS"]
[]
["Los siguientes bienes de propiedad de la Sociedad han sido hipotecados y prendados en garantía de obligaciones financieras."]
[]
[{"$f":"IFERROR(\"Al \"&DAY(Indice!B6)&\" de \"&VLOOKUP(MONTH(Indice!B6),Indice!S:T,2,0)&\" de \"&YEAR(Indice!B6-365),\"Al dia... de mes… de año 2XX1…\")","v":"Al 30 de Septiembre de 2020"}]
["Tipo de Activo","Datos  del activo gravado","Tipo de garantía","Importe (indicar   moneda)","A favor de"]
["No aplicable."]
[]
[]
[]
[]
[{"$f":"IFERROR(\"Al \"&DAY(Indice!B6)&\" de \"&VLOOKUP(MONTH(Indice!B6),Indice!S:T,2,0)&\" de \"&YEAR(Indice!B6-1),\"Al dia... de mes… de año 2XX2…\")","v":"Al 30 de Septiembre de 2021"}]
["Tipo de Activo","Datos  del activo gravado","Tipo de garantía","Importe (indicar   moneda)","A favor de"]
["No aplicable."]

{"sheet":"Nota 37","index":41,"n_rows":15,"n_cols":5,"rows_kept":15,"cut":false,"hidden":false,"merged":[[14,0,14,7],[4,0,4,8],[5,0,5,8],[10,0,11,7]]}
["ATLANTIC S.A.E.",null,null,null,"Indice"]
[]
[]
["NOTA 37 - CONTINGENCIAS Y COMPROMISOS "]
["(Esta nota debería incluir un breve detalle de contratos con terceros, vigente a la fecha de cierre del ejercicio, cuyo incumplimiento o cláusula específica podrían generar obligaciones contingentes para el cliente). "]
[{"$f":"IFERROR(\"Los principales contratos suscriptos por la Sociedad, vigentes al  \"&DAY(Indice!B6)&\" de \"&VLOOKUP(MONTH(Indice!B6),Indice!S:T,2,0)&\" de \"&YEAR(Indice!B6-1)&\" son:\",\"Los principales contratos suscriptos por la Sociedad, vigentes al … de …  20X2 son:\")","v":"Los principales contratos suscriptos por la Sociedad, vigentes al  30 de Septiembre de 2021 son:"}]
["a)"]
["b)"]
[]
[]
[{"$f":"IFERROR(\"Al  \"&DAY(Indice!B6)&\" de \"&VLOOKUP(MONTH(Indice!B6),Indice!S:T,2,0)&\" de \"&YEAR(Indice!B6-1)&\" no existen situaciones contingentes, ni reclamos que pudieran resultar en la generación de obligaciones para la Sociedad adicionales a las que se presentan en estos estados financieros.\",\"Al … de …………... 20X2 no existen situaciones contingentes, ni reclamos que pudieran resultar en la generación de obligaciones para la Sociedad adicionales a las que se presentan en estos estados financieros.\")","v":"Al  30 de Septiembre de 2021 no existen situaciones contingentes, ni reclamos que pudieran resultar en la generación de obligaciones para la Sociedad adicionales a las que se presentan en estos estados financieros."}]
[]
[]
[]
["Obs.: Esta información debe estar ajustada  a lo requerido por la Norma de Información Financiera N° 5 Contingencias y sucesos que ocurren después de la fecha del balance. "]

{"sheet":"Nota 38","index":42,"n_rows":6,"n_cols":4,"rows_kept":6,"cut":false,"hidden":false,"merged":[[3,0,3,6],[5,0,5,6]]}
["ATLANTIC S.A.E.",null,null,"Índice"]
[]
[]
["NOTA 38 - IMPUESTO DIFERIDO"]
["En miles de guaraníes"]
["Al 30 de setiembre de 2021 la Sociedad constituyó una provisión para impuesto a la renta de Guaraníes 1.294.927.800 (Al 31 de de diciembre de 2020: Guaraníes 4.930.007.014)."]

{"sheet":"Nota 39","index":43,"n_rows":9,"n_cols":5,"rows_kept":9,"cut":false,"hidden":false,"merged":[[5,0,5,8],[8,0,8,8]]}
["ATLANTIC S.A.E.",null,null,null,"Indice"]
[]
[]
[]
["NOTA 39 - HECHOS POSTERIORES"]
["(En caso en que entre la fecha del cierre del ejercicio y la fecha de emisión de los estados financieros existan hechos posteriores significativos deberá evaluarse el tipo de hecho posterior del que se trate y modificar esta nota según corresponda)."]
[]
[]
["Entre la fecha de cierre del ejercicio y la fecha de preparación de estos estados financieros intermedios, no han ocurrido hechos significativos de carácter financiero o de otra índole que afecten la situación financiera o los resultados de la Sociedad al 30 de setiembre de 2021."]

{"sheet":"Nota 40","index":44,"n_rows":37,"n_cols":3,"rows_kept":37,"cut":false,"hidden":false,"merged":[[7,0,7,6],[23,0,23,5]]}
["ATLANTIC S.A.E.",null,"Indice"]
[]
[]
[]
["NOTA 40 - SALDOS Y TRANSACCIONES CON PARTES RELACIONADAS"]
["Miles de guaraníes"]
[]
[]
[]
[null,{"$f":"IFERROR(IF(Indice!B6=\"\",\"2XX2\",YEAR(Indice!B6)),\"2XX2\")","v":2021},{"$f":"+IFERROR(YEAR(Indice!B6-365),\"2XX1\")","v":2020}]
["ACTIVO"]
["Inversiones temporales"]
["Cuentas a cobrar comerciales - ALAS S.A.",1514448562.2840002,1664046306]
["Otros créditos",0,0]
["Total activo",{"$f":"+SUM(B12:B14)","v":1514448562.2840002},{"$f":"+SUM(C12:C14)","v":1664046306}]
["PASIVO"]
["Cuentas por pagar comerciales - ALAS S.A.",160309333.31819999,521133131]
["Préstamos a corto plazo",0,0]
["Provisiones",0,0]
["Préstamos a largo plazo",0,0]
["Otros pasivos",0,0]
["Total pasivo",{"$f":"+SUM(B17:B21)","v":160309333.31819999},{"$f":"+SUM(C17:C21)","v":521133131}]
[]
[]
[]
[null,{"$f":"IFERROR(IF(Indice!B6=\"\",\"2XX2\",YEAR(Indice!B6)),\"2XX2\")","v":2021},{"$f":"+IFERROR(YEAR(Indice!B6-365),\"2XX1\")","v":2020}]
["Costo de ventas"]
["Compras a ALAS S.A.",0,0]
[]
["Gastos administrativos"]
["Honorarios por servicios",{"$f":"+B32","v":0},{"$f":"+C32","v":0}]
["Descalzo Asociados (Sindicatura)",0,0]
["Remuneración Personal Superior",{"$f":"+SUM(B34:B37)","v":0},{"$f":"+SUM(C34:C37)","v":0}]
["Nordahl Siemens"," ",0]
["Eldon Unruh",0,0]
["Carlos T. Walde",0,0]
["Roland Walde",0,0]

{"sheet":"Base de Monedas","index":45,"n_rows":179,"n_cols":3,"rows_kept":179,"cut":false,"hidden":false,"merged":[]}
["PYG","Guaraní","Índice"]
["USD","Dólar estadounidense"]
["EUR","Euro"]
["AED","Dírham de los Emiratos Árabes Unidos"]
["AFN","Afgani"]
["ALL","Lek"]
["AMD","Dram armenio"]
["ANG","Florín antillano neerlandés"]
["AOA","Kwanza"]
["ARS","Peso argentino"]
["AUD","Dólar australiano"]
["AWG","Florín arubeño"]
["AZN","Manat azerbaiyano"]
["BAM","Marco convertible"]
["BBD","Dólar de Barbados"]
["BDT","Taka"]
["BGN","Lev búlgaro"]
["BHD","Dinar bareiní"]
["BIF","Franco de Burundi"]
["BMD","Dólar bermudeño"]
["BND","Dólar de Brunéi"]
["BOB","Boliviano"]
["BOV","MVDOL"]
["BRL","Real brasileño"]
["BSD","Dólar bahameño"]
["BTN","Ngultrum"]
["BWP","Pula"]
["BYN","Rublo bielorruso"]
["BZD","Dólar beliceño"]
["CAD","Dólar canadiense"]
["CDF","Franco congoleño"]
["CHE","Euro WIR"]
["CHF","Franco suizo"]
["CHW","Franco WIR"]
["CLF","Unidad de fomento"]
["CLP","Peso chileno"]
["CNY","Yuan chino"]
["COP","Peso colombiano"]
["COU","Unidad de valor real"]
["CRC","Colón costarricense"]
["CUC","Peso convertible"]
["CUP","Peso cubano"]
["CVE","Escudo caboverdiano"]
["CZK","Corona checa"]
["DJF","Franco yibutiano"]
["DKK","Corona danesa"]
["DOP","Peso dominicano"]
["DZD","Dinar argelino"]
["EGP","Libra egipcia"]
["ERN","Nakfa"]
["ETB","Birr etíope"]
["FJD","Dólar fiyiano"]
["FKP","Libra malvinense"]
["GBP","Libra esterlina"]
["GEL","Lari"]
["GHS","Cedi ghanés"]
["GIP","Libra de Gibraltar"]
["GMD","Dalasi"]
["GNF","Franco guineano"]
["GTQ","Quetzal"]
["GYD","Dólar guyanés"]
["HKD","Dólar de Hong Kong"]
["HNL","Lempira"]
["HRK","Kuna"]
["HTG","Gourde"]
["HUF","Forinto"]
["IDR","Rupia indonesia"]
["ILS","Nuevo shéquel israelí"]
["INR","Rupia india"]
["IQD","Dinar iraquí"]
["IRR","Rial iraní"]
["ISK","Corona islandesa"]
["JMD","Dólar jamaiquino"]
["JOD","Dinar jordano"]
["JPY","Yen"]
["KES","Chelín keniano"]
["KGS","Som"]
["KHR","Riel"]
["KMF","Franco comorense"]
["KPW","Won norcoreano"]
["KRW","Won"]
["KWD","Dinar kuwaití"]
["KYD","Dólar de las Islas Caimán"]
["KZT","Tenge"]
["LAK","Kip"]
["LBP","Libra libanesa"]
["LKR","Rupia de Sri Lanka"]
["LRD","Dólar liberiano"]
["LSL","Loti"]
["LYD","Dinar libio"]
["MAD","Dírham marroquí"]
["MDL","Leu moldavo"]
["MGA","Ariary malgache"]
["MKD","Denar"]
["MMK","Kyat"]
["MNT","Tugrik"]
["MOP","Pataca"]
["MRU","Uguiya"]
["MUR","Rupia de Mauricio"]
["MVR","Rufiyaa"]
["MWK","Kwacha"]
["MXN","Peso mexicano"]
["MXV","Unidad de Inversión (UDI) mexicana"]
["MYR","Ringgit malayo"]
["MZN","Metical mozambiqueño"]
["NAD","Dólar namibio"]
["NGN","Naira"]
["NIO","Córdoba"]
["NOK","Corona noruega"]
["NPR","Rupia nepalí"]
["NZD","Dólar neozelandés"]
["OMR","Rial omaní"]
["PAB","Balboa"]
["PEN","Sol"]
["PGK","Kina"]
["PHP","Peso filipino"]
["PKR","Rupia pakistaní"]
["PLN","Złoty"]
["QAR","Riyal qatarí"]
["RON","Leu rumano"]
["RSD","Dinar serbio"]
["RUB","Rublo ruso"]
["RWF","Franco ruandés"]
["SAR","Riyal saudí"]
["SBD","Dólar de las Islas Salomón"]
["SCR","Rupia seychelense"]
["SDG","Dinar sudanés"]
["SEK","Corona sueca"]
["SGD","Dólar de Singapur"]
["SHP","Libra de Santa Elena"]
["SLL","Leone"]
["SOS","Chelín somalí"]
["SRD","Dólar surinamés"]
["SSP","Libra sursudanesa"]
["STN","Dobra"]
["SVC","Colon Salvadoreño"]
["SYP","Libra siria"]
["SZL","Lilangeni"]
["THB","Baht"]
["TJS","Somoni tayiko"]
["TMT","Manat turcomano"]
["TND","Dinar tunecino"]
["TOP","Paʻanga"]
["TRY","Lira turca"]
["TTD","Dólar de Trinidad y Tobago"]
["TWD","Nuevo dólar taiwanés"]
["TZS","Chelín tanzano"]
["UAH","Grivna"]
["UGX","Chelín ugandés"]
["USN","Dólar estadounidense (Siguiente día)"]
["UYI","Peso en Unidades Indexadas (Uruguay)"]
["UYU","Peso uruguayo"]
["UYW","Unidad Previsional"]
["UZS","Som uzbeko"]
["VES7​","Bolívar soberano"]
["VND","Dong vietnamita"]
["VUV","Vatu"]
["WST","Tala"]
["XAF","Franco CFA de África Central"]
["XAG","Plata (una onza troy)"]
["XAU","Oro (una onza troy)"]
["XBA","Unidad compuesta europea (EURCO) (Unidad del mercados de bonos)"]
["XBB","Unidad Monetaria europea (E.M.U.-6) (Unidad del mercado de bonos)"]
["XBC","Unidad europea de cuenta 9 (E.U.A.-9) (Unidad del mercado de bonos)"]
["XBD","Unidad europea de cuenta 17 (E.U.A.-17) (Unidad del mercado de bonos)"]
["XCD","Dólar del Caribe Oriental"]
["XDR","Derechos especiales de giro"]
["XOF","Franco CFA de África Occidental"]
["XPD","Paladio (una onza troy)"]
["XPF","Franco CFP"]
["XPT","Platino (una onza troy)"]
["XSU","SUCRE"]
["XTS","Reservado para pruebas"]
["XUA","Unidad de cuenta BAD"]
["XXX","Sin divisa"]
["YER","Rial yemení"]
["ZAR","Rand"]
["ZMW","Kwacha zambiano"]
["ZWL","Dólar zimbabuense"]