{"text_format":"1","workbook":"xlsx","n_sheets":46,"sheets":["Indice","BG","EF","ER","EVPN","Nota1","Nota 2","Nota 3","Nota 4","Nota 5","Nota 6","Nota 7","Nota 8","Nota 9","Nota 10","Nota 11","Nota 12","Nota 13","Nota 14","Nota 15","Nota 16","Nota 17","Nota 18","Nota 19","Nota 20"," Nota 21","Nota 22","Nota 23","Nota 24","Nota 25","Nota 26","Nota 27","Nota 28","Nota 29","Nota 30","Nota 31","Nota 32","Nota 33","Nota 34","Nota 35","Nota 36","Nota 37","Nota 38","Nota 39","Nota 40","Base de Monedas"],"not_rendered":{"charts":0,"images":2,"macros":1,"external_links":10,"defined_names":116,"comments":0,"pivot_tables":0},"unopened":[],"bounds":{"document_bytes":16777216,"sheet_cells":100000,"rows_first":2000,"rows_last":500,"rows_between":2000,"halvings":0,"cell_chars":16384,"cell_head_chars":4096},"cells_cut":0,"cells_raw":0,"read":"whole","date_system":"1900"}

{"sheet":"Indice","index":0,"n_rows":64,"n_cols":20,"rows_kept":64,"cut":false,"hidden":false,"merged":[]}
[null,"Sociedad:","BEPSA DEL PARAGUAY S.A.E.C.A."]
[null,null,null,null,null,null,null,null,null,null,null,null,null,null,null,null,null,null,1,"Enero"]
[null,null,null,null,null,null,null,null,null,null,null,null,null,null,null,null,null,null,2,"Febrero"]
[null,null,null,null,null,null,null,null,null,null,null,null,null,null,null,null,null,null,3,"Marzo"]
[null,null,null,null,null,null,null,null,null,null,null,null,null,null,null,null,null,null,4,"Abril"]
["Fecha Presentación:","2021-06-30",null,null,null,null,null,null,null,null,null,null,null,null,null,null,null,null,5,"Mayo"]
[null,null,null,null,null,null,null,null,null,null,null,null,null,null,null,null,null,null,6,"Junio"]
[null,null,null,null,null,null,null,null,null,null,null,null,null,null,null,null,null,null,7,"Julio"]
[null,null,"INDICE","REF.",null,null,null,null,null,null,null,null,null,null,null,null,null,null,8,"Agosto"]
[null,"Informacion General",null,null,null,null,null,null,null,null,null,null,null,null,null,null,null,null,9,"Septiembre"]
[null,null,"Descripción de la naturaleza y del negocio de la Sociedad","Nota 1",null,null,null,null,null,null,null,null,null,null,null,null,null,null,10,"Octubre"]
[null,null,"Resumen de las principales políticas contables","Nota 2",null,null,null,null,null,null,null,null,null,null,null,null,null,null,11,"Noviembre"]
[null,"Balance General",null,"BG",null,null,null,null,null,null,null,null,null,null,null,null,null,null,12,"Diciembre"]
[null,null,"Efectivo y equivalente de efectivo","Nota 3"]
[null,null,"Inversiones temporales","Nota 4"]
[null,null,"Cuentas por cobrar comerciales","Nota 5"]
[null,null,"Otros créditos","Nota 6"]
[null,null,"Cuentas por cobrar comerciales","Nota 5"]
[null,null,"Inventarios","Nota 7"]
[null,null,"Inversión en asociadas","Nota 8"]
[null,null,"Propiedades, planta y equipo","Nota 9"]
[null,null,"Activos disponibles para la venta","Nota 10"]
[null,null,"Activos intangibles","Nota 11"]
[null,null,"Goodwill","Nota 12"]
[null,null,"Cuentas por pagar comerciales","Nota 13"]
[null,null,"Préstamos a corto plazo","Nota 14"]
[null,null,"Porción corriente de la deuda a largo plazo","Nota 15"]
[null,null,"Remuneraciones y cargas sociales a pagar","Nota 16"]
[null,null,"Impuestos a pagar","Nota 17"]
[null,null,"Provisiones","Nota 18"]
[null,null,"Otros pasivos corrientes","Nota 19"]
[null,null,"Prestamos a largo plazo","Nota 14"]
[null,null,"Otros pasivos no corrientes","Nota 19"]
[null,null,"Capital integrado","Nota 20"]
[null,null,"Reserva de revalúo","Nota 21"]
[null,null,"Reserva legal","Nota 21"]
[null,null,"Reservas estatutarias","Nota 21"]
[null,null,"Reservas facultativas","Nota 21"]
[null,null,"Diferencia transitoria por conversión","Nota 22"]
[null,null,"Resultados acumulados","Nota 23"]
[null,null,"Interés minoritario","Nota 24"]
[null,"Estado de Resultados ",null,"ER"]
[null,null,"Ventas","Nota 25"]
[null,null,"Costo de ventas","Nota 26"]
[null,null,"Gastos de ventas","Nota 27"]
[null,null,"Gastos administrativos","Nota 27"]
[null,null,"Otros ingresos y gastos operativos","Nota 28"]
[null,null,"Ingresos financieros - neto","Nota 29"]
[null,null,"Gastos financieros - neto","Nota 29"]
[null,null,"Resultado de inversiones en asociadas","Nota 30"]
[null,null,"Resultado participación minoritaria","Nota 31"]
[null,null,"Impuesto a la renta","Nota 32"]
[null,null,"Resultado extraordinario neto de impuesto a la renta","Nota 33"]
[null,null,"Resultado sobre actividades discontinuadas neto de impuesto a la renta","Nota 34"]
[null,null,"Utilidad/(Pérdida) neta del año","Nota 35"]
[null,null,"Utilidad neta por acción ordinaria","Nota 35"]
[null,"Estado de Evolución del Patrimonio Neto",null,"EVPN"]
[null,"Estado de Flujos de Efectivo",null,"EFE"]
[null,"Otras Notas de los Estados Financieros"]
[null,null,"Activos gravados","Nota 36"]
[null,null,"Contingencias y compromisos","Nota 37"]
[null,null,"Impuesto diferido","Nota 38"]
[null,null,"Hechos posteriores","Nota 39"]
[null,null,"Saldos y transacciones con partes relacionadas","Nota 40"]

{"sheet":"BG","index":1,"n_rows":62,"n_cols":7,"rows_kept":62,"cut":false,"hidden":false,"merged":[[72,5,72,6],[73,1,73,3],[11,1,11,3],[29,1,29,3],[45,1,45,3],[44,1,44,3],[58,1,58,3],[71,5,71,6],[28,1,28,3],[59,1,59,3],[37,2,37,3],[40,2,40,3],[41,2,41,3],[46,2,46,3],[50,2,50,3],[49,2,49,3],[6,0,6,6],[8,0,8,6],[66,5,66,6],[54,2,54,3],[56,2,56,3],[27,2,27,3],[24,2,24,3],[25,2,25,3],[20,2,20,3],[22,2,22,3],[23,2,23,3],[32,2,32,3],[7,0,7,6],[47,2,47,3],[67,5,67,6],[13,2,13,3],[14,2,14,3],[15,2,15,3],[16,2,16,3],[17,2,17,3],[26,2,26,3],[31,2,31,3],[33,2,33,3],[34,2,34,3],[35,2,35,3],[36,2,36,3],[57,2,57,3],[51,2,51,3],[52,2,52,3],[53,2,53,3]]}
[null,null,null,"BEPSA DEL PARAGUAY S.A.E.C.A.","Indice"]
[]
[]
[]
[]
[]
["BALANCE GENERAL"]
["Al 30 de Junio de 2021"]
[]
[]
[null,null,null,null,"Nota",2021,2020]
[null,"ACTIVOS"]
[null,"Activos Corrientes"]
[null,null,"Efectivo y equivalente de efectivo",null,3,5451948196,36779595547]
[null,null,"Inversiones temporales",null,4,0,5092734233]
[null,null,"Cuentas por cobrar comerciales",null,5,50355160902,36652136338]
[null,null,"Otros créditos",null,6,{"$f":"+'Nota 6'!B21","v":8704973550},5978470890]
[null,null,"Inventarios",null,7]
[null,null,"Total activos corrientes",null,null,{"$f":"SUM(F14:F18)","v":64512082648},{"$f":"SUM(G14:G18)","v":84502937008}]
[null,"Activos no Corrientes"]
[null,null,"Otros créditos ",null,6,{"$f":"+'Nota 6'!F18","v":420624354},{"$f":"101075919+562402870","v":663478789}]
[null,null,"Cuentas por cobrar comerciales",null,5]
[null,null,"Inversión en asociadas",null,8]
[null,null,"Propiedades, planta y equipo/Bienes de uso, neto",null,9,34675331883,34194465280]
[null,null,"Activos disponibles para la venta",null,10]
[null,null,"Activos intangibles",null,11,{"$f":"+'Nota 11'!B15","v":17558767487},12586188555]
[null,null,"Goodwill",null,12,0,0]
[null,null,"Total activos no corrientes",null,null,{"$f":"SUM(F21:F27)","v":52654723724},{"$f":"SUM(G21:G27)","v":47444132624}]
[null,"Total Activos",null,null,null,{"$f":"+F28+F19","v":117166806372},{"$f":"+G28+G19","v":131947069632}]
[null,"PASIVOS Y PATRIMONIO NETO"]
[null,"Pasivos corrientes",null,null,null,-1]
[null,null,"Cuentas por pagar comerciales",null,13,{"$f":"+'Nota 13'!D14","v":46144227491},{"$f":"31860815965+13164295801","v":45025111766}]
[null,null,"Préstamos a corto plazo ",null,14,{"$f":"+'Nota 14'!E35","v":2161773516},2754615098]
[null,null,"Porción corriente de la deuda a largo plazo",null,15]
[null,null,"Remuneraciones y cargas sociales a pagar",null,16,762219420,1199505928]
[null,null,"Impuestos a pagar",null,17]
[null,null,"Provisiones",null,18]
[null,null,"Otros pasivos corrientes",null,19,{"$f":"+'Nota 19'!B17","v":12554300360.99},23875802943]
[null,null,"Total Pasivos Corrientes",null,null,{"$f":"SUM(F32:F38)","v":61622520787.989998},{"$f":"SUM(G32:G38)","v":72855035735}]
[null,"Pasivos no corrientes"]
[null,null,"Préstamos a largo plazo ",null,14,{"$f":"+'Nota 14'!E59","v":2554175339},4670700481]
[null,null,"Otros pasivos  no corrientes",null,19,0,0]
[null,null,"Total pasivos no corrientes",null,null,{"$f":"+F41","v":2554175339},{"$f":"+G41","v":4670700481}]
[]
[null,"Total Pasivos",null,null,null,{"$f":"+F39+F43","v":64176696126.989998},{"$f":"+G39+G43","v":77525736216}]
[null,"Patrimonio Neto"]
[null,null,"Capital integrado",null,20,41500000000,38855800000]
[null,null,"Aportes a Capitalizar",null,null,24000000,21081542]
[null,null,"Prima de Emisión",null,null,4220000000,4220000000]
[null,null,"Reserva de revalúo",null,21,9420414506,4633572953]
[null,null,"Reserva legal",null,21,1277694431,1272442740]
[null,null,"Reservas estatutarias",null,21]
[null,null,"Reservas facultatitvas",null,21,989026484,889244362]
[null,null,"Diferencia transitoria por conversión",null,22]
[null,null,"Resultados acumulados",null,23]
[null,null,"Resultado del Ejercicio",null,23,-4441025176,4529191819]
[null,null,"Subtotal"]
[null,null,"Interés minoritario",null,24,0,0]
[null,"Total Patrimonio Neto",null,null,null,{"$f":"SUM(F47:F56)","v":52990110245},{"$f":"SUM(G47:G56)","v":54421333416}]
[null,"Total Pasivos y Patrimonio Neto",null,null,null,{"$f":"+F45+F59","v":117166806371.98999},{"$f":"+G45+G59","v":131947069632}]
[]
[null,"Las notas que se acompañan forman parte integrante de estos estados."]

{"sheet":"EF","index":2,"n_rows":44,"n_cols":3,"rows_kept":44,"cut":false,"hidden":false,"merged":[[2,0,2,2],[4,0,4,2],[5,0,5,2],[6,0,6,2],[7,0,7,2]]}
["BEPSA DEL PARAGUAY S.A.E.C.A."]
[]
[]
[]
["ESTADO DE FLUJOS DE EFECTIVO (Método directo)"]
["Al 30 de Junio de 2021"]
["Comparativo con igual periodo del año anterior"]
[]
[]
[]
[null,2021,2020]
[]
["FLUJO DE EFECTIVO DE ACTIVIDADES OPERATIVAS"]
["Cobranzas efectuadas a clientes",21638497359,44158187101.5]
["Pagos efectuados a proveedores y empleados",-37288127331.010002,-5816787462]
["Efectivo generado por las operaciones"]
["Intereses pagados",-172198807,192240989]
["Otros ingresos y (egresos) - neto"]
["Pagos de impuesto a la renta",0,-609646983]
["Flujo neto de efectivo de actividades operativas",{"$f":"SUM(B13:B19)","v":-15821828779.010002},{"$f":"SUM(C13:C19)","v":37923993645.5}]
[]
["FLUJO DE EFECTIVO DE ACTIVIDADES DE INVERSIÓN "]
["Adquisición de bienes de uso",-6891316617.6461802,-1659165456]
["Adquisición de bienes Curtiembre - fideicomitida"]
["Ventas de activos fijos",null,0]
["Ventas de bienes de uso"]
["Intereses cobrados sobre inversiones"]
["Aquisición de intangibles",-8649250033]
["Aquisición de inversiones",null,-806931475]
["Flujo neto de efectivo de actividades de inversión",{"$f":"SUM(B23:B29)","v":-15540566650.646179},{"$f":"SUM(C23:C29)","v":-2466096931}]
[]
["FLUJO DE EFECTIVO DE ACTIVIDADES DE FINANCIACIÓN"]
["(Disminución) Incremento de préstamos",-2709366724,-1598278705]
["Aportes de capital recibidos",2644200000]
["Dividendos pagados",null,54773682.674999699]
["Flujo neto de efectivo de actividades de financiamiento",{"$f":"SUM(B33:B35)","v":-65166724},{"$f":"SUM(C33:C35)","v":-1543505022.3250003}]
[]
["(Disminución) Incremento neto de efectivo",{"$f":"+B20+B30+B36","v":-31427562153.656181},{"$f":"+C20+C30+C36","v":33914391692.174999}]
["Efecto estimado de la diferencia de cambio sobre el saldo de efectivo",99914803,-95059408]
["Efectivo al principio del año",{"$f":"+C42","v":36779595546.175003},2960263262]
[]
["Efectivo al final del periodo",{"$f":"SUM(B38:B41)","v":5451948195.5188217},{"$f":"SUM(C38:C41)","v":36779595546.175003}]
[null,{"$error":"#REF!"}]
["Las notas que se acompañan forman parte integrante de estos estados."]

{"sheet":"ER","index":3,"n_rows":35,"n_cols":4,"rows_kept":35,"cut":false,"hidden":false,"merged":[[46,2,46,3],[6,0,6,3],[7,0,7,3],[8,0,8,3],[9,0,9,3],[40,2,40,3]]}
["BEPSA DEL PARAGUAY S.A.E.C.A.","Indice",null," "]
[]
[]
[" "]
[]
[]
["ESTADO DE RESULTADOS"]
["Al 30 de Junio de 2021"]
["Comparativo con igual período del año anterior"]
[]
[]
[null,"Nota",2021,2020]
["Ventas",25,35341521923,34093017511]
["Costo de ventas",26,-17747209703,-15870510620]
["Utilidad bruta",null,{"$f":"+C13+C14","v":17594312220},{"$f":"+D13+D14","v":18222506891}]
["Gastos de ventas",27,{"$f":"-'Nota 27'!B35","v":-1251758967},{"$f":"-'Nota 27'!E35","v":-331040381}]
["Gastos administrativos ",27,{"$f":"-'Nota 27'!C35","v":-20974837394},{"$f":"-'Nota 27'!F35","v":-13359591090}]
["Otros ingresos  y gastos operativos",28,0]
["Resultado operativo",null,{"$f":"+C17+C16+C15","v":-4632284141},{"$f":"+D15+D16+D17+D18","v":4531875420}]
["Ingresos financieros - neto",29,{"$f":"+'Nota 29'!B14","v":585512916},{"$f":"+'Nota 29'!C10","v":1074337526}]
["Gastos financieros -  neto",29,{"$f":"-'Nota 29'!F14","v":-394253951},{"$f":"-'Nota 29'!G14","v":-564521127}]
["Subtotal",null,{"$f":"+C19+C20+C21","v":-4441025176},{"$f":"+D21+D20","v":509816399}]
["Resultado de inversiones en asociadas",30,0,0]
["Resultados ordinarios antes de impuesto a la renta y participación minoritaria",null,{"$f":"+C22","v":-4441025176},{"$f":"+D19+D22","v":5041691819}]
["Resultado participación minoritaria",31,0,0]
["Resultado ordinario antes del impuesto a la renta"]
["Impuesto a la renta",32,0,-512500000]
["Resultado neto de actividades ordinarias",null,{"$f":"++C24","v":-4441025176},{"$f":"+D24+D27","v":4529191819}]
["Resultado extraordinario neto de impuesto a la renta",33,0,0]
["Resultado sobre actividades discontinuadas neto de impuesto a la renta",34,0,0]
["Utilidad/(Pérdida) neta del año ",null,{"$f":"+C28","v":-4441025176},{"$f":"+D28","v":4529191819}]
["Utilidad neta por acción ordinaria",35,{"$f":"+C31/(EVPN!C34/100000)","v":-10701.265484337349},{"$f":"+D31/(EVPN!C25/100000)","v":11656.411189577875}]
[]
[]
["Las notas que se acompañan forman parte integrante de estos estados."]

{"sheet":"EVPN","index":4,"n_rows":36,"n_cols":19,"rows_kept":36,"cut":false,"hidden":false,"merged":[[10,16,11,16],[10,18,11,18],[5,0,5,14],[6,0,6,14],[10,2,11,2],[10,4,11,4],[10,6,11,6],[10,8,11,8],[10,10,11,10],[10,12,11,12],[10,14,11,14],[10,0,11,0],[9,2,9,4],[9,10,9,14],[10,3,11,3]]}
["BEPSA DEL PARAGUAY S.A.E.C.A.",null,null,null,null,null,"Indice"]
[]
[]
[null,null,null,null,"ESTADO DE EVOLUCIÓN DEL PATRIMONIO NETO"]
[null,null,null,null,null,null,"Al 30 de Junio de 2021"]
["Comparativo con igual periodo del año anterior"]
[]
[]
[]
[null,null,"Aporte de los propietarios",null,null,null,null,null,null,null,"Ganancias reservadas"]
[null,null,"Capital suscripto e integrado","Aporte para aumento capital","Primas de emisión",null,"Reserva de revalúo",null,"Reserva de revalúo técnico",null,"Reserva legal",null,"Reserva facultativa",null,"Resultados acumulados",null,"Interes Minoritario",null,"Total"]
[null,null,null,"aumento de capital",null,null,null,null,null,null,null,null,null,null,"Total"]
[]
["Saldo al 30 de Junio de 2019",null,30000000000,3045081542,4000000000,null,4569970537,null,null,null,1015114090,null,null,null,2399119537,null,null,null,{"$f":"SUM(C14:R14)","v":45029285706}]
["Cambio en política contable (Nota….)"]
["Saldo reestructurado"]
["Distribución de dividendos s/Acta de Asamblea Ordinaria N°… de fecha………"]
["Integración del capital social",null,8855800000,-3024000000,null,null,null,null,null,null,null,null,null,null,-2399119537]
["Reducción del capital social s/Acta de Asamblea General Ordinaria N°… de fecha…….."]
["Prima de emisión",null,null,null,220000000,null,0]
["Revalúo de activos fijos",null,null,null,null,null,63602416]
["Revalúo técnico"]
["Resultado del año",null,null,null,null,null,null,null,null,null,257328650,null,889244362,null,4529191819]
[]
["Saldo al 30 de Junio de 2020",null,{"$f":"SUM(C13:C24)","v":38855800000},{"$f":"SUM(D13:D24)","v":21081542},{"$f":"SUM(E13:E24)","v":4220000000},{"$f":"SUM(F13:F24)","v":0},{"$f":"SUM(G13:G24)","v":4633572953},{"$f":"SUM(H13:H24)","v":0},0,0,1272442740,0,889244362,0,4529191819,null,0,null,{"$f":"SUM(C25:R25)","v":54421333416}]
["Distribución de dividendos s/Acta de Asamblea General Ordinaria N°… de fecha………"]
["Movimientos del periodo",null,null,null,null,null,null,null,null,null,null,null,0,0,-4424158006]
["Integración del capital social",null,2644200000,{"$f":"+D34-D25","v":2918458},null,null,null,null,null,null,null,null,null,null,0]
["Reserva legal",null,null,null,null,null,0,null,null,null,5251691,null,null,null,-5251691]
["Reserva Facultativa",null,null,null,null,null,null,null,null,null,null,null,99782122,null,-99782122]
["Revalúo de activos fijos",null,null,null,null,null,4786841553]
["Desafectación de la reserva de revalúo técnico"]
["Resultado del año",null,null,null,null,null,null,null,null,null,null,null,0,null,{"$f":"+ER!C31","v":-4441025176}]
["Saldo al 30 de Junio de 2021",null,{"$f":"SUM(C25:C33)","v":41500000000},24000000,{"$f":"SUM(E25:E33)","v":4220000000},0,9420414506,0,0,0,{"$f":"SUM(K25:K33)","v":1277694431},0,989026484,0,-4441025176,0,0,null,{"$f":"SUM(C34:R34)","v":52990110245}]
[]
["Las notas que se acompañan forman parte integrante de estos estados."]

{"sheet":"Nota1","index":5,"n_rows":12,"n_cols":9,"rows_kept":12,"cut":false,"hidden":false,"merged":[[7,0,7,8],[11,0,30,8],[10,9,10,11]]}
[{"$f":"Indice!C1","v":"BEPSA DEL PARAGUAY S.A.E.C.A."},null,null,null,null,null,null,null,"BG"]
[]
[]
[]
[]
["NOTAS A LOS ESTADOS FINANCIEROS CORRESPONDIENTES AL PERIODO TERMINADO",null,null,null,null,null,null,{"$f":"IFERROR(IF(Indice!B6=\"\",\"Al dia... de mes… de año 2XX2…\",\"Al \"&DAY(Indice!B6)&\" de \"&VLOOKUP(MONTH(Indice!B6),Indice!S:T,2,0)&\" de \"&YEAR(Indice!B6)),\"Al dia... de mes… de año 2XX2…\")","v":"Al 30 de Junio de 2021"}]
["Presentadas en forma comparativa con el periodo terminado ",null,null,null,null,{"$f":"IFERROR(\"Al \"&DAY(Indice!B6)&\" de \"&VLOOKUP(MONTH(Indice!B6),Indice!S:T,2,0)&\" de \"&YEAR(Indice!B6-365),\"Al dia... de mes… de año 2XX1…\")","v":"Al 30 de Junio de 2020"}]
[" "]
[]
[]
["NOTA 1 – DESCRIPCIÓN DE LA NATURALEZA Y DEL NEGOCIO DE LA COMPAÑÍA"]
["BEPSA DEL PARAGUAY SOCIEDAD ANÓNIMA fue constituida por escritura Nº 05, de fecha 19 de enero de 1990. Sus estatutos sociales fueron aprobados y su personería jurídica reconocida por Decreto Nº 5.411 del Poder Ejecutivo de fecha 09 de abril de 1990 y sus modificaciones por escritura pública Nº 34, del 26 de marzo de 1991, escritura pública Nº 91 del 06 de agosto de 1993, escritura pública Nº 252 del 18 de julio de 1994,  por escritura pública Nº 384 del 03 de julio de 1996, escritura pública Nº 93 del 08 de noviembre de 2001 y su complementaria escritura pública Nº 16 del 10 de abril de 2002, escritura pública Nº 20 del 10 de octubre de 2002 y su complementaria escritura pública Nº 31 del 16 de diciembre de 2002, escritura pública Nº 99 del 7 de agosto de 2003, escritura pública Nº 77 del 13 de mayo de 2009, escritura pública N° 68 del 16 de diciembre de 2013, escritura pública Nº 51 del 15 de Diciembre de 2014, escritura publica Nº 24 del 06 de mayo de 2016, escritura publica Nº 13 del veinte y tres de abril de 23/04/18, folio 12 en fecha 21/05/19, Nº 40 folio 151 de fecha 24/06/19.La sociedad tiene por objeto principal dedicarse a la prestación de servicios de una Red Electrónica de Transferencia a las entidades bancarias, financieras, comerciales e industriales del mercado paraguayo, a otras redes de servicios electrónicos regionales o internacionales y a las entidades públicas, autárquicas o no, nacionales o municipales. Los servicios que la sociedad BEPSA DEL PARAGUAY SOCIEDAD ANÓNIMA brinda, son todos aquellos que requieren de procesamiento electrónico computarizado, como ser: red de cajeros automáticos, red de terminales de puntos de venta, sistema de administración, sistemas de tarjeta de crédito, banco en casa, sistema de acceso a base de datos y de información financiera bursátil, cotizaciones de mercado o cualquier otro tipo de procesamiento de información y transferencias de fondos y datos que los adelantos tecnológicos permitan brindar en el futuro. La sociedad se encuentra autorizada y tiene plena capacidad jurídica para entender y desarrollar cualquier tipo de actividades comerciales, industriales, inmobiliarias, empresariales, actual como agencia de turismo y afines o cualquier otra actividad lícita sin más limitaciones que las previstas en las leyes respectivas y sus estatutos."]

{"sheet":"Nota 2","index":6,"n_rows":94,"n_cols":9,"rows_kept":94,"cut":false,"hidden":false,"merged":[[5,0,5,8],[42,0,42,8],[47,0,47,8],[51,0,51,8],[46,0,46,8],[48,0,48,8],[15,0,15,8],[6,0,6,8],[14,0,14,8],[10,0,10,8],[11,0,11,8],[34,0,34,8],[38,0,38,8],[39,0,39,8],[31,0,31,8],[43,0,43,8],[52,0,52,8],[58,0,58,8],[55,0,55,8],[94,0,94,8],[87,0,87,8],[88,0,88,8],[72,0,72,8],[81,0,81,8],[89,0,89,8],[77,0,77,8],[82,0,82,8],[84,0,84,8],[78,0,78,8],[93,0,93,8],[91,0,91,8],[92,0,92,8],[9,0,9,8],[13,0,13,8],[19,0,19,8],[18,0,18,8],[41,0,41,8],[36,0,36,8],[37,0,37,8],[33,0,33,8],[16,0,16,8],[17,0,17,8],[111,5,111,13],[79,9,79,10],[81,9,81,10],[68,0,68,8],[74,0,74,8],[68,9,68,10],[70,9,70,10],[73,0,73,8],[56,0,56,8],[57,9,57,10],[57,0,57,8],[70,0,70,8],[71,0,71,8],[66,9,66,10],[67,9,67,10],[67,0,67,8],[62,0,62,8],[64,0,64,8],[65,0,65,8],[59,0,59,8],[60,0,60,8],[66,0,66,8],[61,0,61,8],[55,9,55,10],[56,9,56,10],[71,9,71,10],[64,9,64,10],[65,9,65,10],[58,9,58,10],[59,9,59,10],[60,9,60,10]]}
[{"$f":"Indice!C1","v":"BEPSA DEL PARAGUAY S.A.E.C.A."},null,null,null,null,null,null,null,"BG"]
[]
[]
[]
[]
["NOTA 2 - RESUMEN DE LAS PRINCIPALES POLÍTICAS CONTABLES"]
["Resumen de las principales políticas contables: a modo referencial, se incluyen las siguientes revelaciones de políticas contables en estados financieros de uso general que podrá ser tenida en consideración por las sociedades emisoras para la preparación de este capítulo de los estados financieros:"]
[]
[]
["a.   Bases de contabilización (Según NIF Bases de preparación de los Estados Financieros)"]
["Los estados financieros se han preparado siguiendo los criterios de las Normas de Información Financiera (NIF) emitidas por el Consejo de Contadores Públicos del Paraguay sobre la base de costos históricos, excepto para el caso de activos y pasivos en moneda extranjera  y las propiedades, planta y equipo según se explica en los puntos c ) y k), y no reconocen en forma integral los efectos de la inflación sobre la situación patrimonial y financiera de la sociedad, sobre los resultados de sus operaciones y los flujos de efectivo, en atención a que la corrección monetaria no constituye una práctica contable obligatoria en el Paraguay. \n"]
["De haberse aplicado una corrección monetaria integral de los estados financieros, podrían haber surgido diferencias en la presentación de la situación patrimonial y financiera de la sociedad, en los resultados de sus operaciones y en los flujos de efectivo al 30-06-2021, y por los ejercicios cerrados el, 30 de junio de 2020 y 2021. Según el índice general de precios del consumo (IPC) publicado por el Banco Central del Paraguay, la inflación fue de 1,5% en el año 2021 y 2,2% en el año 2020. Obs: Datos a incorporar para cierre del ejercicio\n\n"]
[]
[]
["b.   Uso de estimaciones contables"]
["La preparación de los presentes estados financieros requiere que la Gerencia de la sociedad realice estimaciones y evaluaciones que afectan el monto de los activos y pasivos registrados y contingentes, como así también los ingresos y egresos registrados en el ejercicio.  Los resultados reales futuros pueden diferir de las estimaciones y evaluaciones realizadas a la fecha de preparación de los presentes estados financieros."]
[]
["c.   Moneda extranjera"]
["Los activos y pasivos en moneda extranjera se valúan a los tipos de cambio vigentes a la fecha de cierre del ejercicio."]
["Las diferencias de cambio originadas por fluctuaciones en los tipos de cambio producidos entre las fechas de concertación de las operaciones y su liquidación o valuación al cierre del ejercicio, son reconocidas en resultados."]
[]
[]
[null,null,{"$f":"IFERROR(IF(Indice!B6=\"\",\"2XX2\",YEAR(Indice!B6)),\"2XX2\")","v":2021},null,null,null,{"$f":"IFERROR(YEAR(Indice!B6-365),\"2XX1\")","v":2020}]
[null,"Indicar moneda","Simbología según ISO 4217","Miles de G.",null,"Indicar moneda","Simbología según ISO 4217","Miles de G."]
["Activos","Dolares","USD",7451163505.5100002,null,"Dolares","USD",6422509411.3699999]
[]
["Pasivos","Dolares","USD",6284707972,null,"Dolares","USD",6853377632.8599997]
[]
["Posición neta",null,null,{"$f":"+D25-D27","v":1166455533.5100002},null,null,null,{"$f":"+H25-H27","v":-430868221.48999977}]
[]
[]
["A la fecha de emisión de estos estados financieros, el tipo de cambio de la moneda extranjera 6761,37 (Dolares) no varió sustancialmente (varió en un -1,00%) con respecto al vigente al 30 de junio 2020"]
[]
["d.   Efectivo y equivalentes de efectivo"]
["Se considerarán dentro del concepto de efectivo los saldos en efectivo, disponibilidades en cuentas bancarias y toda inversión de muy alta liquidez, con vencimiento originalmente pactado no superior a tres meses."]
[]
[]
["e.   Inversiones"]
["Las inversiones temporales se valúan de acuerdo a los siguientes criterios de valuación:\n Valores mobiliarios: a su valor de cotización al cierre del año/período menos los gastos estimados de venta. Ver Nota ....\n Colocaciones financieras en moneda local: a su valor nominal más los intereses devengados al cierre del año/período. Ver Nota ....\n Colocaciones financieras en moneda extranjera: a su valor de cotización al cierre del año/período más intereses devengados a ese momento. Ver Nota ....\n Las inversiones no corrientes en sociedades donde no se ejerce el control, se valúan a su valor patrimonial proporcional. Ver Nota ....\n"]
["Obs.: En caso de la existencia de saldos y transacciones con partes relacionadas, la información que corresponda a ser expuesta por la sociedad, se ajustará  a lo requerido por la Norma de Información Financiera N° 7 Revelaciones de partes relacionadas."]
[]
[]
["f. Previsión para cuentas de dudoso cobro/incobrables"]
["Las previsiones para cuentas de dudoso cobro se determinan al cierre de cada ejercicio y/o mensualmente sobre la base del estudio de la cartera de créditos realizado con el objeto de determinar la porción no recuperable de las cuentas a cobrar. Las previsiones para cuentas de dudoso cobro se determinan mensualmente de acuerdo con el siguiente esquema de cálculo: (Indicar política de constitución de previsiones)"]
[]
[]
[]
["g. Inventarios"]
["Las existencias se valúan al menor entre su costo de adquisición o de producción y su valor neto de realización (NIF 12, párrafo 5). Para determinar el consumo (baja de inventarios) se aplicarán las fórmulas de costeo siguientes: FIFO, (Primero Entrado Primero en Salir – PEPS); PPP (Precio Promedio Ponderado); o identificación específica (NIF 12, párrafos 16 a 20). Ver Nota ..."]
[]
[]
["h. Activos disponibles para la venta"]
["Los activos disponibles para la venta representan bienes que fueron desafectados de la actividad productiva y se mantienen con el único objetivo de ser vendidos.  Los mismos se valúan, sin amortizar, al menor entre el valor de mercado de los mismos y su costo (valor libro) al momento de su designación como disponibles para la venta."]
[]
[]
["i. Previsiones para desvalorización y deterioro de inventarios"]
["Las previsiones para desvalorización y deterioro de inventarios han sido estimadas tomando como base la valorización del stock deteriorado existente al cierre del ejercicio."]
[]
["j. Propiedades, planta y equipo"]
["Las propiedades, planta y equipo se exponen a su costo histórico considerando el valor residual determinado por la Autoridad Tributaria , menos la correspondiente depreciación acumulada. El incremento neto por la re-expresión se acredita a la respectiva reserva patrimonial, cuyo saldo puede ser utilizado únicamente para  aumentar el capital."]
["El costo de las mejoras que extienden la vida útil de los bienes o aumentan su capacidad productiva es imputado a las cuentas respectivas del activo. Los gastos de mantenimiento son cargados a resultados."]
["La depreciación es calculada por el método de línea recta, saldo decreciente o suma de unidades (la emisora elige uno de los tres métodos con base en el patrón esperado de beneficios económicos y lo aplica consistentemente de ejercicio a ejercicio a menos que haya cambios significativos en dicho patrón considerado -NIF 11 párrafo 43 y 48). Ver Nota ..."]
["Los efectos de los ajustes sobre Propiedades, Planta y Equipo de operaciones discontinuadas se exponen formando parte de la línea “Resultados sobre actividades discontinuadas neto de impuesto a la renta” en el Estado de Resultados."]
[]
[]
["k. Intangibles"]
["Los intangibles se exponen a su costo incurrido menos las correspondientes amortizaciones acumuladas al cierre del año."]
["Las amortizaciones son calculadas por el método que refleja el patrón de consumo de los beneficios económicos derivados de los intangibles o por el método de línea recta (se explica el método elegido) si el patrón no pudiera ser determinado de forma fiable (NIF 15, párrafo 64). Ver Nota ..."]
["Este rubro incluye costos incurridos por la sociedad relacionados con ingresos futuros."]
[]
[]
["l. Goodwill"]
["El saldo de esta cuenta representa la diferencia entre el valor pagado y el valor razonable de los activos netos adquiridos por la operación de compra de la subsidiaria – Compañía XX."]
["A los efectos de la determinación del monto recuperable, anualmente se efectúa una evaluación del mismo sobre la base de los flujos netos descontados.  En caso que dichos flujos descontados superen el valor contable se procederá al registro de la correspondiente desvalorización del Goodwill."]
["Las estimaciones sobre los flujos de fondos netos son realizadas por la Gerencia sobre la base de las mejores estimaciones disponibles al momento de la preparación de los presentes estados financieros.  Tal como lo establece la NIF 13 emitida por el Consejo de Contadores Públicos del Paraguay, el Goodwill no se amortiza, sino se afecta a resultados por su deterioro según la NIF 18."]
[]
[]
["m. Reconocimiento de ingresos y egresos"]
["Los ingresos y egresos son reconocidos en función de su devengamiento."]
[]
[]
["n. Impuesto a la renta"]
["El impuesto a la renta que se carga a los resultados del año se basa en la utilidad contable antes de este concepto, ajustada por las partidas que la ley incluye o excluye para la determinación de la utilidad gravable a la que se aplica la tasa legal vigente del impuesto y por el reconocimiento del cargo o el ingreso originado por la aplicación del impuesto diferido, si los hubiere. "]
[]
["o. Restricciones a la distribución de utilidades"]
["Deberá mencionarse cualquier  tipo de restricción sobre la distribución de utilidades como ser restricciones estatutarias o de entes reguladores y asambleas."]
[]
["p. Derechos en Fideicomiso"]
["En caso de que la sociedad cuente con Fideicomisos vigentes, deberá exponer claramente en notas a los Estados Financieros, dentro del rubro correspondiente al cual pertenece el bien que ha sido objeto del fideicomiso, ya sea “Créditos/Inventarios u otros activos”, restando al valor del rubro perteneciente, al igual que en la constitución de Fideicomisos de Garantía."]
["Deberá indicarse además los datos del contrato de fideicomiso, del fiduciario, monto, vencimiento. En caso de emisiones a través de un Patrimonio Autónomo, registradas en la CNV, deberán agregar los datos de registro, destino de los fondos, calificación de riesgo si lo tuviere."]
[]
["q. Otros principios, prácticas y métodos"]
["Seguidos en general para cuantificar, valuar y exponer los hechos y bienes económicos en los estados financieros y que fueran relevantes para el lector de los mismos."]
["Obs.: Cambios en políticas contables y su efecto sobre los estados financieros, como así también las modificaciones o ajustes de la información de ejercicios anteriores deben exponerse conforme a lo requerido por la Norma de Información Financiera N° 6 Utilidad o pérdida neta por el período, errores fundamentales y cambios en políticas contables"]

{"sheet":"Nota 3","index":7,"n_rows":20,"n_cols":5,"rows_kept":20,"cut":false,"hidden":false,"merged":[]}
["BEPSA DEL PARAGUAY S.A.E.C.A.",null,null,null,"BG"]
["Obs.: Revelar situación en el caso de contar con disponibilidad restringida"]
[]
[]
[]
[]
["NOTA 3 - EFECTIVO Y EQUIVALENTE DE EFECTIVO"]
[]
["La composición de la cuenta es la siguiente:"]
[]
["Concepto",null,2021,2020]
[]
["Caja"]
["Recaudaciones a depositar",null,2502087.1,3031400]
["Bancos Locales - Moneda local Guaraníes",null,3679646976.0799999,31799234059]
["Bancos Locales - Moneda extranjera Dólares",null,1769799132.9200001,4977330088]
["Bancos Locales - Moneda extranjera otros",null,0,0]
["Bancos en el Extranjero - Moneda extranjera Dólares",null,0,0]
["(nuevas cuentas a incluir)"]
["Total",null,{"$f":"SUM(C14:C19)","v":5451948196.1000004},{"$f":"SUM(D14:D19)","v":36779595547}]

{"sheet":"Nota 4","index":8,"n_rows":18,"n_cols":4,"rows_kept":18,"cut":false,"hidden":false,"merged":[[3,0,3,2],[6,1,6,2]]}
["BEPSA DEL PARAGUAY S.A.E.C.A.",null,null,"BG"]
[]
[]
["NOTA 4 - INVERSIONES TEMPORALES"]
[]
["La composición de la cuenta es la siguiente:"]
[null,"En miles de guaranies"]
["Concepto",2021,2020]
["Inversiones en Titulos del Sistema Financiero Local - Moneda Local Guaraníes",null,5092734233]
["Inversiones en Titulos del Sistema Financiero Local - Moneda Extranjera Dólares"]
["Inversiones en Titulos del Sistema Financiero Local - Moneda Extranjera otros"]
["Inversiones en Mercado Bursatil Local - Moneda Local Guaraníes"]
["Inversiones en Mercado Bursatil Local - Moneda Extranjera Dólares"]
["Inversiones en Mercado Bursatil Extranjera - Moneda Extranjera Dólares"]
["Inversiones en Mercado Bursatil Extranjera - Moneda Extranjera otros"]
["Otras inversiones - Moneda Local Guaraníes"]
["Otras inversiones - Moneda Extranjera Dólares"]
["Total",0,5092734233]

{"sheet":"Nota 5","index":9,"n_rows":54,"n_cols":8,"rows_kept":54,"cut":false,"hidden":false,"merged":[[6,2,6,3],[30,2,30,3]]}
["BEPSA DEL PARAGUAY S.A.E.C.A.",null,null,null,null,"BG"]
["Detallar cartera vencida y no vencida por clientes locales, extranjeros y partes relacionadas"]
["Se indicarán en este rubro todos los créditos a favor de la empresa provenientes de las  ventas de Mercaderías y/o servicios (atendiendo a la actividades ordinarias de  la empresa), separando las ventas locales en moneda nacional y/o extranjera de las ventas fuera del país en moneda nacional  y/o extranjera"]
[]
["NOTA  5 – CUENTAS POR COBRAR COMERCIALES"]
["Las cuentas a cobrar comerciales a corto plazo se integran como sigue:"]
[null,null,"En miles de guaraníes"]
[null,null,2021,2020,null,"Composición de la cartera de créditos por ventas",2021]
["Deudores por ventas locales","Moneda Local Guaraníes",{"$f":"52994397170-C15","v":51977678081},{"$f":"38049372606-D15","v":37468407555},null,"Situación","Monto","% Previsiones  sobre Cartera "]
["Deudores por ventas locales","Moneda Extranjera Dólares",null,null,null,"A  Total Cartera no Vencida",49540539328,0]
["Deudores por ventas locales","Moneda Extranjera otros",null,null,null,"B. Total Cartera Vencida",3453857842]
["Deudores por ventas en el exterior","Moneda Local Guaraníes",null,null,null,"Composición Cartera Vencida"]
["Deudores por ventas en el exterior","Moneda Extranjera Dólares",null,null,null,"Normal",{"$f":"+G11-G14","v":814621574},0]
["Deudores por ventas en el exterior","Moneda Extranjera otros",null,null,null,"En Gestión de Cobro",{"$f":"-G19","v":2639236268},1]
["Deudores - Entidad relacionada","Moneda Local Guaraníes",{"$f":"+'Nota 40'!B12","v":1016719089},{"$f":"+'Nota 40'!C12","v":580965051},null,"En Gestión de Cobro Judicial",0,0]
["Deudores - Entidad relacionada","Moneda Extranjera Dólares"]
["Deudores - Entidad relacionada","Moneda Extranjera otros",null,null,null,"Total de la cartera de créditos (A+B)",{"$f":"+G10+G11","v":52994397170}]
["Cheques adelantados recibidos de clientes","Moneda Local Guaraníes"]
["Cheques adelantados recibidos de clientes","Moneda Extranjera Dólares",null,null,null,"(-) Total Previsiones",-2639236268]
["Cheques adelantados recibidos de clientes","Moneda Extranjera otros"]
["Cheques rechazados","Moneda Local Guaraníes",null,null,null,"TOTAL  NETO DE LA CARTERA DE CRÉDITOS",{"$f":"+G17+G19","v":50355160902}]
["Cheques rechazados","Moneda Extranjera Dólares"]
["Otros","Moneda Local Guaraníes",null,null,null,"Observaciones"]
["Otros","Moneda Extranjera Dólares",null,null,null,"Criterios de Clasificación utilizados","De","A"]
["Otros","Moneda Extranjera otros",null,null,null,"Normal",1,0]
["Menos Previsiones",null,-2639236268,-1397236268,null,"En Gestión de Cobro",31,1]
["Total",null,{"$f":"SUM(C9:C26)","v":50355160902},{"$f":"SUM(D9:D26)","v":36652136338},null,"En Gestión de Cobro Judicial",61,1]
[]
[]
["Las cuentas a cobrar comerciales a largo plazo se integran como sigue:"]
[null,null,"En miles de guaraníes"]
[null,null,2021,2020]
["Deudores por ventas locales","Moneda Local Guaraníes"]
["Deudores por ventas locales","Moneda Extranjera Dólares"]
["Deudores por ventas locales","Moneda Extranjera otros"]
["Deudores por ventas en el exterior","Moneda Local Guaraníes"]
["Deudores por ventas en el exterior","Moneda Extranjera Dólares"]
["Deudores por ventas en el exterior","Moneda Extranjera otros"]
["Deudores - Entidad relacionada","Moneda Local Guaraníes"]
["Deudores - Entidad relacionada","Moneda Extranjera Dólares"]
["Deudores - Entidad relacionada","Moneda Extranjera otros"]
["Cheques adelantados recibidos de clientes","Moneda Local Guaraníes"]
["Cheques adelantados recibidos de clientes","Moneda Extranjera Dólares"]
["Cheques adelantados recibidos de clientes","Moneda Extranjera otros"]
["Deudores en gestión judicial","Moneda Local Guaraníes"]
["Deudores en gestión judicial","Moneda Extranjera Dólares"]
["Deudores en gestión judicial","Moneda Extranjera otros"]
["Cheques rechazados","Moneda Local Guaraníes"]
["Cheques rechazados","Moneda Extranjera Dólares"]
["Otros","Moneda Local Guaraníes"]
["Otros","Moneda Extranjera Dólares"]
["Otros","Moneda Extranjera otros"]
["Menos Previsiones"]
["Total",null,0,0]

{"sheet":"Nota 6","index":10,"n_rows":21,"n_cols":7,"rows_kept":21,"cut":false,"hidden":false,"merged":[]}
["BEPSA DEL PARAGUAY S.A.E.C.A.",null,null,"BG"]
[]
[]
["NOTA 6 - OTROS CRÉDITOS"]
[]
["El rubro de otros créditos se compone como sigue:"]
[]
["Corrientes",null,null,null,"No corrientes"]
[]
["Concepto",2021,2020,null,"Concepto",2021,2020]
["Anticipos a proveedores",3358116584,null,null,"Garantía de Alquiler",102688956]
["Gastos pagados por adelantado",1185163654,736944545,null,"I.V.A. Crédito fiscal"]
["Anticipo Impuesto a la Renta",null,null,null,"Anticipos a proveedores ",0,101075919]
["Retención Impuesto a la Renta",null,null,null,"(nuevas cuentas a incluir)"]
["Retención Impuesto al Valor agregado",null,null,null,"Ceregral S.A.E.C.A.",1006960486,1006960486]
["Deudores Varios",102271120,872989006,null,"Menos: Previsión para Inversiones",-734242005,-482501889]
["Anticipos al personal",0,36676232,null,"Obras de arte",45216917,37944273]
["Creditos Fiscales",4059422192,4331861107,null,"Total",{"$f":"SUM(F11:F17)","v":420624354},{"$f":"SUM(G11:G17)","v":663478789}]
["Menos: Previsión para otros créditos"]
["(nuevas cuentas a incluir)"]
["Total",{"$f":"SUM(B11:B20)","v":8704973550},{"$f":"SUM(C11:C20)","v":5978470890}]

{"sheet":"Nota 7","index":11,"n_rows":15,"n_cols":4,"rows_kept":15,"cut":false,"hidden":false,"merged":[[6,1,6,2],[5,0,5,6],[3,0,3,2]]}
[{"$f":"Indice!C1","v":"BEPSA DEL PARAGUAY S.A.E.C.A."},null,null,"BG"]
[]
[]
["NOTA 7 – INVENTARIOS"]
[]
["Los bienes de cambio están compuestos de la siguiente manera:"]
[null,"En miles de guaranies"]
["Concepto",{"$f":"IFERROR(IF(Indice!B6=\"\",\"2XX2\",YEAR(Indice!B6)),\"2XX2\")","v":2021},{"$f":"IFERROR(YEAR(Indice!B6-365),\"2XX1\")","v":2020}]
["Mercaderías",0,0]
["Productos terminados",0,0]
["Productos en proceso",0,0]
["Materia prima",0,0]
["(nuevas cuentas a incluir)",0,0]
["(-) Previsión para desvalorización y deterioro de inventario",0,0]
["Total ",{"$f":"SUM(B9:B14)","v":0},{"$f":"SUM(C9:C12)","v":0}]

{"sheet":"Nota 8","index":12,"n_rows":18,"n_cols":12,"rows_kept":18,"cut":false,"hidden":false,"merged":[[3,0,3,5]]}
[{"$f":"Indice!C1","v":"BEPSA DEL PARAGUAY S.A.E.C.A."},null,null,"BG"]
[]
[]
["Nota 8 - INVERSIONES EN ASOCIADAS"]
["En miles de guaraníes"]
["Las inversiones en sociedades donde no se ejerce control se describen a continuación"]
["Periodo",{"$f":"IFERROR(IF(Indice!B6=\"\",\"2XX2\",YEAR(Indice!B6)),\"2XX2\")","v":2021},{"$f":"IFERROR(YEAR(Indice!B6-365),\"2XX1\")","v":2020}]
["Total Inversión",{"$f":"SUM($I$13:I18)","v":0},{"$f":"SUM($I$13:J18)","v":0}]
[]
["a) Datos sobre la sociedad:",null,null,null,null,null,"a) Datos sobre la inversión:"]
[null,null,null,{"$f":"IFERROR(IF(Indice!B6=\"\",\"2XX2\",YEAR(Indice!B6)),\"2XX2\")","v":2021}]
["Nombre de Sociedad","RUC","Cantidad de acciones","Total Patrimonio neto","Total del resultado",null,"Cantidad de acciones","Participación sobre los votos (%)","Total Inversión (miles de Gs)","Participación sobre el Patrimonio Neto (%)","Total valuación patrimonial proporcional","Resultado sobre inversiones"]
[null,null,null,null,null,null,null,null,null,null,{"$f":"J13*D13","v":0},{"$f":"J13*E13","v":0}]
[null,null,null,null,null,null,null,null,null,null,0,0]
[null,null,null,null,null,null,null,null,null,null,0,0]
[null,null,null,null,null,null,null,null,null,null,0,0]
[null,null,null,null,null,null,null,null,null,null,0,0]
[null,null,null,null,null,null,null,null,null,null,0,0]

{"sheet":"Nota 9","index":13,"n_rows":33,"n_cols":13,"rows_kept":33,"cut":false,"hidden":false,"merged":[[11,0,11,12]]}
["BEPSA DEL PARAGUAY S.A.E.C.A.",null,null,null,null,null,null,null,null,null,null,"BG"]
[]
[]
[]
["Obs.:"]
["Incluir aclaraciones en los siguientes casos:"]
["1.      Cuando los bienes de uso tienen alguna restricción sobre su utilización, como por ejemplo cuando están garantizando obligaciones. En su caso también hacer referencia a la nota correspondiente."]
["2.      Cuando exista alguna previsión por desvalorización (“deterioro”), detallando la evolución de la misma en el transcurso del año."]
["3.      Si se están capitalizando intereses al costo de bienes de uso. En su caso deberá aclararse la tasa utilizada para la capitalización."]
["Ver adicionalmente Norma de Información Financiera N° 11 Propiedades, planta y equipo"]
[]
["NOTA 9 - PROPIEDADES, PLANTA Y EQUIPO - NETO"]
[null,null,null,null,null,null,null,null,null,-1]
[]
[null,"Costo histórico revaluado al inicio del año","Adquisiciones","Bajas","Revalúo del año","Valor de origen revaluado al final del año","Depreciación acumulada revaluada al inicio del año","Depreciación del año","Bajas de depreciaciones acumuladas","Revalúo depreciación acumulada del año","Depreciación acumulada revaluada al final del año","Valor neto contable"]
[null,null,null,null,null,null,null,null,null,null,null,2021,2020]
["Bienes de uso"]
["Muebles y equipos en general",2499222139,null,null,null,null,1419467370,98639220,null,null,{"$f":"(G18+H18)-I18","v":1518106590},{"$f":"(M18-H18)+C18","v":981115549},{"$f":"+B18-G18","v":1079754769}]
["Maquinarias",11393282351,null,null,null,null,11325879712,1636362,null,null,{"$f":"(G19+H19)-I19","v":11327516074},{"$f":"(M19-H19)+C19","v":65766277},67402639]
["Equipos POS",29475096983,{"$f":"4255563755-3176617632+2485609299","v":3564555422},null,null,null,6786070352,1472779494,null,null,8258849846,24780802559,22689026631]
["Herramientas y equipos",1163441339,null,null,null,null,322415382,68482842,null,null,390898224,772543115,841025957]
["Equipos de informática",10801829163,null,null,null,null,7462726233,806211198,null,null,8268937431,2532891732,3339102930]
["Maquinarias POS",4503269975,null,null,null,null,4503269975,null,null,null,4503269975,0,0]
["Software",4840637903,null,null,null,null,4840637903,null,null,null,4840637903,0,0]
["Automóviles, camionetas, camiones",605624403,null,null,null,null,565740524,3958644,null,null,569699168,35925235,39883879]
["Bienes restantes",16793235376,null,null,null,null,12191153452,540698814,null,null,12731852266,4061383110,4602081924]
["Montajes e instalaciones",1220825160,null,null,null,null,1002343356,18621216,null,null,1020964572,199860588,218481804]
["Derechos adquiridos",405859729,null,null,null,null,405859729,null,null,null,405859729,0,0]
["Constr. o mejoras en predio ajeno",2247137482,null,null,null,null,953450456,73462968,null,null,1026913424,1220224058,1293687026]
["Parcelas Jardín de la Paz",24017721,801939,null,null,null,null,null,0,null,0,24819660,24017721]
["Total",{"$f":"SUM(B18:B30)","v":85973479724},{"$f":"SUM(C18:C30)","v":3565357361},0,0,0,{"$f":"SUM(G18:G30)","v":51779014444},3084490758,0,0,{"$f":"SUM(K18:K30)","v":54863505202},{"$f":"SUM(L18:L30)","v":34675331883},{"$f":"SUM(M18:M30)","v":34194465280}]
[]
[null,null,null,{"$f":"+I31-D31","v":0}]

{"sheet":"Nota 10","index":14,"n_rows":19,"n_cols":3,"rows_kept":19,"cut":false,"hidden":false,"merged":[[7,1,17,2],[4,1,4,2],[11,16120,11,16125],[11,16126,11,16131],[11,16132,11,16137],[11,16138,11,16143],[11,16144,11,16149],[11,16150,11,16155],[11,16084,11,16089],[11,16090,11,16095],[11,16096,11,16101],[11,16102,11,16107],[11,16108,11,16113],[11,16114,11,16119],[11,16048,11,16053],[11,16054,11,16059],[11,16060,11,16065],[11,16066,11,16071],[11,16072,11,16077],[11,16078,11,16083],[11,16012,11,16017],[11,16018,11,16023],[11,16024,11,16029],[11,16030,11,16035],[11,16036,11,16041],[11,16042,11,16047],[11,15976,11,15981],[11,16372,11,16377],[11,16378,11,16381],[11,16336,11,16341],[11,16342,11,16347],[11,16348,11,16353],[11,16354,11,16359],[11,16360,11,16365],[11,16366,11,16371],[11,16300,11,16305],[11,16306,11,16311],[11,16312,11,16317],[11,16318,11,16323],[11,16324,11,16329],[11,16330,11,16335],[11,16264,11,16269],[11,16270,11,16275],[11,16276,11,16281],[11,16282,11,16287],[11,16288,11,16293],[11,16294,11,16299],[11,16228,11,16233],[11,16234,11,16239],[11,16240,11,16245],[11,16246,11,16251],[11,16252,11,16257],[11,16258,11,16263],[11,16192,11,16197],[11,16198,11,16203],[11,16204,11,16209],[11,16210,11,16215],[11,16216,11,16221],[11,16222,11,16227],[11,16156,11,16161],[11,16162,11,16167],[11,16168,11,16173],[11,16174,11,16179],[11,16180,11,16185],[11,16186,11,16191],[11,15982,11,15987],[11,15988,11,15993],[11,15994,11,15999],[11,16000,11,16005],[11,16006,11,16011],[11,15940,11,15945],[11,15946,11,15951],[11,15952,11,15957],[11,15958,11,15963],[11,15964,11,15969],[11,15970,11,15975],[11,15904,11,15909],[11,15910,11,15915],[11,15916,11,15921],[11,15922,11,15927],[11,15928,11,15933],[11,15934,11,15939],[11,15868,11,15873],[11,15874,11,15879],[11,15880,11,15885],[11,15886,11,15891],[11,15892,11,15897],[11,15898,11,15903],[11,15832,11,15837],[11,15838,11,15843],[11,15844,11,15849],[11,15850,11,15855],[11,15856,11,15861],[11,15862,11,15867],[11,15796,11,15801],[11,15802,11,15807],[11,15808,11,15813],[11,15814,11,15819],[11,15820,11,15825],[11,15826,11,15831],[11,15760,11,15765],[11,15766,11,15771],[11,15772,11,15777],[11,15778,11,15783],[11,15784,11,15789],[11,15790,11,15795],[11,15724,11,15729],[11,15730,11,15735],[11,15736,11,15741],[11,15742,11,15747],[11,15748,11,15753],[11,15754,11,15759],[11,15688,11,15693],[11,15694,11,15699],[11,15700,11,15705],[11,15706,11,15711],[11,15712,11,15717],[11,15718,11,15723],[11,15652,11,15657],[11,15658,11,15663],[11,15664,11,15669],[11,15670,11,15675],[11,15676,11,15681],[11,15682,11,15687],[11,15616,11,15621],[11,15622,11,15627],[11,15628,11,15633],[11,15634,11,15639],[11,15640,11,15645],[11,15646,11,15651],[11,15580,11,15585],[11,15586,11,15591],[11,15592,11,15597],[11,15598,11,15603],[11,15604,11,15609],[11,15610,11,15615],[11,15544,11,15549],[11,15550,11,15555],[11,15556,11,15561],[11,15562,11,15567],[11,15568,11,15573],[11,15574,11,15579],[11,15508,11,15513],[11,15514,11,15519],[11,15520,11,15525],[11,15526,11,15531],[11,15532,11,15537],[11,15538,11,15543],[11,15472,11,15477],[11,15478,11,15483],[11,15484,11,15489],[11,15490,11,15495],[11,15496,11,15501],[11,15502,11,15507],[11,15436,11,15441],[11,15442,11,15447],[11,15448,11,15453],[11,15454,11,15459],[11,15460,11,15465],[11,15466,11,15471],[11,15400,11,15405],[11,15406,11,15411],[11,15412,11,15417],[11,15418,11,15423],[11,15424,11,15429],[11,15430,11,15435],[11,15364,11,15369],[11,15370,11,15375],[11,15376,11,15381],[11,15382,11,15387],[11,15388,11,15393],[11,15394,11,15399],[11,15328,11,15333],[11,15334,11,15339],[11,15340,11,15345],[11,15346,11,15351],[11,15352,11,15357],[11,15358,11,15363],[11,15292,11,15297],[11,15298,11,15303],[11,15304,11,15309],[11,15310,11,15315],[11,15316,11,15321],[11,15322,11,15327],[11,15256,11,15261],[11,15262,11,15267],[11,15268,11,15273],[11,15274,11,15279],[11,15280,11,15285],[11,15286,11,15291],[11,15220,11,15225],[11,15226,11,15231],[11,15232,11,15237],[11,15238,11,15243],[11,15244,11,15249],[11,15250,11,15255],[11,15184,11,15189],[11,15190,11,15195],[11,15196,11,15201],[11,15202,11,15207],[11,15208,11,15213],[11,15214,11,15219],[11,15148,11,15153],[11,15154,11,15159],[11,15160,11,15165],[11,15166,11,15171],[11,15172,11,15177],[11,15178,11,15183],[11,15112,11,15117],[11,15118,11,15123],[11,15124,11,15129],[11,15130,11,15135],[11,15136,11,15141],[11,15142,11,15147],[11,15076,11,15081],[11,15082,11,15087],[11,15088,11,15093],[11,15094,11,15099],[11,15100,11,15105],[11,15106,11,15111],[11,15040,11,15045],[11,15046,11,15051],[11,15052,11,15057],[11,15058,11,15063],[11,15064,11,15069],[11,15070,11,15075],[11,15004,11,15009],[11,15010,11,15015],[11,15016,11,15021],[11,15022,11,15027],[11,15028,11,15033],[11,15034,11,15039],[11,14968,11,14973],[11,14974,11,14979],[11,14980,11,14985],[11,14986,11,14991],[11,14992,11,14997],[11,14998,11,15003],[11,14932,11,14937],[11,14938,11,14943],[11,14944,11,14949],[11,14950,11,14955],[11,14956,11,14961],[11,14962,11,14967],[11,14896,11,14901],[11,14902,11,14907],[11,14908,11,14913],[11,14914,11,14919],[11,14920,11,14925],[11,14926,11,14931],[11,14860,11,14865],[11,14866,11,14871],[11,14872,11,14877],[11,14878,11,14883],[11,14884,11,14889],[11,14890,11,14895],[11,14824,11,14829],[11,14830,11,14835],[11,14836,11,14841],[11,14842,11,14847],[11,14848,11,14853],[11,14854,11,14859],[11,14788,11,14793],[11,14794,11,14799],[11,14800,11,14805],[11,14806,11,14811],[11,14812,11,14817],[11,14818,11,14823],[11,14752,11,14757],[11,14758,11,14763],[11,14764,11,14769],[11,14770,11,14775],[11,14776,11,14781],[11,14782,11,14787],[11,14716,11,14721],[11,14722,11,14727],[11,14728,11,14733],[11,14734,11,14739],[11,14740,11,14745],[11,14746,11,14751],[11,14680,11,14685],[11,14686,11,14691],[11,14692,11,14697],[11,14698,11,14703],[11,14704,11,14709],[11,14710,11,14715],[11,14644,11,14649],[11,14650,11,14655],[11,14656,11,14661],[11,14662,11,14667],[11,14668,11,14673],[11,14674,11,14679],[11,14608,11,14613],[11,14614,11,14619],[11,14620,11,14625],[11,14626,11,14631],[11,14632,11,14637],[11,14638,11,14643],[11,14572,11,14577],[11,14578,11,14583],[11,14584,11,14589],[11,14590,11,14595],[11,14596,11,14601],[11,14602,11,14607],[11,14536,11,14541],[11,14542,11,14547],[11,14548,11,14553],[11,14554,11,14559],[11,14560,11,14565],[11,14566,11,14571],[11,14500,11,14505],[11,14506,11,14511],[11,14512,11,14517],[11,14518,11,14523],[11,14524,11,14529],[11,14530,11,14535],[11,14464,11,14469],[11,14470,11,14475],[11,14476,11,14481],[11,14482,11,14487],[11,14488,11,14493],[11,14494,11,14499],[11,14428,11,14433],[11,14434,11,14439],[11,14440,11,14445],[11,14446,11,14451],[11,14452,11,14457],[11,14458,11,14463],[11,14392,11,14397],[11,14398,11,14403],[11,14404,11,14409],[11,14410,11,14415],[11,14416,11,14421],[11,14422,11,14427],[11,14356,11,14361],[11,14362,11,14367],[11,14368,11,14373],[11,14374,11,14379],[11,14380,11,14385],[11,14386,11,14391],[11,14320,11,14325],[11,14326,11,14331],[11,14332,11,14337],[11,14338,11,14343],[11,14344,11,14349],[11,14350,11,14355],[11,14284,11,14289],[11,14290,11,14295],[11,14296,11,14301],[11,14302,11,14307],[11,14308,11,14313],[11,14314,11,14319],[11,14248,11,14253],[11,14254,11,14259],[11,14260,11,14265],[11,14266,11,14271],[11,14272,11,14277],[11,14278,11,14283],[11,14212,11,14217],[11,14218,11,14223],[11,14224,11,14229],[11,14230,11,14235],[11,14236,11,14241],[11,14242,11,14247],[11,14176,11,14181],[11,14182,11,14187],[11,14188,11,14193],[11,14194,11,14199],[11,14200,11,14205],[11,14206,11,14211],[11,14140,11,14145],[11,14146,11,14151],[11,14152,11,14157],[11,14158,11,14163],[11,14164,11,14169],[11,14170,11,14175],[11,14104,11,14109],[11,14110,11,14115],[11,14116,11,14121],[11,14122,11,14127],[11,14128,11,14133],[11,14134,11,14139],[11,14068,11,14073],[11,14074,11,14079],[11,14080,11,14085],[11,14086,11,14091],[11,14092,11,14097],[11,14098,11,14103],[11,14032,11,14037],[11,14038,11,14043],[11,14044,11,14049],[11,14050,11,14055],[11,14056,11,14061],[11,14062,11,14067],[11,13996,11,14001],[11,14002,11,14007],[11,14008,11,14013],[11,14014,11,14019],[11,14020,11,14025],[11,14026,11,14031],[11,13960,11,13965],[11,13966,11,13971],[11,13972,11,13977],[11,13978,11,13983],[11,13984,11,13989],[11,13990,11,13995],[11,13924,11,13929],[11,13930,11,13935],[11,13936,11,13941],[11,13942,11,13947],[11,13948,11,13953],[11,13954,11,13959],[11,13888,11,13893],[11,13894,11,13899],[11,13900,11,13905],[11,13906,11,13911],[11,13912,11,13917],[11,13918,11,13923],[11,13852,11,13857],[11,13858,11,13863],[11,13864,11,13869],[11,13870,11,13875],[11,13876,11,13881],[11,13882,11,13887],[11,13816,11,13821],[11,13822,11,13827],[11,13828,11,13833],[11,13834,11,13839],[11,13840,11,13845],[11,13846,11,13851],[11,13780,11,13785],[11,13786,11,13791],[11,13792,11,13797],[11,13798,11,13803],[11,13804,11,13809],[11,13810,11,13815],[11,13744,11,13749],[11,13750,11,13755],[11,13756,11,13761],[11,13762,11,13767],[11,13768,11,13773],[11,13774,11,13779],[11,13708,11,13713],[11,13714,11,13719],[11,13720,11,13725],[11,13726,11,13731],[11,13732,11,13737],[11,13738,11,13743],[11,13672,11,13677],[11,13678,11,13683],[11,13684,11,13689],[11,13690,11,13695],[11,13696,11,13701],[11,13702,11,13707],[11,13636,11,13641],[11,13642,11,13647],[11,13648,11,13653],[11,13654,11,13659],[11,13660,11,13665],[11,13666,11,13671],[11,13600,11,13605],[11,13606,11,13611],[11,13612,11,13617],[11,13618,11,13623],[11,13624,11,13629],[11,13630,11,13635],[11,13564,11,13569],[11,13570,11,13575],[11,13576,11,13581],[11,13582,11,13587],[11,13588,11,13593],[11,13594,11,13599],[11,13528,11,13533],[11,13534,11,13539],[11,13540,11,13545],[11,13546,11,13551],[11,13552,11,13557],[11,13558,11,13563],[11,13492,11,13497],[11,13498,11,13503],[11,13504,11,13509],[11,13510,11,13515],[11,13516,11,13521],[11,13522,11,13527],[11,13456,11,13461],[11,13462,11,13467],[11,13468,11,13473],[11,13474,11,13479],[11,13480,11,13485],[11,13486,11,13491],[11,13420,11,13425],[11,13426,11,13431],[11,13432,11,13437],[11,13438,11,13443],[11,13444,11,13449],[11,13450,11,13455],[11,13384,11,13389],[11,13390,11,13395],[11,13396,11,13401],[11,13402,11,13407],[11,13408,11,13413],[11,13414,11,13419],[11,13348,11,13353],[11,13354,11,13359],[11,13360,11,13365],[11,13366,11,13371],[11,13372,11,13377],[11,13378,11,13383],[11,13312,11,13317],[11,13318,11,13323],[11,13324,11,13329],[11,13330,11,13335],[11,13336,11,13341],[11,13342,11,13347],[11,13276,11,13281],[11,13282,11,13287],[11,13288,11,13293],[11,13294,11,13299],[11,13300,11,13305],[11,13306,11,13311],[11,13240,11,13245],[11,13246,11,13251],[11,13252,11,13257],[11,13258,11,13263],[11,13264,11,13269],[11,13270,11,13275],[11,13204,11,13209],[11,13210,11,13215],[11,13216,11,13221],[11,13222,11,13227],[11,13228,11,13233],[11,13234,11,13239],[11,13168,11,13173],[11,13174,11,13179],[11,13180,11,13185],[11,13186,11,13191],[11,13192,11,13197],[11,13198,11,13203],[11,13132,11,13137],[11,13138,11,13143],[11,13144,11,13149],[11,13150,11,13155],[11,13156,11,13161],[11,13162,11,13167],[11,13096,11,13101],[11,13102,11,13107],[11,13108,11,13113],[11,13114,11,13119],[11,13120,11,13125],[11,13126,11,13131],[11,13060,11,13065],[11,13066,11,13071],[11,13072,11,13077],[11,13078,11,13083],[11,13084,11,13089],[11,13090,11,13095],[11,13024,11,13029],[11,13030,11,13035],[11,13036,11,13041],[11,13042,11,13047],[11,13048,11,13053],[11,13054,11,13059],[11,12988,11,12993],[11,12994,11,12999],[11,13000,11,13005],[11,13006,11,13011],[11,13012,11,13017],[11,13018,11,13023],[11,12952,11,12957],[11,12958,11,12963],[11,12964,11,12969],[11,12970,11,12975],[11,12976,11,12981],[11,12982,11,12987],[11,12916,11,12921],[11,12922,11,12927],[11,12928,11,12933],[11,12934,11,12939],[11,12940,11,12945],[11,12946,11,12951],[11,12880,11,12885],[11,12886,11,12891],[11,12892,11,12897],[11,12898,11,12903],[11,12904,11,12909],[11,12910,11,12915],[11,12844,11,12849],[11,12850,11,12855],[11,12856,11,12861],[11,12862,11,12867],[11,12868,11,12873],[11,12874,11,12879],[11,12808,11,12813],[11,12814,11,12819],[11,12820,11,12825],[11,12826,11,12831],[11,12832,11,12837],[11,12838,11,12843],[11,12772,11,12777],[11,12778,11,12783],[11,12784,11,12789],[11,12790,11,12795],[11,12796,11,12801],[11,12802,11,12807],[11,12736,11,12741],[11,12742,11,12747],[11,12748,11,12753],[11,12754,11,12759],[11,12760,11,12765],[11,12766,11,12771],[11,12700,11,12705],[11,12706,11,12711],[11,12712,11,12717],[11,12718,11,12723],[11,12724,11,12729],[11,12730,11,12735],[11,12664,11,12669],[11,12670,11,12675],[11,12676,11,12681],[11,12682,11,12687],[11,12688,11,12693],[11,12694,11,12699],[11,12628,11,12633],[11,12634,11,12639],[11,12640,11,12645],[11,12646,11,12651],[11,12652,11,12657],[11,12658,11,12663],[11,12592,11,12597],[11,12598,11,12603],[11,12604,11,12609],[11,12610,11,12615],[11,12616,11,12621],[11,12622,11,12627],[11,12556,11,12561],[11,12562,11,12567],[11,12568,11,12573],[11,12574,11,12579],[11,12580,11,12585],[11,12586,11,12591],[11,12520,11,12525],[11,12526,11,12531],[11,12532,11,12537],[11,12538,11,12543],[11,12544,11,12549],[11,12550,11,12555],[11,12484,11,12489],[11,12490,11,12495],[11,12496,11,12501],[11,12502,11,12507],[11,12508,11,12513],[11,12514,11,12519],[11,12448,11,12453],[11,12454,11,12459],[11,12460,11,12465],[11,12466,11,12471],[11,12472,11,12477],[11,12478,11,12483],[11,12412,11,12417],[11,12418,11,12423],[11,12424,11,12429],[11,12430,11,12435],[11,12436,11,12441],[11,12442,11,12447],[11,12376,11,12381],[11,12382,11,12387],[11,12388,11,12393],[11,12394,11,12399],[11,12400,11,12405],[11,12406,11,12411],[11,12340,11,12345],[11,12346,11,12351],[11,12352,11,12357],[11,12358,11,12363],[11,12364,11,12369],[11,12370,11,12375],[11,12304,11,12309],[11,12310,11,12315],[11,12316,11,12321],[11,12322,11,12327],[11,12328,11,12333],[11,12334,11,12339],[11,12268,11,12273],[11,12274,11,12279],[11,12280,11,12285],[11,12286,11,12291],[11,12292,11,12297],[11,12298,11,12303],[11,12232,11,12237],[11,12238,11,12243],[11,12244,11,12249],[11,12250,11,12255],[11,12256,11,12261],[11,12262,11,12267],[11,12196,11,12201],[11,12202,11,12207],[11,12208,11,12213],[11,12214,11,12219],[11,12220,11,12225],[11,12226,11,12231],[11,12160,11,12165],[11,12166,11,12171],[11,12172,11,12177],[11,12178,11,12183],[11,12184,11,12189],[11,12190,11,12195],[11,12124,11,12129],[11,12130,11,12135],[11,12136,11,12141],[11,12142,11,12147],[11,12148,11,12153],[11,12154,11,12159],[11,12088,11,12093],[11,12094,11,12099],[11,12100,11,12105],[11,12106,11,12111],[11,12112,11,12117],[11,12118,11,12123],[11,12052,11,12057],[11,12058,11,12063],[11,12064,11,12069],[11,12070,11,12075],[11,12076,11,12081],[11,12082,11,12087],[11,12016,11,12021],[11,12022,11,12027],[11,12028,11,12033],[11,12034,11,12039],[11,12040,11,12045],[11,12046,11,12051],[11,11980,11,11985],[11,11986,11,11991],[11,11992,11,11997],[11,11998,11,12003],[11,12004,11,12009],[11,12010,11,12015],[11,11944,11,11949],[11,11950,11,11955],[11,11956,11,11961],[11,11962,11,11967],[11,11968,11,11973],[11,11974,11,11979],[11,11908,11,11913],[11,11914,11,11919],[11,11920,11,11925],[11,11926,11,11931],[11,11932,11,11937],[11,11938,11,11943],[11,11872,11,11877],[11,11878,11,11883],[11,11884,11,11889],[11,11890,11,11895],[11,11896,11,11901],[11,11902,11,11907],[11,11836,11,11841],[11,11842,11,11847],[11,11848,11,11853],[11,11854,11,11859],[11,11860,11,11865],[11,11866,11,11871],[11,11800,11,11805],[11,11806,11,11811],[11,11812,11,11817],[11,11818,11,11823],[11,11824,11,11829],[11,11830,11,11835],[11,11764,11,11769],[11,11770,11,11775],[11,11776,11,11781],[11,11782,11,11787],[11,11788,11,11793],[11,11794,11,11799],[11,11728,11,11733],[11,11734,11,11739],[11,11740,11,11745],[11,11746,11,11751],[11,11752,11,11757],[11,11758,11,11763],[11,11692,11,11697],[11,11698,11,11703],[11,11704,11,11709],[11,11710,11,11715],[11,11716,11,11721],[11,11722,11,11727],[11,11656,11,11661],[11,11662,11,11667],[11,11668,11,11673],[11,11674,11,11679],[11,11680,11,11685],[11,11686,11,11691],[11,11620,11,11625],[11,11626,11,11631],[11,11632,11,11637],[11,11638,11,11643],[11,11644,11,11649],[11,11650,11,11655],[11,11584,11,11589],[11,11590,11,11595],[11,11596,11,11601],[11,11602,11,11607],[11,11608,11,11613],[11,11614,11,11619],[11,11548,11,11553],[11,11554,11,11559],[11,11560,11,11565],[11,11566,11,11571],[11,11572,11,11577],[11,11578,11,11583],[11,11512,11,11517],[11,11518,11,11523],[11,11524,11,11529],[11,11530,11,11535],[11,11536,11,11541],[11,11542,11,11547],[11,11476,11,11481],[11,11482,11,11487],[11,11488,11,11493],[11,11494,11,11499],[11,11500,11,11505],[11,11506,11,11511],[11,11440,11,11445],[11,11446,11,11451],[11,11452,11,11457],[11,11458,11,11463],[11,11464,11,11469],[11,11470,11,11475],[11,11404,11,11409],[11,11410,11,11415],[11,11416,11,11421],[11,11422,11,11427],[11,11428,11,11433],[11,11434,11,11439],[11,11368,11,11373],[11,11374,11,11379],[11,11380,11,11385],[11,11386,11,11391],[11,11392,11,11397],[11,11398,11,11403],[11,11332,11,11337],[11,11338,11,11343],[11,11344,11,11349],[11,11350,11,11355],[11,11356,11,11361],[11,11362,11,11367],[11,11296,11,11301],[11,11302,11,11307],[11,11308,11,11313],[11,11314,11,11319],[11,11320,11,11325],[11,11326,11,11331],[11,11260,11,11265],[11,11266,11,11271],[11,11272,11,11277],[11,11278,11,11283],[11,11284,11,11289],[11,11290,11,11295],[11,11224,11,11229],[11,11230,11,11235],[11,11236,11,11241],[11,11242,11,11247],[11,11248,11,11253],[11,11254,11,11259],[11,11188,11,11193],[11,11194,11,11199],[11,11200,11,11205],[11,11206,11,11211],[11,11212,11,11217],[11,11218,11,11223],[11,11152,11,11157],[11,11158,11,11163],[11,11164,11,11169],[11,11170,11,11175],[11,11176,11,11181],[11,11182,11,11187],[11,11116,11,11121],[11,11122,11,11127],[11,11128,11,11133],[11,11134,11,11139],[11,11140,11,11145],[11,11146,11,11151],[11,11080,11,11085],[11,11086,11,11091],[11,11092,11,11097],[11,11098,11,11103],[11,11104,11,11109],[11,11110,11,11115],[11,11044,11,11049],[11,11050,11,11055],[11,11056,11,11061],[11,11062,11,11067],[11,11068,11,11073],[11,11074,11,11079],[11,11008,11,11013],[11,11014,11,11019],[11,11020,11,11025],[11,11026,11,11031],[11,11032,11,11037],[11,11038,11,11043],[11,10972,11,10977],[11,10978,11,10983],[11,10984,11,10989],[11,10990,11,10995],[11,10996,11,11001],[11,11002,11,11007],[11,10936,11,10941],[11,10942,11,10947],[11,10948,11,10953],[11,10954,11,10959],[11,10960,11,10965],[11,10966,11,10971],[11,10900,11,10905],[11,10906,11,10911],[11,10912,11,10917],[11,10918,11,10923],[11,10924,11,10929],[11,10930,11,10935],[11,10864,11,10869],[11,10870,11,10875],[11,10876,11,10881],[11,10882,11,10887],[11,10888,11,10893],[11,10894,11,10899],[11,10828,11,10833],[11,10834,11,10839],[11,10840,11,10845],[11,10846,11,10851],[11,10852,11,10857],[11,10858,11,10863],[11,10792,11,10797],[11,10798,11,10803],[11,10804,11,10809],[11,10810,11,10815],[11,10816,11,10821],[11,10822,11,10827],[11,10756,11,10761],[11,10762,11,10767],[11,10768,11,10773],[11,10774,11,10779],[11,10780,11,10785],[11,10786,11,10791],[11,10720,11,10725],[11,10726,11,10731],[11,10732,11,10737],[11,10738,11,10743],[11,10744,11,10749],[11,10750,11,10755],[11,10684,11,10689],[11,10690,11,10695],[11,10696,11,10701],[11,10702,11,10707],[11,10708,11,10713],[11,10714,11,10719],[11,10648,11,10653],[11,10654,11,10659],[11,10660,11,10665],[11,10666,11,10671],[11,10672,11,10677],[11,10678,11,10683],[11,10612,11,10617],[11,10618,11,10623],[11,10624,11,10629],[11,10630,11,10635],[11,10636,11,10641],[11,10642,11,10647],[11,10576,11,10581],[11,10582,11,10587],[11,10588,11,10593],[11,10594,11,10599],[11,10600,11,10605],[11,10606,11,10611],[11,10540,11,10545],[11,10546,11,10551],[11,10552,11,10557],[11,10558,11,10563],[11,10564,11,10569],[11,10570,11,10575],[11,10504,11,10509],[11,10510,11,10515],[11,10516,11,10521],[11,10522,11,10527],[11,10528,11,10533],[11,10534,11,10539],[11,10468,11,10473],[11,10474,11,10479],[11,10480,11,10485],[11,10486,11,10491],[11,10492,11,10497],[11,10498,11,10503],[11,10432,11,10437],[11,10438,11,10443],[11,10444,11,10449],[11,10450,11,10455],[11,10456,11,10461],[11,10462,11,10467],[11,10396,11,10401],[11,10402,11,10407],[11,10408,11,10413],[11,10414,11,10419],[11,10420,11,10425],[11,10426,11,10431]],"merged_total":13652,"flags":["merged_cut"]}
[{"$f":"Indice!C1","v":"BEPSA DEL PARAGUAY S.A.E.C.A."},null,"BG"]
[]
[]
["NOTA 10 – ACTIVOS DISPONIBLES PARA LA VENTA"]
[null,"En miles de guaranies"]
[null,{"$f":"IFERROR(IF(Indice!B6=\"\",\"2XX2\",YEAR(Indice!B6)),\"2XX2\")","v":2021},{"$f":"IFERROR(YEAR(Indice!B6-365),\"2XX1\")","v":2020}]
["Propiedad, planta y equipo"]
["(Detallar bienes de uso)","N/A"]
["Total"]
[]
["Activos intangibles"]
["(Detallar activos intangibles)"]
["Total"]
[]
["Inversiones"]
["(Detallar Inversiones"]
["Total"]
[]
["Total general",null,{"$f":"C9+C13+C17","v":0}]

{"sheet":"Nota 11","index":15,"n_rows":15,"n_cols":6,"rows_kept":15,"cut":false,"hidden":false,"merged":[[3,0,3,3],[4,1,4,2]]}
["BEPSA DEL PARAGUAY S.A.E.C.A.",null,null,null,null,"BG"]
[]
[]
["NOTA 11 – ACTIVOS INTANGIBLES"]
[null,"En miles de guaranies"]
["Activos intangibles",2021,2020]
["Desarrollo de Software",14099911201,5655094842]
["Activos Intangibles",9032830399,8462969061]
["Licencias Adquiridas",2263056482,2628484146]
["Amortizaciones"]
["Desarrollo de Software",-3942335389,-2686838835]
["Activos Intangibles",-2733081233,-1199793539]
["Licencias Adquiridas",-1161613973,-273727120]
[]
["Total general",{"$f":"SUM(B7:B14)","v":17558767487},{"$f":"SUM(C7:C14)","v":12586188555}]

{"sheet":"Nota 12","index":16,"n_rows":11,"n_cols":5,"rows_kept":11,"cut":false,"hidden":false,"merged":[[5,1,5,2],[7,1,9,2]]}
[{"$f":"Indice!C1","v":"BEPSA DEL PARAGUAY S.A.E.C.A."},null,null,null,"BG"]
[]
[]
[]
["NOTA 12 – GOODWILL"]
[null,"En miles de guaranies"]
["Goodwill",{"$f":"IFERROR(IF(Indice!B6=\"\",\"2XX2\",YEAR(Indice!B6)),\"2XX2\")","v":2021},{"$f":"IFERROR(YEAR(Indice!B6-365),\"2XX1\")","v":2020}]
[null,"N/A"]
[]
[]
["Total general",{"$f":"SUM(B8:B10)","v":0},{"$f":"SUM(C8:C10)","v":0}]

{"sheet":"Nota 13","index":17,"n_rows":23,"n_cols":5,"rows_kept":23,"cut":false,"hidden":false,"merged":[]}
["BEPSA DEL PARAGUAY S.A.E.C.A.",null,"BG"]
[]
[]
["NOTA 13 – CUENTAS POR PAGAR COMERCIALES"]
["En miles de guaranies"]
["Las cuentas por pagar comerciales se componen como sigue:"]
[]
["Corrientes","Simbología según ISO 4217","Indicación de Moneda",2021,2020]
["Proveedores - Entidades Relacionadas",null,"",2455485682.6962433,209161000]
["Otros proveedores del exterior",null,""]
["Proveedores locales",null,"",42129670190.303757,41899425159.610001]
["Proveedores Dolares",null,null,1559071618,2916525606.000001]
["(nuevas cuentas a incluir)",null,""]
["Total cuentas a pagar por comerciales",null,null,{"$f":"SUM(D9:D13)","v":46144227491},{"$f":"SUM(E9:E13)","v":45025111765.610001}]
[]
[]
[]
["No Corrientes","Simbología según ISO 4217","Indicación de Moneda",2021,2020]
["Proveedores - Entidades Relacionadas",null,""]
["Otros proveedores del exterior",null,""]
["Proveedores locales",null,""]
["(nuevas cuentas a incluir)",null,""]
["Total cuentas a pagar por comerciales",null,null,0,0]

{"sheet":"Nota 14","index":18,"n_rows":59,"n_cols":12,"rows_kept":59,"cut":false,"hidden":false,"merged":[]}
["BEPSA DEL PARAGUAY S.A.E.C.A.",null,null,null,"BG",null,null,null,null,null,null,"BG"]
[]
[]
["NOTA 14 –  PRESTAMOS A CORTO Y LARGO PLAZO"]
[]
["(a) Equivalentes al tipo de cambio referencial de la fecha de presentacion"]
["(b) Obligaciones garantizadas por valor de guaraníens"]
[]
[]
[]
["Corrientes"]
[null,"20X2",null,2021,null,null,null,null,null,2020]
["Préstamos de Entidades Locales","Vencimiento","Símbolo de Moneda","Moneda","Importe (miles de Gs)","Tipo de garantía",null,"Vencimiento","Símbolo de Moneda","Moneda","Importe (miles de Gs)","Tipo de Garantía"]
["Banco Continental S.A.E.C.A.",2023,"PYG","Guaraní",745913200,"quirografario",null,2023,"PYG","Guaraní",1491826395,"quirografario"]
["Nombre de la entidad financiera",null,null,"",null,null,null,null,null,""]
["(incluir otras entidades)",null,null,"",null,null,null,null,null,""]
["Deudas bursátiles",null,null,"",null,null,null,null,null,""]
["* Bonos PG1 S1:10,75% , S2: 11,75%, S3:12,75% y S4: 13,50%"]
["* Bonos PG2 S1:11,75% , S2: 12,50%, S3:13,25% y S4: 14,00%","2021-11-18","PYG","Guaraní",1681232876,"quirografario",null,"2021-11-18","PYG","Guaraní",1858078766,"quirografario"]
["Tarjetas de creditos","N/A","PYG","Guaraní",100001,"quirografario",null,"N/A","PYG","Guaraní",15943498,"quirografario"]
["Sobregiros Bancarios.",null,null,null,null,null,null,"N/A","PYG","Guaraní",67283473.400000006,"quirografario"]
["Préstamos de Entidades en el Exterior",null,null,"",null,null,null,null,null,""]
["Nombre de la entidad financiera",null,null,"",null,null,null,null,null,""]
["Nombre de la entidad financiera",null,null,"",null,null,null,null,null,""]
["(incluir otras entidades)",null,null,"",null,null,null,null,null,""]
["Deudas bursátiles",null,null,"",null,null,null,null,null,""]
["(Incluir programas de forma individual)",null,null,"",null,null,null,null,null,""]
["Intereses préstamos entidades financieras a pagar",null,null,"",null,null,null,null,null,""]
["Banco Continental S.A.E.C.A.",2023,"PYG","Guaraní",-171499960,"quirografario",null,2023,"PYG","Guaraní",-388376624,"quirografario"]
["Intereses a pagar",null,null,"",null,null,null,null,null,""]
["(-) Intereses a Devengar"]
["Intereses deudas bursátiles a pagar",null,null,"",null,null,null,null,null,""]
["Intereses a pagar",null,null,"",null,null,null,null,null,""]
["(-) Intereses a Devengar","2021-11-18","PYG","Guaraní",-93972601,"quirografario",null,"2021-11-18","PYG","Guaraní",-290140410,"quirografario"]
["Total",null,null,"",{"$f":"SUM(E14:E34)","v":2161773516},null,null,null,null,"",{"$f":"SUM(K14:K34)","v":2754615098.4000001}]
[null,null,null,null,null,null,null,null,null,""]
["No Corrientes"]
[null,null,null,2021,null,null,null,null,null,2020]
["Préstamos de Entidades Locales","Vencimiento","Símbolo de Moneda","Moneda","Importe (miles de Gs)","Tipo de Garantía",null,"Vencimiento","Símbolo de Moneda","Moneda","Importe (miles de Gs)","Tipo de Garantía"]
["Banco Continental S.A.E.C.A.",2023,"PYG","Guaraní",2772227098,"quirografario",null,2023,"PYG","Guaraní",3518140295,"quirografario"]
["Nombre de la entidad financiera",null,null,"",null,null,null,null,null,""]
["(incluir otras entidades)",null,null,"",null,null,null,null,null,""]
["Deudas bursátiles",null,null,"",null,null,null,null,null,""]
["* Bonos PG1 S1:10,75% , S2: 11,75%, S3:12,75% y S4: 13,50%",null,null,null,null,null,null,"2021-11-18","PYG","Guaraní",1628876712,"quirografario"]
["* Bonos PG2 S1:11,75% , S2: 12,50%, S3:13,25% y S4: 14,00%"]
["(Incluir programas de forma individual)",null,null,"",null,null,null,null,null,""]
["Préstamos de Entidades en el Exterior",null,null,"",null,null,null,null,null,""]
["Nombre de la entidad financiera",null,null,"",null,null,null,null,null,""]
["Nombre de la entidad financiera",null,null,"",null,null,null,null,null,""]
["(incluir otras entidades)",null,null,"",null,null,null,null,null,""]
["Deudas bursátiles",null,null,"",null,null,null,null,null,""]
["(Incluir programas de forma individual)",null,null,"",null,null,null,null,null,""]
["Intereses préstamos entidades financieras a pagar",null,null,"",null,null,null,null,null,""]
["Intereses a pagar",null,null,"",null,null,null,null,null,""]
["(-) Intereses a Devengar",2023,"PYG","Guaraní",-218051759,"quirografario",null,2023,"PYG","Guaraní",-347439814,"quirografario"]
["Intereses deudas bursátiles a pagar",null,null,""]
["Intereses a pagar",null,null,""]
["(-) Intereses a Devengar",null,null,"",null,null,null,"2021-11-18","PYG","Guaraní",-128876712,"quirografario"]
["Total",null,null,"",{"$f":"SUM(E40:E58)","v":2554175339},null,null,null,null,null,{"$f":"SUM(K40:K58)","v":4670700481}]

{"sheet":"Nota 15","index":19,"n_rows":15,"n_cols":4,"rows_kept":15,"cut":false,"hidden":false,"merged":[[6,1,6,2]]}
["BEPSA DEL PARAGUAY S.A.E.C.A.",null,null,"BG"]
[]
[]
[]
["NOTA 15 – PORCION CORRIENTE DE LA DEUDA A LARGO PLAZO"]
[]
[]
["Porción corriente de la deuda a largo plazo",2021,2020]
["Cuentas por pagar comerciales"]
["Préstamos bancarios",0,0]
["Bonos bursátiles"]
["Intereses bancarios a pagar"]
["Intereses bursatiles a pagar"]
["(nuevas cuentas a incluir)"]
["Total general",0,0]

{"sheet":"Nota 16","index":20,"n_rows":13,"n_cols":6,"rows_kept":13,"cut":false,"hidden":false,"merged":[[5,1,5,2]]}
["BEPSA DEL PARAGUAY S.A.E.C.A.",null,null,null,null,"BG"]
[]
[]
["NOTA 16 – REMUNERACIONES Y CARGAS SOCIALES A PAGAR"]
[]
[]
["Remuneraciones y cargas sociales a pagar",2021,2020]
["Sueldo y otras remuneraciones a pagar"]
["Aportes y retenciones a pagar",298634012,233481780]
["Remuneraciones al personal superior a pagar"]
["Provisiones contables ",463585408,966024148]
["(Indicar otras cuentas)"]
["Total",{"$f":"SUM(B9:B12)","v":762219420},{"$f":"SUM(C9:C12)","v":1199505928}]

{"sheet":"Nota 17","index":21,"n_rows":12,"n_cols":7,"rows_kept":12,"cut":false,"hidden":false,"merged":[[6,1,6,2]]}
[{"$f":"Indice!C1","v":"BEPSA DEL PARAGUAY S.A.E.C.A."},null,null,null,null,null,"BG"]
[]
[]
[]
["NOTA 17 –  IMPUESTOS A PAGAR"]
[]
[]
["Impuestos a pagar",{"$f":"IFERROR(IF(Indice!B6=\"\",\"2XX2\",YEAR(Indice!B6)),\"2XX2\")","v":2021},{"$f":"IFERROR(YEAR(Indice!B6-365),\"2XX1\")","v":2020}]
["Impuesto a la renta a pagar",null,0]
["Otros impuestos a pagar"]
["(Indicar otros impuestos)"]
["Total",{"$f":"SUM($B$9:B11)","v":0},{"$f":"SUM($C$9:C11)","v":0}]

{"sheet":"Nota 18","index":22,"n_rows":13,"n_cols":4,"rows_kept":13,"cut":false,"hidden":false,"merged":[[3,0,3,3],[6,0,7,0],[5,1,5,2]]}
[{"$f":"Indice!C1","v":"BEPSA DEL PARAGUAY S.A.E.C.A."},null,null,"BG"]
[]
[]
["NOTA 18 -  PROVISIONES"]
[]
[]
["Provisiones",{"$f":"IFERROR(IF(Indice!B6=\"\",\"2XX2\",YEAR(Indice!B6)),\"2XX2\")","v":2021},{"$f":"IFERROR(YEAR(Indice!B6-365),\"2XX1\")","v":2020}]
[]
["Alquileres a Pagar"]
["Servicios Basicos a Pagar"]
["Honorarios Profesionales a Pagar"]
["(Indicar cuentas)"]
["Total",{"$f":"SUM($B$9:B12)","v":0},{"$f":"SUM($C$9:C12)","v":0}]

{"sheet":"Nota 19","index":23,"n_rows":17,"n_cols":7,"rows_kept":17,"cut":false,"hidden":false,"merged":[[3,0,3,1]]}
[{"$f":"Indice!C1","v":"BEPSA DEL PARAGUAY S.A.E.C.A."},null,null,"BG"]
[]
["NOTA 19 – OTROS PASIVOS CORRIENTES y NO CORRIENTES"]
[]
[]
["Corrientes",2021,2020,null,"No Corrientes",2021,2020]
["Retencion de IVA a pagar",null,null,null,"Retencion de IVA a pagar"]
["Retencion Impuesto a la renta a Pagar",null,null,null,"Retencion Impuesto a la renta a Pagar"]
["Impuestos diferidos",null,null,null,"Impuestos diferidos"]
["Otros ingresos diferidos (detallar cuenta)",null,null,null,"Otros ingresos diferidos"]
["Otros Pasivos con Entidades relacionadas ",null,null,null,"Otros Pasivos con Entidades relacionadas "]
["Previsiones para contingencias/Indemnizaciones y despidos",null,null,null,"Previsiones para contingencias/Indemnizaciones y despidos"]
["(nuevas cuentas a incluir)",null,null,null,"(nuevas cuentas a incluir)"]
["Dividendos a distribuir",200563452.99000001,320842101.99000001]
["Acreedores fiscales",1668445382,1775544141]
["Acreedores varios",{"$f":"10673273740+12017786","v":10685291526},21779416700]
["Total ",{"$f":"SUM(B14:B16)","v":12554300360.99},{"$f":"SUM(C14:C16)","v":23875802942.990002},null,"Total ",0,0]

{"sheet":"Nota 20","index":24,"n_rows":11,"n_cols":4,"rows_kept":11,"cut":false,"hidden":false,"merged":[[3,0,3,3]]}
[{"$f":"Indice!C1","v":"BEPSA DEL PARAGUAY S.A.E.C.A."},null,null,"BG"]
[]
[]
["NOTA 20 – CAPITAL INTEGRADO"]
[]
["Fecha",2021,2020]
["Monto Capital Social"]
["Monto Capital Integrado",41500000000,38855800000]
["Cantidad de Acciones",415000,388558]
["Valor Nominal de Acciones",100000,100000]
["Total",41500000000,38855800000]

{"sheet":" Nota 21","index":25,"n_rows":24,"n_cols":6,"rows_kept":24,"cut":false,"hidden":false,"merged":[[3,0,3,5],[5,1,5,2]]}
[{"$f":"Indice!C1","v":"BEPSA DEL PARAGUAY S.A.E.C.A."},null,null,null,null,"BG"]
[]
[]
["NOTA 21 – RESERVAS"]
[]
[null,"En miles de guaranies"]
[null,2021,2020]
["a  Reserva de revalúo",9420414506,4633572953]
[]
[]
[]
[]
["b Reserva legal",1277694431,1272442740]
[]
[]
[]
[]
["c Reservas estatutarias"]
[]
[]
[]
["d Reservas facultativas",989026484,889244362]
["d.1. (nuevas cuentas a incluir)"]
["d.2. (nuevas cuentas a incluir)"]

{"sheet":"Nota 22","index":26,"n_rows":8,"n_cols":6,"rows_kept":8,"cut":false,"hidden":false,"merged":[[5,1,5,2],[7,1,7,2]]}
[{"$f":"Indice!C1","v":"BEPSA DEL PARAGUAY S.A.E.C.A."},null,null,null,null,"BG"]
[]
[]
["NOTA 21 –  DIFERENCIA TRANSITORIA POR CONVERSION"]
[]
[null,"En miles de guaranies"]
[null,{"$f":"IFERROR(IF(Indice!B6=\"\",\"2XX2\",YEAR(Indice!B6)),\"2XX2\")","v":2021},{"$f":"+IFERROR(YEAR(Indice!B6-365),\"2XX1\")","v":2020}]
["Diferencia transitoria por conversión","N/A"]

{"sheet":"Nota 23","index":27,"n_rows":10,"n_cols":6,"rows_kept":10,"cut":false,"hidden":false,"merged":[[5,1,5,2]]}
[{"$f":"Indice!C1","v":"BEPSA DEL PARAGUAY S.A.E.C.A."},null,null,null,null,"BG"]
[]
[]
["NOTA 23 –  RESULTADOS ACUMULADOS"]
[]
[]
[null,2021,2020]
["Resultado de ejercicios anteriores",null,0]
["Resultado del ejercicio actual",{"$f":"+BG!F56","v":-4441025176},4529191819]
["Totales",{"$f":"+B9","v":-4441025176},{"$f":"+C8+C9","v":4529191819}]

{"sheet":"Nota 24","index":28,"n_rows":8,"n_cols":6,"rows_kept":8,"cut":false,"hidden":false,"merged":[[5,1,5,2]]}
[{"$f":"Indice!C1","v":"BEPSA DEL PARAGUAY S.A.E.C.A."},null,null,null,null,"BG"]
[]
[]
["NOTA 24 –  INTERES MINORITARIO"]
[]
[]
[null,{"$f":"IFERROR(IF(Indice!B6=\"\",\"2XX2\",YEAR(Indice!B6)),\"2XX2\")","v":2021},{"$f":"+IFERROR(YEAR(Indice!B6-365),\"2XX1\")","v":2020}]
["Interes Minoritario"]

{"sheet":"Nota 25","index":29,"n_rows":26,"n_cols":5,"rows_kept":26,"cut":false,"hidden":false,"merged":[[7,1,7,2]]}
[{"$f":"Indice!C1","v":"BEPSA DEL PARAGUAY S.A.E.C.A."},null,null,null,"ER"]
[]
[]
[]
["NOTA 25 –  VENTAS"]
[]
[]
[null,"En miles de guaranies"]
[null,2021,2020]
["Ventas"]
["Ventas linea de negocio 1"]
["Local",35341521923,34093017511]
["Contado",{"$f":"+B12-B14","v":32304905772},{"$f":"+C12-C14","v":31865576110.119999}]
["Crédito",3036616151,2227441400.8800001]
["Exterior"]
["Contado"]
["Crédito"]
["Ventas linea de negocio 2"]
["Local"]
["Contado"]
["Crédito"]
["Exterior"]
["Contado"]
["Crédito"]
["(nuevas lineas de negocio a incluir)"]
["Total",{"$f":"+B12","v":35341521923},{"$f":"+C12","v":34093017511}]

{"sheet":"Nota 26","index":30,"n_rows":21,"n_cols":5,"rows_kept":21,"cut":false,"hidden":false,"merged":[[4,0,4,5],[6,1,6,2],[7,1,7,2]]}
[{"$f":"Indice!C1","v":"BEPSA DEL PARAGUAY S.A.E.C.A."},null,null,null,"ER"]
[]
[]
[]
["NOTA 26 - COSTO DE VENTAS"]
[]
[]
[]
["Costo de ventas",2021,2020]
["Linea de negocio 1"]
["Existencia inicial del inventario"]
["+ Compra de bienes y servicios",17747209703,15870510620]
["+ Costo de producción"]
["- Existencia final de inventario"]
["Linea de negocio 2"]
["Existencia inicial del inventario"]
["+ Compra de bienes y servicios"]
["+ Costo de producción"]
["- Existencia final de inventario"]
["(nuevas lineas de negocio a incluir)"]
["Total costo de ventas",{"$f":"SUM(B11:B20)","v":17747209703},{"$f":"SUM(C11:C20)","v":15870510620}]

{"sheet":"Nota 27","index":31,"n_rows":35,"n_cols":7,"rows_kept":35,"cut":false,"hidden":false,"merged":[[5,0,5,7],[10,0,11,0]]}
[{"$f":"Indice!C1","v":"BEPSA DEL PARAGUAY S.A.E.C.A."},null,null,null,null,null,"ER"]
[]
[]
[]
["NOTA 27 - GASTOS"]
["(Esta nota deberá ser incluida cuando en el estado de resultados se haga mención a una cuenta de carácter general o cuyo nombre no permita una adecuada identificación de la naturaleza del gasto y su importe sea significativo) "]
[]
["El rubro está compuesto de la siguiente forma: "]
[]
[]
[null,null,2021,null,null,2020]
[null,"Gastos de Ventas","Gastos Administrativos","Total","Gastos de Ventas","Gastos Administrativos","Total"]
["Honorarios y remuneraciones por servicios",null,806473618,{"$f":"+B13+C13","v":806473618},null,335611070,{"$f":"+E13+F13","v":335611070}]
["Sueldos y otras remuneraciones",null,7424628947,{"$f":"+B14+C14","v":7424628947},null,5736442745,{"$f":"+E14+F14","v":5736442745}]
["Contribuciones sociales",null,1081277949,1081277949,null,1097462150,1097462150]
["Capacitación al personal y seguro médico",null,302239801,302239801,null,191987592,191987592]
["Alquiler pagados",null,1216405576,1216405576,null,1028653328,1028653328]
["Manten. y reparación de Bienes de Uso",null,597752876,597752876,null,224613592,224613592]
["Depreciaciones de bienes de uso",null,3084490758,3084490758,null,1809592506,1809592506]
["Amortizaciones",null,2187006607,2187006607,null,1127447439,1127447439]
["Agua, luz y telefono",null,162933619,162933619,null,286986675,286986675]
["Gastos de correspondencia",null,33750668,33750668,null,null,0]
["Papelería y útiles",null,27816693,27816693,null,26083486,26083486]
["Impuestos, tasas y patentes",null,477508194,477508194,null,164083138,164083138]
["Gastos comerciales",209138676,null,209138676,222113396,null,222113396]
["Gastos de representación",88750233,null,88750233,108926985,null,108926985]
["Int.,Com., Dif. de Cambio y Otras Pérd.",null,null,0,null,null,0]
["Previsiones",953870058,null,953870058,null,363826744,363826744]
["Costos por unidades de negocio",null,null,0,null,null,0]
["Otros Costos",null,null,0,null,null,0]
["Otros Gastos",null,1172552088,1172552088,null,966800625,966800625]
["Gastos de Estructura",null,null,0,null,null,0]
["Egresos no operativos",null,2400000000,2400000000,null,null,0]
["(nuevas cuentas a incluir)",null,null,0,null,null,0]
["Total",{"$f":"SUM(B13:B34)","v":1251758967},20974837394,22226596361,331040381,13359591090,13690631471]

{"sheet":"Nota 28","index":32,"n_rows":10,"n_cols":7,"rows_kept":10,"cut":false,"hidden":false,"merged":[[3,0,3,4],[5,1,5,2]]}
[{"$f":"Indice!C1","v":"BEPSA DEL PARAGUAY S.A.E.C.A."},null,null,null,"ER"]
[]
[]
["Nota 28 - Otros Ingresos y gastos operativos"]
[]
[]
[]
["Otros ingresos",{"$f":"IFERROR(IF(Indice!B6=\"\",\"2XX2\",YEAR(Indice!B6)),\"2XX2\")","v":2021},{"$f":"+IFERROR(YEAR(Indice!B6-365),\"2XX1\")","v":2020},null,"Otros gastos",{"$f":"IFERROR(IF(Indice!B6=\"\",\"2XX2\",YEAR(Indice!B6)),\"2XX2\")","v":2021},{"$f":"+IFERROR(YEAR(Indice!B6-365),\"2XX1\")","v":2020}]
["(Detallar cuenta)",null,null,null,"(Detallar cuenta)"]
["Total",{"$f":"SUM($B$9:B9)","v":0},{"$f":"SUM($C$9:C9)","v":0},null,"Total",{"$f":"SUM($F$9:F9)","v":0},{"$f":"SUM($G$9:G9)","v":0}]

{"sheet":"Nota 29","index":33,"n_rows":14,"n_cols":7,"rows_kept":14,"cut":false,"hidden":false,"merged":[]}
[{"$f":"Indice!C1","v":"BEPSA DEL PARAGUAY S.A.E.C.A."},null,null,null,"ER"]
[]
[]
[]
["NOTA 29 - INGRESOS Y GASTOS FINANCIEROS NETOS"]
[]
[]
["Ingresos Financieros netos",{"$f":"IFERROR(IF(Indice!B6=\"\",\"2XX2\",YEAR(Indice!B6)),\"2XX2\")","v":2021},{"$f":"+IFERROR(YEAR(Indice!B6-365),\"2XX1\")","v":2020},null,"Gastos Financieros netos",{"$f":"IFERROR(IF(Indice!B6=\"\",\"2XX2\",YEAR(Indice!B6)),\"2XX2\")","v":2021},{"$f":"+IFERROR(YEAR(Indice!B6-365),\"2XX1\")","v":2020}]
["(Detallar cuentas)",null,null,null,"(Detallar cuentas)"]
["Otros ingresos",485598113,1074337526,null,"Diferencia de cambio",null,95059408]
["Diferencia de cambio",99914803,null,null,"Gastos e intereses bancarios",394253951,469461719]
[]
[]
["Total ingresos financieros",{"$f":"SUM($B9:B13)","v":585512916},{"$f":"SUM($C9:C13)","v":1074337526},null,"Total gastos financieros",{"$f":"SUM($F9:F13)","v":394253951},{"$f":"SUM($G9:G13)","v":564521127}]

{"sheet":"Nota 30","index":34,"n_rows":16,"n_cols":5,"rows_kept":16,"cut":false,"hidden":false,"merged":[[5,1,5,2]]}
[{"$f":"Indice!C1","v":"BEPSA DEL PARAGUAY S.A.E.C.A."},null,null,null,"ER"]
[]
[]
["Nota 34 - Resultado de inversiones en asociadas"]
[]
[]
[]
["Resultado de inversiones en asociadas",{"$f":"IFERROR(IF(Indice!B6=\"\",\"2XX2\",YEAR(Indice!B6)),\"2XX2\")","v":2021},{"$f":"+IFERROR(YEAR(Indice!B6-365),\"2XX1\")","v":2020}]
["(Detallar cuenta)",0,0]
[]
[]
[]
[]
[]
[]
["Total",{"$f":"SUM($B9:B15)","v":0},{"$f":"SUM($C9:C15)","v":0}]

{"sheet":"Nota 31","index":35,"n_rows":16,"n_cols":5,"rows_kept":16,"cut":false,"hidden":false,"merged":[[4,0,4,1],[5,1,5,2]]}
[{"$f":"Indice!C1","v":"BEPSA DEL PARAGUAY S.A.E.C.A."},null,null,null,"ER"]
[]
[]
["Nota 31 - Resultado participación minoritaria"]
[]
[]
[]
["Resultado participación minoritaria",{"$f":"IFERROR(IF(Indice!B6=\"\",\"2XX2\",YEAR(Indice!B6)),\"2XX2\")","v":2021},{"$f":"+IFERROR(YEAR(Indice!B6-365),\"2XX1\")","v":2020}]
["(Detallar cuenta)"]
[]
[]
[]
[]
[]
[]
["Total",{"$f":"SUM($B9:B15)","v":0},{"$f":"SUM($C9:C15)","v":0}]

{"sheet":"Nota 32","index":36,"n_rows":14,"n_cols":5,"rows_kept":14,"cut":false,"hidden":false,"merged":[[5,1,5,2]]}
[{"$f":"Indice!C1","v":"BEPSA DEL PARAGUAY S.A.E.C.A."},null,null,null,"ER"]
[]
[]
["Nota 32 - IMPUESTO A LA RENTA"]
[]
[]
[null,{"$f":"IFERROR(IF(Indice!B6=\"\",\"2XX2\",YEAR(Indice!B6)),\"2XX2\")","v":2021},{"$f":"+IFERROR(YEAR(Indice!B6-365),\"2XX1\")","v":2020}]
["Impuesto a la renta",0,512500000]
[]
[]
[]
[]
[]
["Total",{"$f":"SUM($B8:B13)","v":0},{"$f":"SUM($C8:C13)","v":512500000}]

{"sheet":"Nota 33","index":37,"n_rows":15,"n_cols":5,"rows_kept":15,"cut":false,"hidden":false,"merged":[[4,0,4,1]]}
[{"$f":"Indice!C1","v":"BEPSA DEL PARAGUAY S.A.E.C.A."},null,null,null,"ER"]
[]
[]
["Nota 33 - Resultado extraordinario neto de impuesto a la renta"]
[]
[]
[null,{"$f":"IFERROR(IF(Indice!B6=\"\",\"2XX2\",YEAR(Indice!B6)),\"2XX2\")","v":2021},{"$f":"+IFERROR(YEAR(Indice!B6-365),\"2XX1\")","v":2020}]
["Conceptos"]
["(Detallar)"]
[]
[]
[]
[]
[]
["Total",{"$f":"SUM($B8:B14)","v":0},{"$f":"SUM($C8:C14)","v":0}]

{"sheet":"Nota 34","index":38,"n_rows":12,"n_cols":5,"rows_kept":12,"cut":false,"hidden":false,"merged":[[4,0,4,1]]}
[{"$f":"Indice!C1","v":"BEPSA DEL PARAGUAY S.A.E.C.A."},null,null,null,"ER"]
[]
[]
["Nota 34 - Resultado sobre actividades discontinuadas neto de impuesto a la renta"]
[]
[]
["Resultado sobre actividades discontinuadas neto de impuesto a la renta",{"$f":"IFERROR(IF(Indice!B6=\"\",\"2XX2\",YEAR(Indice!B6)),\"2XX2\")","v":2021},{"$f":"+IFERROR(YEAR(Indice!B6-365),\"2XX1\")","v":2020}]
[]
["(nueva cuenta a incluir)"]
["Subtotal"]
["- Impuesto a la renta"]
["Total",{"$f":"SUM($B8:B11)","v":0},{"$f":"SUM($C8:C11)","v":0}]

{"sheet":"Nota 35","index":39,"n_rows":10,"n_cols":5,"rows_kept":10,"cut":false,"hidden":false,"merged":[]}
[{"$f":"Indice!C1","v":"BEPSA DEL PARAGUAY S.A.E.C.A."},null,null,null,"ER"]
[]
[]
["NOTA 35- UTILIDAD (PÉRDIDA) NETA DEL AÑO Y POR ACCION ORDINARIA"]
["La Sociedad calcula la utilidad (pérdida) neta por acción sobre la base de la utilidad (pérdida) del año y … acciones ordinarias (aclarar las características de las acciones) de valor nominal G/ …cada una con derecho a … voto por acción (aclarar el derecho de voto que tiene cada tipo de acción)."]
[]
[null,{"$f":"IFERROR(IF(Indice!B6=\"\",\"2XX2\",YEAR(Indice!B6)),\"2XX2\")","v":2021},{"$f":"+IFERROR(YEAR(Indice!B6-365),\"2XX1\")","v":2020}]
["Cantidad de Acciones Ordinarias en Circulación",{"$f":"+BG!F47/100000","v":415000},{"$f":"+BG!G47/100000","v":388558}]
["Utilidad Neta",{"$f":"ER!C31","v":-4441025176},{"$f":"ER!D31","v":4529191819}]
["Utilidad Neta por Acción Ordinaria",{"$f":"+ER!C32","v":-10701.265484337349},{"$f":"+ER!D32","v":11656.411189577875}]

{"sheet":"Nota 36","index":40,"n_rows":18,"n_cols":5,"rows_kept":18,"cut":false,"hidden":false,"merged":[[5,0,5,8],[3,0,3,4],[10,0,10,4],[17,0,17,4]]}
[{"$f":"Indice!C1","v":"BEPSA DEL PARAGUAY S.A.E.C.A."},null,null,null,"Indice"]
[]
[]
["NOTA 36 - ACTIVOS GRAVADOS"]
[]
["Los siguientes bienes de propiedad de la Sociedad han sido hipotecados y prendados en garantía de obligaciones financieras."]
[]
[{"$f":"IFERROR(\"Al \"&DAY(Indice!B6)&\" de \"&VLOOKUP(MONTH(Indice!B6),Indice!S:T,2,0)&\" de \"&YEAR(Indice!B6-365),\"Al dia... de mes… de año 2XX1…\")","v":"Al 30 de Junio de 2020"}]
["Tipo de Activo","Datos  del activo gravado","Tipo de garantía","Importe (indicar   moneda)","A favor de"]
[]
["N/A"]
[]
[]
[]
[{"$f":"IFERROR(\"Al \"&DAY(Indice!B6)&\" de \"&VLOOKUP(MONTH(Indice!B6),Indice!S:T,2,0)&\" de \"&YEAR(Indice!B6-1),\"Al dia... de mes… de año 2XX2…\")","v":"Al 30 de Junio de 2021"}]
["Tipo de Activo","Datos  del activo gravado","Tipo de garantía","Importe (indicar   moneda)","A favor de"]
[]
["N/A"]

{"sheet":"Nota 37","index":41,"n_rows":15,"n_cols":5,"rows_kept":15,"cut":false,"hidden":false,"merged":[[14,0,14,7],[4,0,4,8],[5,0,5,8],[10,0,11,7]]}
[{"$f":"Indice!C1","v":"BEPSA DEL PARAGUAY S.A.E.C.A."},null,null,null,"Indice"]
[]
[]
["NOTA 37 - CONTINGENCIAS Y COMPROMISOS "]
["(Esta nota debería incluir un breve detalle de contratos con terceros, vigente a la fecha de cierre del ejercicio, cuyo incumplimiento o cláusula específica podrían generar obligaciones contingentes para el cliente). "]
[{"$f":"IFERROR(\"Los principales contratos suscriptos por la Sociedad, vigentes al  \"&DAY(Indice!B6)&\" de \"&VLOOKUP(MONTH(Indice!B6),Indice!S:T,2,0)&\" de \"&YEAR(Indice!B6-1)&\" son:\",\"Los principales contratos suscriptos por la Sociedad, vigentes al … de …  20X2 son:\")","v":"Los principales contratos suscriptos por la Sociedad, vigentes al  30 de Junio de 2021 son:"}]
["a) N/A"]
["b) N/A"]
[]
[]
[{"$f":"IFERROR(\"Al  \"&DAY(Indice!B6)&\" de \"&VLOOKUP(MONTH(Indice!B6),Indice!S:T,2,0)&\" de \"&YEAR(Indice!B6-1)&\" no existen situaciones contingentes, ni reclamos que pudieran resultar en la generación de obligaciones para la Sociedad adicionales a las que se presentan en estos estados financieros.\",\"Al … de …………... 20X2 no existen situaciones contingentes, ni reclamos que pudieran resultar en la generación de obligaciones para la Sociedad adicionales a las que se presentan en estos estados financieros.\")","v":"Al  30 de Junio de 2021 no existen situaciones contingentes, ni reclamos que pudieran resultar en la generación de obligaciones para la Sociedad adicionales a las que se presentan en estos estados financieros."}]
[]
[]
[]
["Obs.: Esta información debe estar ajustada  a lo requerido por la Norma de Información Financiera N° 5 Contingencias y sucesos que ocurren después de la fecha del balance. "]

{"sheet":"Nota 38","index":42,"n_rows":25,"n_cols":4,"rows_kept":25,"cut":false,"hidden":false,"merged":[[3,0,3,6],[5,0,5,6],[6,0,6,6],[8,0,8,6],[11,1,22,2]]}
[{"$f":"Indice!C1","v":"BEPSA DEL PARAGUAY S.A.E.C.A."},null,null,"Índice"]
[]
[]
["NOTA 38 - IMPUESTO DIFERIDO"]
[]
["Al 30 de junio 2021 la Sociedad constituyó una provisión para impuesto a la renta de Guaraníes  (Al 30 de  junio 2021:  Guaraníes cero) / (La Sociedad no ha constituido provisión para impuesto a la renta, debido a que a esa fecha la misma generó renta imponible que fue compensada con quebrantos impositivos acumulados a esa fecha). "]
["La Sociedad contabiliza el impuesto a la renta por el método de lo diferido, método del pasivo. El mencionado método establece la determinación de activos o pasivos impositivos diferidos netos basados en las diferencias temporales y temporarias, con cargo a la línea Impuesto a la renta del Estado de resultados."]
[]
["El siguiente cuadro detalla las diferencias temporales a la tasa del impuesto a los efectos de determinación del impuesto diferido:"]
[]
[null,{"$f":"IFERROR(IF(Indice!B6=\"\",\"2XX2\",YEAR(Indice!B6)),\"2XX2\")","v":2021},{"$f":"+IFERROR(YEAR(Indice!B6-365),\"2XX1\")","v":2020}]
["Activos y pasivos impositivos diferidos: ","N/A"]
["Caja y Bancos"]
["Inversiones"]
["Previsión para deudores incobrables"]
["Bienes de uso"]
["Activos intangibles"]
["Previsión del pasivo"]
["Deudas comerciales y bancarias"]
["Bienes de cambio"]
["Sub - total  "]
["Previsión para impuestos diferidos netos "]
["Total activo/pasivo impositivo diferido neto antes de quebrantos"]
["Quebranto impositivo"]
["Total"]

{"sheet":"Nota 39","index":43,"n_rows":9,"n_cols":5,"rows_kept":9,"cut":false,"hidden":false,"merged":[[5,0,5,8],[8,0,8,8],[12,0,12,8]]}
[{"$f":"Indice!C1","v":"BEPSA DEL PARAGUAY S.A.E.C.A."},null,null,null,"Indice"]
[]
[]
[]
["NOTA 39 - HECHOS POSTERIORES"]
["(En caso en que entre la fecha del cierre del ejercicio y la fecha de emisión de los estados financieros existan hechos posteriores significativos deberá evaluarse el tipo de hecho posterior del que se trate y modificar esta nota según corresponda)."]
[]
[]
["Entre la fecha de cierre del ejercicio y la fecha de preparación de estos estados financieros, no han ocurrido hechos significativos de carácter financiero o de otra índole que afecten la situación patrimonial o financiera o los resultados de la Sociedad al 30 de junio 2021."]

{"sheet":"Nota 40","index":44,"n_rows":35,"n_cols":3,"rows_kept":35,"cut":false,"hidden":false,"merged":[[7,0,7,6],[30,0,30,5]]}
[{"$f":"Indice!C1","v":"BEPSA DEL PARAGUAY S.A.E.C.A."},null,"Indice"]
[]
[]
[]
["NOTA 40 - SALDOS Y TRANSACCIONES CON PARTES RELACIONADAS"]
[]
[]
[]
[]
[null,{"$f":"IFERROR(IF(Indice!B6=\"\",\"2XX2\",YEAR(Indice!B6)),\"2XX2\")","v":2021},{"$f":"+IFERROR(YEAR(Indice!B6-365),\"2XX1\")","v":2020}]
["ACTIVO"]
["Creditos por Ventas",{"$f":"+B13+B14","v":1016719089},{"$f":"+C13+C14","v":580965051}]
["Banco Continental S.A.E.C.A.",1002395645]
["Procard S.A.",14323444,580965051]
["Inversiones temporales"]
["Cuentas a cobrar comerciales"]
["Otros créditos"]
["Total activo",{"$f":"+B12","v":1016719089},{"$f":"+C12","v":580965051}]
["PASIVO"]
["Cuentas por pagar comerciales",{"$f":"+B21+B22","v":2455485682.6962433},{"$f":"+C21+C22","v":209161000}]
["Procard S.A.",442506981,209161000]
["Banco Continental S.A.E.C.A.",2012978701.6962433]
["Préstamos a corto plazo",{"$f":"+B24","v":574413240},{"$f":"+C24","v":1491826395}]
["Banco Continental S.A.E.C.A.",{"$f":"+'Nota 14'!E14+'Nota 14'!E29","v":574413240},1491826395]
["Provisiones"]
["Préstamos a largo plazo",{"$f":"+B27","v":2554175339},{"$f":"+C27","v":3518140295}]
["Banco Continental S.A.E.C.A.",{"$f":"+'Nota 14'!E59","v":2554175339},3518140295]
["Otros pasivos"]
["Total pasivo",{"$f":"+B20+B23+B26","v":5584074261.6962433},{"$f":"+C20+C23+C26","v":5219127690}]
[]
[]
[]
[null,{"$f":"IFERROR(IF(Indice!B6=\"\",\"2XX2\",YEAR(Indice!B6)),\"2XX2\")","v":2021},{"$f":"+IFERROR(YEAR(Indice!B6-365),\"2XX1\")","v":2020}]
["Gastos financieros ",{"$f":"+B35","v":172198807},{"$f":"+C35","v":154187154}]
["Intereses pagados por préstamos",172198807,154187154]

{"sheet":"Base de Monedas","index":45,"n_rows":179,"n_cols":3,"rows_kept":179,"cut":false,"hidden":false,"merged":[]}
["PYG","Guaraní","Índice"]
["USD","Dólar estadounidense"]
["EUR","Euro"]
["AED","Dírham de los Emiratos Árabes Unidos"]
["AFN","Afgani"]
["ALL","Lek"]
["AMD","Dram armenio"]
["ANG","Florín antillano neerlandés"]
["AOA","Kwanza"]
["ARS","Peso argentino"]
["AUD","Dólar australiano"]
["AWG","Florín arubeño"]
["AZN","Manat azerbaiyano"]
["BAM","Marco convertible"]
["BBD","Dólar de Barbados"]
["BDT","Taka"]
["BGN","Lev búlgaro"]
["BHD","Dinar bareiní"]
["BIF","Franco de Burundi"]
["BMD","Dólar bermudeño"]
["BND","Dólar de Brunéi"]
["BOB","Boliviano"]
["BOV","MVDOL"]
["BRL","Real brasileño"]
["BSD","Dólar bahameño"]
["BTN","Ngultrum"]
["BWP","Pula"]
["BYN","Rublo bielorruso"]
["BZD","Dólar beliceño"]
["CAD","Dólar canadiense"]
["CDF","Franco congoleño"]
["CHE","Euro WIR"]
["CHF","Franco suizo"]
["CHW","Franco WIR"]
["CLF","Unidad de fomento"]
["CLP","Peso chileno"]
["CNY","Yuan chino"]
["COP","Peso colombiano"]
["COU","Unidad de valor real"]
["CRC","Colón costarricense"]
["CUC","Peso convertible"]
["CUP","Peso cubano"]
["CVE","Escudo caboverdiano"]
["CZK","Corona checa"]
["DJF","Franco yibutiano"]
["DKK","Corona danesa"]
["DOP","Peso dominicano"]
["DZD","Dinar argelino"]
["EGP","Libra egipcia"]
["ERN","Nakfa"]
["ETB","Birr etíope"]
["FJD","Dólar fiyiano"]
["FKP","Libra malvinense"]
["GBP","Libra esterlina"]
["GEL","Lari"]
["GHS","Cedi ghanés"]
["GIP","Libra de Gibraltar"]
["GMD","Dalasi"]
["GNF","Franco guineano"]
["GTQ","Quetzal"]
["GYD","Dólar guyanés"]
["HKD","Dólar de Hong Kong"]
["HNL","Lempira"]
["HRK","Kuna"]
["HTG","Gourde"]
["HUF","Forinto"]
["IDR","Rupia indonesia"]
["ILS","Nuevo shéquel israelí"]
["INR","Rupia india"]
["IQD","Dinar iraquí"]
["IRR","Rial iraní"]
["ISK","Corona islandesa"]
["JMD","Dólar jamaiquino"]
["JOD","Dinar jordano"]
["JPY","Yen"]
["KES","Chelín keniano"]
["KGS","Som"]
["KHR","Riel"]
["KMF","Franco comorense"]
["KPW","Won norcoreano"]
["KRW","Won"]
["KWD","Dinar kuwaití"]
["KYD","Dólar de las Islas Caimán"]
["KZT","Tenge"]
["LAK","Kip"]
["LBP","Libra libanesa"]
["LKR","Rupia de Sri Lanka"]
["LRD","Dólar liberiano"]
["LSL","Loti"]
["LYD","Dinar libio"]
["MAD","Dírham marroquí"]
["MDL","Leu moldavo"]
["MGA","Ariary malgache"]
["MKD","Denar"]
["MMK","Kyat"]
["MNT","Tugrik"]
["MOP","Pataca"]
["MRU","Uguiya"]
["MUR","Rupia de Mauricio"]
["MVR","Rufiyaa"]
["MWK","Kwacha"]
["MXN","Peso mexicano"]
["MXV","Unidad de Inversión (UDI) mexicana"]
["MYR","Ringgit malayo"]
["MZN","Metical mozambiqueño"]
["NAD","Dólar namibio"]
["NGN","Naira"]
["NIO","Córdoba"]
["NOK","Corona noruega"]
["NPR","Rupia nepalí"]
["NZD","Dólar neozelandés"]
["OMR","Rial omaní"]
["PAB","Balboa"]
["PEN","Sol"]
["PGK","Kina"]
["PHP","Peso filipino"]
["PKR","Rupia pakistaní"]
["PLN","Złoty"]
["QAR","Riyal qatarí"]
["RON","Leu rumano"]
["RSD","Dinar serbio"]
["RUB","Rublo ruso"]
["RWF","Franco ruandés"]
["SAR","Riyal saudí"]
["SBD","Dólar de las Islas Salomón"]
["SCR","Rupia seychelense"]
["SDG","Dinar sudanés"]
["SEK","Corona sueca"]
["SGD","Dólar de Singapur"]
["SHP","Libra de Santa Elena"]
["SLL","Leone"]
["SOS","Chelín somalí"]
["SRD","Dólar surinamés"]
["SSP","Libra sursudanesa"]
["STN","Dobra"]
["SVC","Colon Salvadoreño"]
["SYP","Libra siria"]
["SZL","Lilangeni"]
["THB","Baht"]
["TJS","Somoni tayiko"]
["TMT","Manat turcomano"]
["TND","Dinar tunecino"]
["TOP","Paʻanga"]
["TRY","Lira turca"]
["TTD","Dólar de Trinidad y Tobago"]
["TWD","Nuevo dólar taiwanés"]
["TZS","Chelín tanzano"]
["UAH","Grivna"]
["UGX","Chelín ugandés"]
["USN","Dólar estadounidense (Siguiente día)"]
["UYI","Peso en Unidades Indexadas (Uruguay)"]
["UYU","Peso uruguayo"]
["UYW","Unidad Previsional"]
["UZS","Som uzbeko"]
["VES7​","Bolívar soberano"]
["VND","Dong vietnamita"]
["VUV","Vatu"]
["WST","Tala"]
["XAF","Franco CFA de África Central"]
["XAG","Plata (una onza troy)"]
["XAU","Oro (una onza troy)"]
["XBA","Unidad compuesta europea (EURCO) (Unidad del mercados de bonos)"]
["XBB","Unidad Monetaria europea (E.M.U.-6) (Unidad del mercado de bonos)"]
["XBC","Unidad europea de cuenta 9 (E.U.A.-9) (Unidad del mercado de bonos)"]
["XBD","Unidad europea de cuenta 17 (E.U.A.-17) (Unidad del mercado de bonos)"]
["XCD","Dólar del Caribe Oriental"]
["XDR","Derechos especiales de giro"]
["XOF","Franco CFA de África Occidental"]
["XPD","Paladio (una onza troy)"]
["XPF","Franco CFP"]
["XPT","Platino (una onza troy)"]
["XSU","SUCRE"]
["XTS","Reservado para pruebas"]
["XUA","Unidad de cuenta BAD"]
["XXX","Sin divisa"]
["YER","Rial yemení"]
["ZAR","Rand"]
["ZMW","Kwacha zambiano"]
["ZWL","Dólar zimbabuense"]