{"text_format":"1","workbook":"xlsx","n_sheets":45,"sheets":["Indice","BG","ER","EVPN","EFE","Nota1","Nota 2","Nota 3","Nota 4","Nota 5","Nota 6","Nota 7","Nota 8","Nota 9","Nota 10","Nota 11","Nota 12","Nota 13","Nota 14","Nota 15","Nota 16","Nota 17","Nota 18","Nota 19","Nota 20"," Nota 21","Nota 22","Nota 23","Nota 24","Nota 25","Nota 26","Nota 27","Nota 28","Nota 29","Nota 30","Nota 31","Nota 32","Nota 33","Nota 34","Nota 35","Nota 36","Nota 37","Nota 38","Nota 39","Nota 40"],"not_rendered":{"charts":0,"images":2,"macros":1,"external_links":1,"defined_names":3,"comments":0,"pivot_tables":0},"unopened":[],"bounds":{"document_bytes":16777216,"sheet_cells":100000,"rows_first":2000,"rows_last":500,"rows_between":2000,"halvings":0,"cell_chars":16384,"cell_head_chars":4096},"cells_cut":0,"cells_raw":0,"read":"whole","date_system":"1900"}

{"sheet":"Indice","index":0,"n_rows":64,"n_cols":20,"rows_kept":64,"cut":false,"hidden":false,"merged":[]}
[null,"Sociedad:","BIOTEC DEL PARAGUAY S.A.","<-- Colocar Nombre de la Sociedad"]
[null,null,null,null,null,null,null,null,null,null,null,null,null,null,null,null,null,null,1,"Enero"]
[null,null,null,null,null,null,null,null,null,null,null,null,null,null,null,null,null,null,2,"Febrero"]
[null,null,null,null,null,null,null,null,null,null,null,null,null,null,null,null,null,null,3,"Marzo"]
[null,null,null,null,null,null,null,null,null,null,null,null,null,null,null,null,null,null,4,"Abril"]
["Fecha Presentación:","2021-06-30","<-- Completar Fecha en formato (DD/MM/AAA)",null,null,null,null,null,null,null,null,null,null,null,null,null,null,null,5,"Mayo"]
[null,null,null,null,null,null,null,null,null,null,null,null,null,null,null,null,null,null,6,"Junio"]
[null,null,null,null,null,null,null,null,null,null,null,null,null,null,null,null,null,null,7,"Julio"]
[null,null,"INDICE","REF.",null,null,null,null,null,null,null,null,null,null,null,null,null,null,8,"Agosto"]
[null,"Informacion General",null,null,null,null,null,null,null,null,null,null,null,null,null,null,null,null,9,"Septiembre"]
[null,null,"Descripción de la naturaleza y del negocio de la Sociedad","Nota 1",null,null,null,null,null,null,null,null,null,null,null,null,null,null,10,"Octubre"]
[null,null,"Resumen de las principales políticas contables","Nota 2",null,null,null,null,null,null,null,null,null,null,null,null,null,null,11,"Noviembre"]
[null,"Balance General",null,"BG",null,null,null,null,null,null,null,null,null,null,null,null,null,null,12,"Diciembre"]
[null,null,"Efectivo y equivalente de efectivo","Nota 3"]
[null,null,"Inversiones temporales","Nota 4"]
[null,null,"Cuentas por cobrar comerciales","Nota 5"]
[null,null,"Otros créditos","Nota 6"]
[null,null,"Cuentas por cobrar comerciales","Nota 5"]
[null,null,"Inventarios","Nota 7"]
[null,null,"Inversión en asociadas","Nota 8"]
[null,null,"Propiedades, planta y equipo","Nota 9"]
[null,null,"Activos disponibles para la venta","Nota 10"]
[null,null,"Activos intangibles","Nota 11"]
[null,null,"Goodwill","Nota 12"]
[null,null,"Cuentas por pagar comerciales","Nota 13"]
[null,null,"Préstamos a corto plazo","Nota 14"]
[null,null,"Porción corriente de la deuda a largo plazo","Nota 15"]
[null,null,"Remuneraciones y cargas sociales a pagar","Nota 16"]
[null,null,"Impuestos a pagar","Nota 17"]
[null,null,"Provisiones","Nota 18"]
[null,null,"Otros pasivos corrientes","Nota 19"]
[null,null,"Prestamos a largo plazo","Nota 14"]
[null,null,"Otros pasivos no corrientes","Nota 19"]
[null,null,"Capital integrado","Nota 20"]
[null,null,"Reserva de revalúo","Nota 21"]
[null,null,"Reserva legal","Nota 21"]
[null,null,"Reservas estatutarias","Nota 21"]
[null,null,"Reservas facultativas","Nota 21"]
[null,null,"Diferencia transitoria por conversión","Nota 22"]
[null,null,"Resultados acumulados","Nota 23"]
[null,null,"Interés minoritario","Nota 24"]
[null,"Estado de Resultados ",null,"ER"]
[null,null,"Ventas","Nota 25"]
[null,null,"Costo de ventas","Nota 26"]
[null,null,"Gastos de ventas","Nota 27"]
[null,null,"Gastos administrativos","Nota 27"]
[null,null,"Otros ingresos y gastos operativos","Nota 28"]
[null,null,"Ingresos financieros - neto","Nota 29"]
[null,null,"Gastos financieros - neto","Nota 29"]
[null,null,"Resultado de inversiones en asociadas","Nota 30"]
[null,null,"Resultado participación minoritaria","Nota 31"]
[null,null,"Impuesto a la renta","Nota 32"]
[null,null,"Resultado extraordinario neto de impuesto a la renta","Nota 33"]
[null,null,"Resultado sobre actividades discontinuadas neto de impuesto a la renta","Nota 34"]
[null,null,"Utilidad/(Pérdida) neta del año","Nota 35"]
[null,null,"Utilidad neta por acción ordinaria","Nota 35"]
[null,"Estado de Evolución del Patrimonio Neto",null,"EVPN"]
[null,"Estado de Flujos de Efectivo",null,"EFE"]
[null,"Otras Notas de los Estados Financieros"]
[null,null,"Activos gravados","Nota 36"]
[null,null,"Contingencias y compromisos","Nota 37"]
[null,null,"Impuesto diferido","Nota 38"]
[null,null,"Hechos posteriores","Nota 39"]
[null,null,"Saldos y transacciones con partes relacionadas","Nota 40"]

{"sheet":"BG","index":1,"n_rows":65,"n_cols":7,"rows_kept":65,"cut":false,"hidden":false,"merged":[[69,5,69,6],[70,1,70,3],[11,1,11,3],[29,1,29,3],[45,1,45,3],[44,1,44,3],[55,1,55,3],[68,5,68,6],[28,1,28,3],[56,1,56,3],[37,2,37,3],[40,2,40,3],[41,2,41,3],[46,2,46,3],[48,2,48,3],[47,2,47,3],[6,0,6,6],[8,0,8,6],[52,2,52,3],[53,2,53,3],[27,2,27,3],[24,2,24,3],[25,2,25,3],[20,2,20,3],[22,2,22,3],[23,2,23,3],[32,2,32,3],[7,0,7,6],[13,2,13,3],[14,2,14,3],[15,2,15,3],[16,2,16,3],[17,2,17,3],[26,2,26,3],[31,2,31,3],[33,2,33,3],[34,2,34,3],[35,2,35,3],[36,2,36,3],[54,2,54,3],[49,2,49,3],[50,2,50,3],[51,2,51,3]]}
[null,null,null,{"$f":"Indice!C1","v":"BIOTEC DEL PARAGUAY S.A."},"Indice"]
[]
[]
[]
[]
[]
["BALANCE GENERAL"]
[{"$f":"IFERROR(IF(Indice!B6=\"\",\"Al dia... de mes… de año 2XX2…\",\"Al \"&DAY(Indice!B6)&\" de \"&VLOOKUP(MONTH(Indice!B6),Indice!S:T,2,0)&\" de \"&YEAR(Indice!B6)),\"Al dia... de mes… de año 2XX2…\")","v":"Al 30 de Junio de 2021"}]
["(En miles de guaraníes)"]
[]
[null,null,null,null,"Nota",2021,2020]
[null,"ACTIVOS"]
[null,"Activos Corrientes"]
[null,null,"Efectivo y equivalente de efectivo",null,3,2538154674,3404995318]
[null,null,"Inversiones temporales",null,4,806673517,0]
[null,null,"Cuentas por cobrar comerciales",null,5,38989191078,38817046724]
[null,null,"Otros créditos",null,6,11211564382,7958798009]
[null,null,"Inventarios",null,7,41612896705,24050116279]
[null,null,"Total activos corrientes",null,null,{"$f":"SUM(F14:F18)","v":95158480356},{"$f":"SUM(G14:G18)","v":74230956330}]
[null,"Activos no Corrientes"]
[null,null,"Otros créditos ",null,6,47298184,144916747]
[null,null,"Cuentas por cobrar comerciales",null,5,0,0]
[null,null,"Inversión en asociadas",null,8,0,0]
[null,null,"Propiedades, planta y equipo/Bienes de uso, neto",null,9,21713251045.315781,18150442729]
[null,null,"Activos disponibles para la venta",null,10,0,0]
[null,null,"Activos intangibles",null,11,84938100,117399004]
[null,null,"Goodwill",null,12,0,0]
[null,null,"Total activos no corrientes",null,null,{"$f":"SUM(F21:F27)","v":21845487329.315781},{"$f":"SUM(G21:G27)","v":18412758480}]
[null,"Total Activos",null,null,null,{"$f":"+F19+F28","v":117003967685.31578},{"$f":"+G19+G28","v":92643714810}]
[null,"PASIVOS Y PATRIMONIO NETO"]
[null,"Pasivos corrientes",null,null,null,-1]
[null,null,"Cuentas por pagar comerciales",null,13,13675205879,9554927425]
[null,null,"Préstamos a corto plazo ",null,14,22121549619.014381,22041834727]
[null,null,"Porción corriente de la deuda a largo plazo",null,15,0,0]
[null,null,"Remuneraciones y cargas sociales a pagar",null,16,166556866,45089432]
[null,null,"Impuestos a pagar",null,17,31091641,268208134]
[null,null,"Provisiones",null,18,9687488447,16896978364]
[null,null,"Otros pasivos corrientes",null,19,2783991039,871390485]
[null,null,"Total Pasivos Corrientes",null,null,{"$f":"+F32+F33+F34+F35+F36+F37+F38","v":48465883491.014381},{"$f":"+G32+G33+G34+G35+G36+G37+G38","v":49678428567}]
[null,"Pasivos no corrientes"]
[null,null,"Préstamos a largo plazo ",null,14,30132091094.946026,30362038358]
[null,null,"Otros pasivos  no corrientes",null,19,0,0]
[null,null,"Total pasivos no corrientes",null,null,{"$f":"SUM(F41:F42)","v":30132091094.946026},{"$f":"SUM(G41:G42)","v":30362038358}]
[]
[null,"Total Pasivos",null,null,null,{"$f":"+F39+F43","v":78597974585.960403},{"$f":"+G39+G43","v":80040466925}]
[null,"Patrimonio Neto"]
[null,null,"Capital integrado",null,20,15000000000,12000000000]
[null,null,"Reserva de revalúo",null,21,2195468553,770442553]
[null,null,"Reserva legal",null,21,2336722151,1618994215]
[null,null,"Reservas estatutarias",null,21,0,0]
[null,null,"Reservas facultatitvas",null,21,0,0]
[null,null,"Diferencia transitoria por conversión",null,22,0,0]
[null,null,"Resultados acumulados",null,23,18873802393,-1786188882]
[null,null,"Subtotal",null,null,38405993097,12603247886]
[null,null,"Interés minoritario",null,24,0,0]
[null,"Total Patrimonio Neto",null,null,null,{"$f":"F54","v":38405993097},{"$f":"G54","v":12603247886}]
[null,"Total Pasivos y Patrimonio Neto",null,null,null,{"$f":"+F45+F56","v":117003967682.9604},{"$f":"+G45+G56","v":92643714811}]
[]
[null,"Las notas que se acompañan forman parte integrante de estos estados."]
[]
[]
[]
[]
[null,"                        Lic. Marcela Insfran        Lic. Fátima Codas         Gonzalo Samaniego Zubizarreta        "]
[null,"                              Contador                     Síndico Títular                             Presidente                        "]

{"sheet":"ER","index":2,"n_rows":42,"n_cols":4,"rows_kept":42,"cut":false,"hidden":false,"merged":[[46,2,46,3],[6,0,6,3],[7,0,7,3],[8,0,8,3],[9,0,9,3]]}
[{"$f":"Indice!C1","v":"BIOTEC DEL PARAGUAY S.A."},"Indice",null,{"$f":"ER!A4","v":" "}]
[]
[]
[" "]
[]
[]
["ESTADO DE RESULTADOS"]
[{"$f":"IFERROR(IF(Indice!B6=\"\",\"Al dia... de mes… de año 2XX2…\",\"Al \"&DAY(Indice!B6)&\" de \"&VLOOKUP(MONTH(Indice!B6),Indice!S:T,2,0)&\" de \"&YEAR(Indice!B6)),\"Al dia... de mes… de año 2XX2…\")","v":"Al 30 de Junio de 2021"}]
["Comparativo con igual período del año anterior"]
[" (En miles de guaraníes)"]
[]
[null,"Nota",{"$f":"IFERROR(IF(Indice!B6=\"\",\"2XX2\",YEAR(Indice!B6)),\"2XX2\")","v":2021},2020]
["Ventas",25,54056033645,20581300233]
["Costo de ventas",26,-29101607167,-11041326511]
["Utilidad bruta",null,24954426478,9539973722]
["Gastos de ventas",27,-9735494455,-4566228421]
["Gastos administrativos ",27,-4428498532,-3568412704]
["Otros ingresos  y gastos operativos",28,531069575,-787889993]
["Resultado operativo",null,-13632923412,-8922531118]
["Ingresos financieros - neto",29,0,0]
["Gastos financieros -  neto",29,-3084531453,-2403631486]
["Subtotal",null,-3084531453,-2403631486]
["Resultado de inversiones en asociadas",30,0,0]
["Resultados ordinarios antes de impuesto a la renta y participación minoritaria",null,8236971613,-1786188882]
["Resultado participación minoritaria",31,0,0]
["Resultado ordinario antes del impuesto a la renta"]
["Impuesto a la renta",32,0,0]
["Resultado neto de actividades ordinarias",null,8236971613,-1786188882]
["Resultado extraordinario neto de impuesto a la renta",33,0,0]
["Resultado sobre actividades discontinuadas neto de impuesto a la renta",34,0,0]
["Utilidad/(Pérdida) neta del año ",null,8236971613,-1786188882]
["Utilidad neta por acción ordinaria",35,549131.44086666661,-148849.0735]
[]
[]
["Las notas que se acompañan forman parte integrante de estos estados."]
[]
[]
[]
[]
[]
["                                        Lic. Cynthia P. Lezcano          Lic. Fátima Codas           Gonzalo Samaniego Zubizarreta        "]
["                                                        Contador                       Síndico Títular                               Presidente                             "]

{"sheet":"EVPN","index":3,"n_rows":42,"n_cols":20,"rows_kept":42,"cut":false,"hidden":false,"merged":[[10,17,11,17],[10,19,11,19],[6,0,6,15],[10,2,11,2],[10,5,11,5],[10,7,11,7],[10,9,11,9],[10,11,11,11],[10,13,11,13],[10,15,11,15],[10,0,11,0],[9,2,9,5],[9,11,9,15]]}
[{"$f":"Indice!C1","v":"BIOTEC DEL PARAGUAY S.A."},null,null,null,null,null,null,"Indice"]
[]
[]
[null,null,null,null,null,"ESTADO DE EVOLUCIÓN DEL PATRIMONIO NETO"]
[null,null,null,null,null,null,null,{"$f":"IFERROR(IF(Indice!B6=\"\",\"Al dia... de mes… de año 2XX2…\",\"Al \"&DAY(Indice!B6)&\" de \"&VLOOKUP(MONTH(Indice!B6),Indice!S:T,2,0)&\" de \"&YEAR(Indice!B6)),\"Al dia... de mes… de año 2XX2…\")","v":"Al 30 de Junio de 2021"}]
[null,null,null,null,null,null,null,"Comparativo con igual periodo del año anterior"]
["(En miles de guaraníes)"]
[]
[]
[null,null,"Aporte de los propietarios",null,null,null,null,null,null,null,null,"Ganancias reservadas"]
[null,null,"Capital suscripto e integrado","Aporte para",null,"Primas de emisión",null,"Reserva de revalúo",null,"Reserva de revalúo técnico",null,"Reserva legal",null,"Reserva facultativa",null,"Resultados acumulados",null,"Interes Minoritario",null,"Total"]
[null,null,null,"aumento de capital",null,null,null,null,null,null,null,null,null,null,null,"Total"]
[]
["Saldo al 31 de Diciembre de 2019",null,10000000000,0,null,0,0,770442553,null,0,null,993626716,null,0,null,22272345864,null,null,null,{"$f":"+SUM(C14:S14)","v":34036415133}]
["Cambio en política contable (Nota….)"]
["Saldo reestructurado",null,10000000000,null,null,0,null,770442553,null,0,null,993626716,null,0,null,22272345864,null,{"$f":"+R14+R15","v":0},null,{"$f":"+SUM(C16:S16)","v":34036415133}]
[]
["Integración del capital social"]
[]
["Aporte para Aumento de Capital 2019",null,2000000000,null,null,null,null,0,null,null,null,null,null,null,null,null,null,null,null,{"$f":"+SUM(C20:S20)","v":2000000000}]
["Reserva Legal",null,null,null,null,null,null,0,null,null,null,625367499,null,null,null,-285197136,null,null,null,340170363]
["Reserva Fcultativa",null,null,null,null,null,null,null,null,null,null,null,null,null,null,null,null,null,null,0]
["Revalúo de activos fijos",null,null,null,null,null,null,0,null,null,null,null,null,null,null,null,null,null,null,{"$f":"+SUM(C23:S23)","v":0}]
["Dividendos a Pagar",null,null,null,null,null,null,0,null,null,null,null,null,null,null,-5962000000,null,null,null,-5962000000]
["Revalúo técnico",null,null,null,null,null,null,null,null,1425026000,null,null,null,null,null,null,null,null,null,1425026000]
["Resultado del año",null,null,null,null,null,null,null,null,null,null,null,null,null,null,12507349978,null,null,null,12507349978]
[]
["Saldo al 31 de Diciembre de 2020",null,12000000000,0,null,0,0,770442553,null,1425026000,null,1618994215,null,0,null,28532498706,null,{"$f":"+R16+SUM(R20:R26)","v":0},null,{"$f":"+T16+SUM(T20:T26)","v":44346961474}]
["Distribución de dividendos s/Acta de Asamblea General Ordinaria N°… de fecha………"]
["Revalúo de activos fijos",null,null,null,null,null,null,null,null,null,null,null,null,null,null,null,null,null,null,{"$f":"+SUM(C30:S30)","v":0}]
["Desafectación de la reserva de revalúo técnico"]
["Aporte para Aumento de Capital 2020",null,3000000000,null,null,null,null,0,null,null,null,null,null,null,null,0,null,null,null,{"$f":"+SUM(C32:S32)","v":3000000000}]
["Reserva Legal",null,null,null,null,null,null,0,null,null,null,717727936,null,null,null,{"$f":"-L33","v":-717727936},null,null,null,{"$f":"+SUM(C33:S33)","v":0}]
["Reserva Fcultativa",null,null,null,null,null,null,null,null,null,null,null,null,null,null,0,null,null,null,{"$f":"+SUM(C34:S34)","v":0}]
["Revalúo de activos fijos",null,null,null,null,null,null,0,null,null,null,null,null,null,null,0,null,null,null,0]
["Dividendos a Pagar",null,null,null,null,null,null,0,null,null,null,null,null,null,null,{"$f":"+-(P28+P32+P33)","v":-27814770770},null,null,null,{"$f":"+SUM(C36:S36)","v":-27814770770}]
["Revalúo técnico",null,null,null,null,null,null,null,null,0,null,null,null,null,null,0,null,null,null,{"$f":"+SUM(C37:S37)","v":0}]
["Resultado del año",null,null,null,null,null,null,null,null,null,null,null,null,null,null,{"$f":"+[1]BG!F53","v":18873802393},null,null,null,{"$f":"+SUM(C38:S38)","v":18873802393}]
[]
["Saldo al 30 de Junio de 2021",null,{"$f":"SUM(C32:C39)+C28","v":15000000000},0,null,{"$f":"SUM(F32:F39)+F28","v":0},0,{"$f":"SUM(H32:H39)+H28","v":770442553},null,{"$f":"SUM(J32:J39)+J28","v":1425026000},null,{"$f":"SUM(L32:L39)+L28","v":2336722151},null,{"$f":"SUM(N32:N39)+N28","v":0},null,{"$f":"SUM(P32:P39)+P28","v":18873802393},null,{"$f":"SUM(R32:R39)+R28","v":0},null,{"$f":"SUM(T32:T39)+T28","v":38405993097}]
[null,null,null,null,null,null,null,null,null,null,null,null,null,null,null,null,null,null,null,{"$f":"+T40-BG!F56","v":0}]
["Las notas que se acompañan forman parte integrante de estos estados."]

{"sheet":"EFE","index":4,"n_rows":43,"n_cols":3,"rows_kept":43,"cut":false,"hidden":false,"merged":[[2,0,2,2],[4,0,4,2],[5,0,5,2],[6,0,6,2],[7,0,7,2]]}
[{"$f":"Indice!C1","v":"BIOTEC DEL PARAGUAY S.A."}]
[]
[]
[]
["ESTADO DE FLUJOS DE EFECTIVO (Método directo)"]
[{"$f":"IFERROR(IF(Indice!B6=\"\",\"Al dia... de mes… de año 2XX2…\",\"Al \"&DAY(Indice!B6)&\" de \"&VLOOKUP(MONTH(Indice!B6),Indice!S:T,2,0)&\" de \"&YEAR(Indice!B6)),\"Al dia... de mes… de año 2XX2…\")","v":"Al 30 de Junio de 2021"}]
["Comparativo con igual periodo del año anterior"]
["(En miles de guaraníes)"]
[]
[]
[null,{"$f":"IFERROR(IF(Indice!B6=\"\",\"2XX2\",YEAR(Indice!B6)),\"2XX2\")","v":2021},2020]
[]
["FLUJO DE EFECTIVO DE ACTIVIDADES OPERATIVAS"]
["Cobranzas efectuadas a clientes",126752277205,37986189170]
["Pagos efectuados a proveedores y empleados",-91458253203,-4806131863]
["Efectivo generado por las operaciones",-11659529986,-24207341063]
["Intereses pagados",0]
["Otros ingresos y (egresos) - neto",235260686]
["Pagos de impuesto a la renta",-1777770815,-1233933237]
["Flujo neto de efectivo de actividades operativas",22091983887,7738783007]
[]
["FLUJO DE EFECTIVO DE ACTIVIDADES DE INVERSIÓN "]
["Adquisición de bienes de uso",-7044229377,-3188632386]
["Adquisición de bienes Curtiembre - fideicomitida",0]
["Ventas de activos fijos",0,0]
["Ventas de bienes de uso"]
["Intereses cobrados sobre inversiones"]
["Aquisición de inversiones"]
["Flujo neto de efectivo de actividades de inversión",-7044229377,-3188632386]
[]
["FLUJO DE EFECTIVO DE ACTIVIDADES DE FINANCIACIÓN"]
["(Disminución) Incremento de préstamos",835324483,-8337850188]
["Aportes de capital recibidos",-2000000000]
["Dividendos pagados",0]
["Flujo neto de efectivo de actividades de financiamiento",-1164675517,-8337850188]
[]
["(Disminución) Incremento neto de efectivo",13883078993,-3787699567]
["Efecto estimado de la diferencia de cambio sobre el saldo de efectivo",0,0]
["Efectivo al principio del año",2007017468,5794717035]
[]
["Efectivo al final del periodo",2538154674,3404995318]
[null,0]
["Las notas que se acompañan forman parte integrante de estos estados."]

{"sheet":"Nota1","index":5,"n_rows":25,"n_cols":9,"rows_kept":25,"cut":false,"hidden":false,"merged":[[7,0,7,8],[10,9,10,11],[18,0,18,8],[20,0,20,8],[19,0,19,8],[11,0,11,8],[17,0,17,8]]}
[{"$f":"Indice!C1","v":"BIOTEC DEL PARAGUAY S.A."},null,null,null,null,null,null,null,"BG"]
[]
[]
[]
[]
["NOTAS A LOS ESTADOS FINANCIEROS CORRESPONDIENTES AL PERIODO TERMINADO",null,null,null,null,null,null,{"$f":"IFERROR(IF(Indice!B6=\"\",\"Al dia... de mes… de año 2XX2…\",\"Al \"&DAY(Indice!B6)&\" de \"&VLOOKUP(MONTH(Indice!B6),Indice!S:T,2,0)&\" de \"&YEAR(Indice!B6)),\"Al dia... de mes… de año 2XX2…\")","v":"Al 30 de Junio de 2021"}]
["Presentadas en forma comparativa con el periodo terminado ",null,null,null,null,{"$f":"IFERROR(\"Al \"&DAY(Indice!B6)&\" de \"&VLOOKUP(MONTH(Indice!B6),Indice!S:T,2,0)&\" de \"&YEAR(Indice!B6-365),\"Al dia... de mes… de año 2XX1…\")","v":"Al 30 de Junio de 2020"}]
[" "]
[]
[]
["NOTA 1 – DESCRIPCIÓN DE LA NATURALEZA Y DEL NEGOCIO DE LA COMPAÑÍA"]
["Antecedentes de la sociedad: naturaleza jurídica, antecedentes sobre la constitución de la sociedad y reformas estatutarias, actividad principal y secundarias."]
["DENOMINACION: BIOTEC DEL PARAGUAY S.A."]
[]
["DOMICILIO LEGAL: MCAL. ESTIGARRIBIA Nº 1097 E/BRASIL"]
[]
["ACTIVIDAD PRINCIPAL: IMPORTACION DE INSUMOS, MATERIALES, EQUIPOS Y REACTIVOS PARA LABORATORIOS."]
[]
["INSCRIPCION EN EL REGISTRO PUBLICO DE COMERCIO: Del estatuto o contrato social Nº 318, de fecha 01/08/1994. De las modificaciones: Nº 22 de fecha 30 de noviembre de 1996, Nº 478, de fecha 18 de setiembre del 2001, Nº 137 de fecha 25 de mayo del 2002, Nº 285, de fecha 20 de julio del 2005, Nº 2, de fecha 2 de enero del 2006, Nº 147 de fecha 11 de marzo del 2008, Nº 78 de fecha 22 de febrero del 2017, Nº 873 de fecha 28 de diciembre de 2017."]
[]
["INSCRIPCION EN LA COMISION NACIONAL DE VALORES: según ACTA N° 70/19 DE FECHA 10/09/2019 - RES CNV N°85E/19"]
[]
["FECHA DE VENCIMIENTO DEL ESTATUTO O CONTRATO SOCIAL: Año 2.084"]
[]
["COMPOSICION DEL CAPITAL: al 30 de junio de 2021."]

{"sheet":"Nota 2","index":6,"n_rows":94,"n_cols":13,"rows_kept":94,"cut":false,"hidden":false,"merged":[[9,0,9,12],[13,0,13,12],[19,0,19,12],[92,0,92,12],[93,0,93,12],[61,0,61,12],[73,0,73,12],[72,0,72,12],[64,0,64,12],[65,0,65,12],[66,0,69,12],[45,0,45,12],[40,0,40,12],[41,0,41,12],[37,0,37,12],[57,0,57,12],[5,0,5,12],[46,0,46,12],[52,0,52,12],[56,0,56,12],[53,0,53,12],[15,0,15,12],[6,0,6,12],[14,0,14,12],[10,0,10,12],[11,0,11,12],[38,0,38,12],[43,0,43,12],[16,0,16,12],[17,0,17,12],[47,0,49,12],[18,0,18,12],[63,0,63,12],[60,0,60,12],[35,0,35,12],[111,7,111,17],[83,13,83,14],[75,13,75,14],[78,0,78,12],[87,0,87,12],[75,0,75,12],[76,0,76,12],[94,0,94,12],[89,0,89,12],[90,0,90,12],[77,0,77,12],[83,0,83,12],[80,0,80,12],[84,0,84,12],[86,0,86,12],[81,0,81,12],[74,0,74,12],[71,0,71,12],[60,13,60,14],[61,13,61,14],[76,13,76,14],[71,13,71,14],[72,13,72,14],[63,13,63,14],[64,13,64,14],[65,13,65,14],[73,13,73,14],[74,13,74,14]]}
[{"$f":"Indice!C1","v":"BIOTEC DEL PARAGUAY S.A."},null,null,null,null,null,null,null,null,null,null,null,"BG"]
[]
[]
[]
[]
["NOTA 2 - RESUMEN DE LAS PRINCIPALES POLÍTICAS CONTABLES"]
["Resumen de las principales políticas contables: a modo referencial, se incluyen las siguientes revelaciones de políticas contables en estados financieros de uso general que podrá ser tenida en consideración por las sociedades emisoras para la preparación de este capítulo de los estados financieros:"]
[]
[]
["a.   Bases de contabilización (Según NIF Bases de preparación de los Estados Financieros)"]
["Los estados financieros se han preparado siguiendo los criterios de las Normas de Información Financiera (NIF) emitidas por el Consejo de Contadores Públicos del Paraguay sobre la base de costos históricos, excepto para el caso de activos y pasivos en moneda extranjera  y las propiedades, planta y equipo según se explica en los puntos c ) y k), y no reconocen en forma integral los efectos de la inflación sobre la situación patrimonial y financiera de la sociedad, sobre los resultados de sus operaciones y los flujos de efectivo, en atención a que la corrección monetaria no constituye una práctica contable obligatoria en el Paraguay. \n"]
["De haberse aplicado una corrección monetaria integral de los estados financieros, podrían haber surgido diferencias en la presentación de la situación patrimonial y financiera de la sociedad, en los resultados de sus operaciones y en los flujos de efectivo al 31/03/2021 , y por los ejercicios cerrados el, 31 de marzo de 2021 y 2020. Según el índice general de precios del consumo (IPC) publicado por el Banco Central del Paraguay, la inflación fue de 2,2% en el año 2020 y 2,8% en el año 2019.\n\n"]
[]
[]
["b.   Uso de estimaciones contables"]
["La preparación de los presentes estados financieros requiere que la Gerencia de la sociedad realice estimaciones y evaluaciones que afectan el monto de los activos y pasivos registrados y contingentes, como así también los ingresos y egresos registrados en el ejercicio.  Los resultados reales futuros pueden diferir de las estimaciones y evaluaciones realizadas a la fecha de preparación de los presentes estados financieros."]
[]
["c.   Moneda extranjera"]
["Los activos y pasivos en moneda extranjera se valúan a los tipos de cambio vigentes a la fecha de cierre del ejercicio."]
["Las diferencias de cambio originadas por fluctuaciones en los tipos de cambio producidos entre las fechas de concertación de las operaciones y su liquidación o valuación al cierre del ejercicio, son reconocidas en resultados."]
[]
[]
[null,null,2021,null,null,null,null,null,2020]
[null,"Indicar moneda","Simbología según ISO 4217","Valor TC","Monto Moneda","Miles de G.",null,"Indicar moneda","Simbología según ISO 4217","Valor TC","Monto Moneda","Miles de G."]
["Activos","Dolares","USD",6733.98,1608362.7914061563,10096561757.563803,null,"Dolares","USD",6793.79,885197.45,{"$f":"+J25*K25","v":6013845583.8354998}]
[null,"Euros","€",7981.78,0,0,null,"Euros","€",7640.93,624.47,{"$f":"+J26*K26","v":4771531.5571000008}]
[]
[]
["Pasivos","Dolares","USD",6761.37,1883107.6085073517,11960237847.140999,null,"Dolares","USD",6820.47,1180293.6200000001,{"$f":"+J29*K29","v":8050157226.4014015}]
[null,"Euros","€",8014.93,56380.22,420540060.98000002,null,"Euros","€",7670.99,21002.21,161107742.88789999]
[]
[]
["Posición neta",null,null,null,null,10096561757.563803,null,null,null,null,null,3458593735]
[]
[]
["A la fecha de emisión de estos estados financieros, el tipo de cambio de la moneda extranjera DOLARES AMERICANOS no varió sustancialmente con respecto al vigente al 31 de Marzo 2021 de tal forma que afecte significativamente los estados financieros y de resultados de la sociedad."]
[]
["d.   Efectivo y equivalentes de efectivo"]
["Se considerarán dentro del concepto de efectivo los saldos en efectivo, disponibilidades en cuentas bancarias y toda inversión de muy alta liquidez, con vencimiento originalmente pactado no superior a tres meses corresponde al Fondo Mutuo Crecimiento Renta Fija en guaranies."]
[]
[]
["e.   Inversiones"]
[]
["A la fecha de este informe  la Sociedad cuenta con una inversion en  Fondo Mutuo Crecimiento Renta Fija en guaranies."]
[]
[]
["f. Previsión para cuentas de dudoso cobro/incobrables"]
["La cartera de crédito de la firma se compone con casi el 100% de saldos de instituciones públicas cuyo atraso se considera normal, debido a cuestiones presupuestarias que escapan del ámbito de la firma. Cabe destacar, que las deudas con el Sector Público no preescriben, por ende, la firma no constituye previsión alguna. "]
[]
[]
[]
[]
["g. Inventarios"]
["Las existencias se valúan al menor entre su costo de adquisición o de producción y su valor neto de realización (NIF 12, párrafo 5). Para determinar el consumo (baja de inventarios) se aplica la fórmula de costeo siguientes:           PPP (Precio Promedio Ponderado)."]
[]
[]
["h. Activos disponibles para la venta"]
["Los activos disponibles para la venta representan bienes que fueron desafectados de la actividad productiva y se mantienen con el único objetivo de ser vendidos.  Los mismos se valúan, sin amortizar, al menor entre el valor de mercado de los mismos y su costo (valor libro) al momento de su designación como disponibles para la venta. LA EMPRESA NO CUENTA CON BIENES DISPONIBLES PARA LA VENTA"]
[]
[]
["i. Previsiones para desvalorización y deterioro de inventarios"]
["La firma tiene como política realizar inventarios físicos periodicos a fin de identificar aquellos productos deteriorados y/o vencidos, que ya no están disponibles para la venta, afectando directamente a resultados bajo la cuenta de Pérdida Mercaderías Vencidas. "]
[]
["j. Propiedades, planta y equipo"]
["Las propiedades, planta y equipo se exponen a su costo histórico ajustado por el coeficiente de revalúo emitido por la Autoridad Tributaria, menos la correspondiente depreciación acumulada. El incremento neto por la re-expresión se acredita a la respectiva reserva patrimonial, cuyo saldo puede ser utilizado únicamente para  aumentar el capital."]
["El costo de las mejoras que extienden la vida útil de los bienes o aumentan su capacidad productiva es imputado a las cuentas respectivas del activo. Los gastos de mantenimiento son cargados a resultados."]
["A partir del ejercicio 2020, de acuerdo a la Ley N° 6380/19 Art. 11° ... El Poder Ejecutivo podrá establecer el revalúo obligatorio de los bienes del activo fijo, cuando la variación del índice de Precios al Consumo determinado por el Banco Central del Paraguay alcance al menos 20% (veinte por ciento), acumulado desde el ejercicio en el cual se haya dispuesto el último ajuste por revalúo. El reconocimiento del revalúo obligatorio establecido por el Poder Ejecutivo formará parte de una reserva patrimonial cuyo único destino podrá ser la capitalización; el revalúo se realizará una vez que IPC alcance 20%."]
[]
[]
[]
[]
[]
["k. Intangibles"]
["Los intangibles se exponen a su costo incurrido menos las correspondientes amortizaciones acumuladas al cierre del año."]
["Las amortizaciones son calculadas por el método de línea recta, es un periodo no mayor a 5 años. "]
[]
["l. Goodwill"]
["El saldo de esta cuenta representa la diferencia entre el valor pagado y el valor razonable de los activos netos adquiridos por la operación de compra de la subsidiaria."]
["No aplicable"]
[]
["m. Reconocimiento de ingresos y egresos"]
["Los ingresos y egresos son reconocidos en función de su devengamiento."]
[]
["n. Impuesto a la renta"]
["El impuesto a la renta que se carga a los resultados del año se basa en la utilidad contable antes de este concepto, ajustada por las partidas que la ley incluye o excluye para la determinación de la utilidad gravable a la que se aplica la tasa legal vigente del impuesto y por el reconocimiento del cargo o el ingreso originado por la aplicación del impuesto diferido, si los hubiere. "]
[]
["o. Restricciones a la distribución de utilidades"]
["A la fecha de este informe, no existen restricciones a la distribución de utilidades."]
[]
["p. Derechos en Fideicomiso"]
["A la fecha de éste informe no existen operaciones de la especie constituidas por la empresa."]
[]
["q. Otros principios, prácticas y métodos"]
["A la fecha de éste informe no existen otros principios, prácticas o métodos seguidos por la empresa."]

{"sheet":"Nota 3","index":7,"n_rows":20,"n_cols":5,"rows_kept":20,"cut":false,"hidden":false,"merged":[]}
[{"$f":"Indice!C1","v":"BIOTEC DEL PARAGUAY S.A."},null,null,null,"BG"]
["Obs.: Revelar situación en el caso de contar con disponibilidad restringida"]
[]
[]
[]
[]
["NOTA 3 - EFECTIVO Y EQUIVALENTE DE EFECTIVO"]
["En miles de guaranies"]
["La composición de la cuenta es la siguiente:"]
[]
["Concepto",null,2021,2020]
[]
["Fondo Fijo",null,4447781,6241740]
["Recaudaciones a depositar",null,138949186,31354600]
["Bancos Locales - Moneda local Guaraníes",null,2351709796,3340013054]
["Bancos Locales - Moneda extranjera Dólares",null,43047911,27385924]
["Bancos Locales - Moneda extranjera otros",null,0,0]
["Bancos en el Extranjero - Moneda extranjera Dólares",null,0,0]
["(nuevas cuentas a incluir)"]
["Total",null,578927651,1813608816]

{"sheet":"Nota 4","index":8,"n_rows":18,"n_cols":4,"rows_kept":18,"cut":false,"hidden":false,"merged":[[3,0,3,2],[6,1,6,2]]}
[{"$f":"Indice!C1","v":"BIOTEC DEL PARAGUAY S.A."},null,null,"BG"]
[]
[]
["NOTA 4 - INVERSIONES TEMPORALES"]
[]
["La composición de la cuenta es la siguiente:"]
[null,"En miles de guaranies"]
["Concepto",2021,2020]
["Inversiones en Titulos del Sistema Financiero Local - Moneda Local Guaraníes",0,0]
["Inversiones en Titulos del Sistema Financiero Local - Moneda Extranjera Dólares",0,0]
["Inversiones en Titulos del Sistema Financiero Local - Moneda Extranjera otros",0,0]
["Inversiones en Mercado Bursatil Local - Moneda Local Guaraníes",0,0]
["Inversiones en Mercado Bursatil Local - Moneda Extranjera Dólares",0,0]
["Inversiones en Mercado Bursatil Extranjera - Moneda Extranjera Dólares",0,0]
["Inversiones en Mercado Bursatil Extranjera - Moneda Extranjera otros",0,0]
["Otras inversiones - Moneda Local Guaraníes",637863278,0]
["Otras inversiones - Moneda Extranjera Dólares",168810239,0]
["Total",518890757,0]

{"sheet":"Nota 5","index":9,"n_rows":54,"n_cols":8,"rows_kept":54,"cut":false,"hidden":false,"merged":[[6,2,6,3],[30,2,30,3]]}
[{"$f":"Indice!C1","v":"BIOTEC DEL PARAGUAY S.A."},null,null,null,null,"BG"]
["Detallar cartera vencida y no vencida por clientes locales, extranjeros y partes relacionadas"]
["Se indicarán en este rubro todos los créditos a favor de la empresa provenientes de las  ventas de Mercaderías y/o servicios (atendiendo a la actividades ordinarias de  la empresa), separando las ventas locales en moneda nacional y/o extranjera de las ventas fuera del país en moneda nacional  y/o extranjera"]
[]
["NOTA  5 – CUENTAS POR COBRAR COMERCIALES"]
["Las cuentas a cobrar comerciales a corto plazo se integran como sigue:"]
[null,null,"En miles de guaraníes"]
[null,null,2021,2020,null,"Composición de la cartera de créditos por ventas","2021-06-30"]
["Deudores por ventas locales","Moneda Local Guaraníes",38989191078,38817046724,null,"Situación","Monto","% Previsiones  sobre Cartera "]
["Deudores por ventas locales","Moneda Extranjera Dólares",0,0,null,"A  Total Cartera no Vencida",12626607145,0]
["Deudores por ventas locales","Moneda Extranjera otros",0,0,null,"B. Total Cartera Vencida",26364604427,0]
["Deudores por ventas en el exterior","Moneda Local Guaraníes",0,0,null,"Composición Cartera Vencida"]
["Deudores por ventas en el exterior","Moneda Extranjera Dólares",0,0,null,"Normal",12626607145]
["Deudores por ventas en el exterior","Moneda Extranjera otros",0,0,null,"En Gestión de Cobro",26364604427]
["Deudores - Entidad relacionada","Moneda Local Guaraníes",0,0,null,"En Gestión de Cobro Judicial",0]
["Deudores - Entidad relacionada","Moneda Extranjera Dólares",0,0]
["Deudores - Entidad relacionada","Moneda Extranjera otros",0,0,null,"Total de la cartera de créditos (A+B)",38991211572]
["Cheques adelantados recibidos de clientes","Moneda Local Guaraníes",0,0]
["Cheques adelantados recibidos de clientes","Moneda Extranjera Dólares",0,0,null,"(-) Total Previsiones",0]
["Cheques adelantados recibidos de clientes","Moneda Extranjera otros",0,0]
["Cheques rechazados","Moneda Local Guaraníes",0,0,null,"TOTAL  NETO DE LA CARTERA DE CRÉDITOS",38991211572]
["Cheques rechazados","Moneda Extranjera Dólares",0,0]
["Otros","Moneda Local Guaraníes",0,0,null,"Observaciones"]
["Otros","Moneda Extranjera Dólares",0,0,null,"Criterios de Clasificación utilizados - Cartera Vencida","De","A"]
["Otros","Moneda Extranjera otros",0,0,null,"Normal",1,30]
["Menos Previsiones",null,0,0,null,"En Gestión de Cobro",31,60]
["Total",null,38989191078,38817046724,null,"En Gestión de Cobro Judicial",61,10000]
[]
[]
["Las cuentas a cobrar comerciales a largo plazo se integran como sigue:"]
[null,null,"En miles de guaraníes"]
[null,null,2021,2020]
["Deudores por ventas locales","Moneda Local Guaraníes",0,0]
["Deudores por ventas locales","Moneda Extranjera Dólares",0,0]
["Deudores por ventas locales","Moneda Extranjera otros",0,0]
["Deudores por ventas en el exterior","Moneda Local Guaraníes",0,0]
["Deudores por ventas en el exterior","Moneda Extranjera Dólares",0,0]
["Deudores por ventas en el exterior","Moneda Extranjera otros",0,0]
["Deudores - Entidad relacionada","Moneda Local Guaraníes",0,0]
["Deudores - Entidad relacionada","Moneda Extranjera Dólares",0,0]
["Deudores - Entidad relacionada","Moneda Extranjera otros",0,0]
["Cheques adelantados recibidos de clientes","Moneda Local Guaraníes",0,0]
["Cheques adelantados recibidos de clientes","Moneda Extranjera Dólares",0,0]
["Cheques adelantados recibidos de clientes","Moneda Extranjera otros",0,0]
["Deudores en gestión judicial","Moneda Local Guaraníes",0,0]
["Deudores en gestión judicial","Moneda Extranjera Dólares",0,0]
["Deudores en gestión judicial","Moneda Extranjera otros",0,0]
["Cheques rechazados","Moneda Local Guaraníes",0,0]
["Cheques rechazados","Moneda Extranjera Dólares",0,0]
["Otros","Moneda Local Guaraníes",0,0]
["Otros","Moneda Extranjera Dólares",0,0]
["Otros","Moneda Extranjera otros",0,0]
["Menos Previsiones",null,0,0]
["Total",null,{"$f":"+SUM($C$33:C53)","v":0},{"$f":"+SUM($D$33:D53)","v":0}]

{"sheet":"Nota 6","index":10,"n_rows":18,"n_cols":7,"rows_kept":18,"cut":false,"hidden":false,"merged":[]}
[{"$f":"Indice!C1","v":"BIOTEC DEL PARAGUAY S.A."},null,null,"BG"]
[]
[]
["NOTA 6 - OTROS CRÉDITOS"]
["En miles de guaranies"]
["El rubro de otros créditos se compone como sigue:"]
[]
["Corrientes",null,null,null,"No corrientes"]
[]
["Concepto",2021,2020,null,"Concepto",2021,2020]
["Anticipos a proveedores",103023928,337401243,null,"Garantía de Alquiler"]
["Anticipos a proveedores exterior",6647795964,5991232038,null,"I.V.A. Crédito fiscal"]
["Gastos pagados por adelantado",70474467,81060916,null,"Gastos de desarrollo",47298184,39981820]
["Anticipo Impuesto a la Renta",252069478,0,null,"INTERESES A DEVENGAR - BONOS LP",0,104934927]
["Retención Impuesto a la Renta",531234943,370761617]
["Retención Impuesto al Valor agregado",108005206,207521754,null,"Total",47298184,144916747]
["Otros Creditos",3498960396,970820441]
["Total",13608345075,4393253757]

{"sheet":"Nota 7","index":11,"n_rows":15,"n_cols":4,"rows_kept":15,"cut":false,"hidden":false,"merged":[[6,1,6,2],[5,0,5,6],[3,0,3,2]]}
[{"$f":"Indice!C1","v":"BIOTEC DEL PARAGUAY S.A."},null,null,"BG"]
[]
[]
["NOTA 7 – INVENTARIOS"]
[]
["Los bienes de cambio están compuestos de la siguiente manera:"]
[null,"En miles de guaranies"]
["Concepto",2021,2020]
["Mercaderías",33226711052,21120660445]
["Productos terminados",0,0]
["Productos en proceso",0,0]
["Mercaderías en Curso",0,0]
["Importacion en Curso",8386185653,2929455834]
["(-) Previsión para desvalorización y deterioro de inventario",0,0]
["Total ",36564474317,18652842088]

{"sheet":"Nota 8","index":12,"n_rows":18,"n_cols":12,"rows_kept":18,"cut":false,"hidden":false,"merged":[[3,0,3,5],[12,0,16,4],[12,6,16,11]]}
[{"$f":"Indice!C1","v":"BIOTEC DEL PARAGUAY S.A."},null,null,"BG"]
[]
[]
["Nota 8 - INVERSIONES EN ASOCIADAS"]
["En miles de guaraníes"]
["Las inversiones en sociedades donde no se ejerce control se describen a continuación"]
["Periodo",2021,2020]
["Total Inversión",{"$f":"SUM($I$13:I18)","v":0},0,"<-- Indicar Monto"]
[]
["a) Datos sobre la sociedad:",null,null,null,null,null,"a) Datos sobre la inversión:"]
[null,null,null,{"$f":"IFERROR(IF(Indice!B6=\"\",\"2XX2\",YEAR(Indice!B6)),\"2XX2\")","v":2021}]
["Nombre de Sociedad","RUC","Cantidad de acciones","Total Patrimonio neto","Total del resultado",null,"Cantidad de acciones","Participación sobre los votos (%)","Total Inversión (miles de Gs)","Participación sobre el Patrimonio Neto (%)","Total valuación patrimonial proporcional","Resultado sobre inversiones"]
["NO APLICABLE",null,null,null,null,null,"NO APLICABLE"]
[]
[]
[]
[]
[null,null,null,null,null,null,null,null,null,null,{"$f":"J18*D18","v":0},{"$f":"J18*E18","v":0}]

{"sheet":"Nota 9","index":13,"n_rows":20,"n_cols":13,"rows_kept":20,"cut":false,"hidden":false,"merged":[[3,0,3,12]]}
[{"$f":"Indice!C1","v":"BIOTEC DEL PARAGUAY S.A."},null,null,null,null,null,null,null,null,null,null,"BG"]
[]
[]
["NOTA 9 - PROPIEDADES, PLANTA Y EQUIPO - NETO"]
["En miles de guaraníes",null,null,null,null,null,null,null,null,-1]
[]
[null,"Costo histórico revaluado al inicio del año","Adquisiciones","Bajas","Revalúo del año","Valor de origen revaluado al final del año","Depreciación acumulada revaluada al inicio del año","Depreciación del año","Bajas de depreciaciones acumuladas","Revalúo depreciación acumulada del año","Depreciación acumulada revaluada al final del año","Valor neto contable"]
[null,null,null,null,null,null,null,null,null,null,null,{"$f":"IFERROR(IF(Indice!B6=\"\",\"2XX2\",YEAR(Indice!B6)),\"2XX2\")","v":2021},2020]
["Inmuebles",3247062373.5051069,0,0,0,3247062373.5051069,0,0,0,0,0,3247062373.5051069,1822036373]
["Rodados",1431601335.1827846,0,0,0,1431601335.1827846,1302863999,197744316,0,0,1500608315,1233857019.1827846,1478791687]
["Muebles y útiles",255164916,17969999,240000,0,272894915,378784209,22250694,0,0,401034903,250644221,245880313]
["Equipos de Laboratorio",14225156779.794188,145357116,0,0,14370513895.794188,15773704781,1334066922,0,0,17107771703,13036446973.794188,13009703905]
["Equipos de comunicación",12225866,0,0,0,12225866,13446878,2265060,0,0,15711938,9960806,13641280]
["Equipo de Informatica",374111318.52384472,121277414,3709091,0,491679641.52384472,1727469307,138545478,0,0,1866014785,353134163.52384472,425502863]
["Mejora Predio Ajeno",182249956.8336466,2888182,0,0,185138138.8336466,388315801,16696008,0,0,405011809,168442130.8336466,197524607]
["Software",28770552.316115558,0,0,0,28770552.316115558,499780132,11171910,0,0,510952042,17598642.316115558,39611158]
["Edificios",466432478.32824671,1545455,0,0,467977933.32824671,115946029,0,0,0,115946029,467977933.32824671,449848817]
["Instalaciones",40902047.831846535,2758182,0,0,43660229.831846535,370125291,23349186,0,0,393474477,20311043.831846535,49648726]
["Obras en Curso",418253000,2489562738,0,0,2907815738,0,0,0,0,0,2907815738,418253000]
["Totales",20681930624.315781,2781359086,3949091,0,23459340619.315781,20570436427,1746089574,0,0,22316526001,21713251045.315781,18150442729]

{"sheet":"Nota 10","index":14,"n_rows":19,"n_cols":3,"rows_kept":19,"cut":false,"hidden":false,"merged":[[4,1,4,2],[11,16120,11,16125],[11,16126,11,16131],[11,16132,11,16137],[11,16138,11,16143],[11,16144,11,16149],[11,16150,11,16155],[11,16084,11,16089],[11,16090,11,16095],[11,16096,11,16101],[11,16102,11,16107],[11,16108,11,16113],[11,16114,11,16119],[11,16048,11,16053],[11,16054,11,16059],[11,16060,11,16065],[11,16066,11,16071],[11,16072,11,16077],[11,16078,11,16083],[11,16012,11,16017],[11,16018,11,16023],[11,16024,11,16029],[11,16030,11,16035],[11,16036,11,16041],[11,16042,11,16047],[11,15976,11,15981],[11,16372,11,16377],[11,16378,11,16381],[11,16336,11,16341],[11,16342,11,16347],[11,16348,11,16353],[11,16354,11,16359],[11,16360,11,16365],[11,16366,11,16371],[11,16300,11,16305],[11,16306,11,16311],[11,16312,11,16317],[11,16318,11,16323],[11,16324,11,16329],[11,16330,11,16335],[11,16264,11,16269],[11,16270,11,16275],[11,16276,11,16281],[11,16282,11,16287],[11,16288,11,16293],[11,16294,11,16299],[11,16228,11,16233],[11,16234,11,16239],[11,16240,11,16245],[11,16246,11,16251],[11,16252,11,16257],[11,16258,11,16263],[11,16192,11,16197],[11,16198,11,16203],[11,16204,11,16209],[11,16210,11,16215],[11,16216,11,16221],[11,16222,11,16227],[11,16156,11,16161],[11,16162,11,16167],[11,16168,11,16173],[11,16174,11,16179],[11,16180,11,16185],[11,16186,11,16191],[11,15982,11,15987],[11,15988,11,15993],[11,15994,11,15999],[11,16000,11,16005],[11,16006,11,16011],[11,15940,11,15945],[11,15946,11,15951],[11,15952,11,15957],[11,15958,11,15963],[11,15964,11,15969],[11,15970,11,15975],[11,15904,11,15909],[11,15910,11,15915],[11,15916,11,15921],[11,15922,11,15927],[11,15928,11,15933],[11,15934,11,15939],[11,15868,11,15873],[11,15874,11,15879],[11,15880,11,15885],[11,15886,11,15891],[11,15892,11,15897],[11,15898,11,15903],[11,15832,11,15837],[11,15838,11,15843],[11,15844,11,15849],[11,15850,11,15855],[11,15856,11,15861],[11,15862,11,15867],[11,15796,11,15801],[11,15802,11,15807],[11,15808,11,15813],[11,15814,11,15819],[11,15820,11,15825],[11,15826,11,15831],[11,15760,11,15765],[11,15766,11,15771],[11,15772,11,15777],[11,15778,11,15783],[11,15784,11,15789],[11,15790,11,15795],[11,15724,11,15729],[11,15730,11,15735],[11,15736,11,15741],[11,15742,11,15747],[11,15748,11,15753],[11,15754,11,15759],[11,15688,11,15693],[11,15694,11,15699],[11,15700,11,15705],[11,15706,11,15711],[11,15712,11,15717],[11,15718,11,15723],[11,15652,11,15657],[11,15658,11,15663],[11,15664,11,15669],[11,15670,11,15675],[11,15676,11,15681],[11,15682,11,15687],[11,15616,11,15621],[11,15622,11,15627],[11,15628,11,15633],[11,15634,11,15639],[11,15640,11,15645],[11,15646,11,15651],[11,15580,11,15585],[11,15586,11,15591],[11,15592,11,15597],[11,15598,11,15603],[11,15604,11,15609],[11,15610,11,15615],[11,15544,11,15549],[11,15550,11,15555],[11,15556,11,15561],[11,15562,11,15567],[11,15568,11,15573],[11,15574,11,15579],[11,15508,11,15513],[11,15514,11,15519],[11,15520,11,15525],[11,15526,11,15531],[11,15532,11,15537],[11,15538,11,15543],[11,15472,11,15477],[11,15478,11,15483],[11,15484,11,15489],[11,15490,11,15495],[11,15496,11,15501],[11,15502,11,15507],[11,15436,11,15441],[11,15442,11,15447],[11,15448,11,15453],[11,15454,11,15459],[11,15460,11,15465],[11,15466,11,15471],[11,15400,11,15405],[11,15406,11,15411],[11,15412,11,15417],[11,15418,11,15423],[11,15424,11,15429],[11,15430,11,15435],[11,15364,11,15369],[11,15370,11,15375],[11,15376,11,15381],[11,15382,11,15387],[11,15388,11,15393],[11,15394,11,15399],[11,15328,11,15333],[11,15334,11,15339],[11,15340,11,15345],[11,15346,11,15351],[11,15352,11,15357],[11,15358,11,15363],[11,15292,11,15297],[11,15298,11,15303],[11,15304,11,15309],[11,15310,11,15315],[11,15316,11,15321],[11,15322,11,15327],[11,15256,11,15261],[11,15262,11,15267],[11,15268,11,15273],[11,15274,11,15279],[11,15280,11,15285],[11,15286,11,15291],[11,15220,11,15225],[11,15226,11,15231],[11,15232,11,15237],[11,15238,11,15243],[11,15244,11,15249],[11,15250,11,15255],[11,15184,11,15189],[11,15190,11,15195],[11,15196,11,15201],[11,15202,11,15207],[11,15208,11,15213],[11,15214,11,15219],[11,15148,11,15153],[11,15154,11,15159],[11,15160,11,15165],[11,15166,11,15171],[11,15172,11,15177],[11,15178,11,15183],[11,15112,11,15117],[11,15118,11,15123],[11,15124,11,15129],[11,15130,11,15135],[11,15136,11,15141],[11,15142,11,15147],[11,15076,11,15081],[11,15082,11,15087],[11,15088,11,15093],[11,15094,11,15099],[11,15100,11,15105],[11,15106,11,15111],[11,15040,11,15045],[11,15046,11,15051],[11,15052,11,15057],[11,15058,11,15063],[11,15064,11,15069],[11,15070,11,15075],[11,15004,11,15009],[11,15010,11,15015],[11,15016,11,15021],[11,15022,11,15027],[11,15028,11,15033],[11,15034,11,15039],[11,14968,11,14973],[11,14974,11,14979],[11,14980,11,14985],[11,14986,11,14991],[11,14992,11,14997],[11,14998,11,15003],[11,14932,11,14937],[11,14938,11,14943],[11,14944,11,14949],[11,14950,11,14955],[11,14956,11,14961],[11,14962,11,14967],[11,14896,11,14901],[11,14902,11,14907],[11,14908,11,14913],[11,14914,11,14919],[11,14920,11,14925],[11,14926,11,14931],[11,14860,11,14865],[11,14866,11,14871],[11,14872,11,14877],[11,14878,11,14883],[11,14884,11,14889],[11,14890,11,14895],[11,14824,11,14829],[11,14830,11,14835],[11,14836,11,14841],[11,14842,11,14847],[11,14848,11,14853],[11,14854,11,14859],[11,14788,11,14793],[11,14794,11,14799],[11,14800,11,14805],[11,14806,11,14811],[11,14812,11,14817],[11,14818,11,14823],[11,14752,11,14757],[11,14758,11,14763],[11,14764,11,14769],[11,14770,11,14775],[11,14776,11,14781],[11,14782,11,14787],[11,14716,11,14721],[11,14722,11,14727],[11,14728,11,14733],[11,14734,11,14739],[11,14740,11,14745],[11,14746,11,14751],[11,14680,11,14685],[11,14686,11,14691],[11,14692,11,14697],[11,14698,11,14703],[11,14704,11,14709],[11,14710,11,14715],[11,14644,11,14649],[11,14650,11,14655],[11,14656,11,14661],[11,14662,11,14667],[11,14668,11,14673],[11,14674,11,14679],[11,14608,11,14613],[11,14614,11,14619],[11,14620,11,14625],[11,14626,11,14631],[11,14632,11,14637],[11,14638,11,14643],[11,14572,11,14577],[11,14578,11,14583],[11,14584,11,14589],[11,14590,11,14595],[11,14596,11,14601],[11,14602,11,14607],[11,14536,11,14541],[11,14542,11,14547],[11,14548,11,14553],[11,14554,11,14559],[11,14560,11,14565],[11,14566,11,14571],[11,14500,11,14505],[11,14506,11,14511],[11,14512,11,14517],[11,14518,11,14523],[11,14524,11,14529],[11,14530,11,14535],[11,14464,11,14469],[11,14470,11,14475],[11,14476,11,14481],[11,14482,11,14487],[11,14488,11,14493],[11,14494,11,14499],[11,14428,11,14433],[11,14434,11,14439],[11,14440,11,14445],[11,14446,11,14451],[11,14452,11,14457],[11,14458,11,14463],[11,14392,11,14397],[11,14398,11,14403],[11,14404,11,14409],[11,14410,11,14415],[11,14416,11,14421],[11,14422,11,14427],[11,14356,11,14361],[11,14362,11,14367],[11,14368,11,14373],[11,14374,11,14379],[11,14380,11,14385],[11,14386,11,14391],[11,14320,11,14325],[11,14326,11,14331],[11,14332,11,14337],[11,14338,11,14343],[11,14344,11,14349],[11,14350,11,14355],[11,14284,11,14289],[11,14290,11,14295],[11,14296,11,14301],[11,14302,11,14307],[11,14308,11,14313],[11,14314,11,14319],[11,14248,11,14253],[11,14254,11,14259],[11,14260,11,14265],[11,14266,11,14271],[11,14272,11,14277],[11,14278,11,14283],[11,14212,11,14217],[11,14218,11,14223],[11,14224,11,14229],[11,14230,11,14235],[11,14236,11,14241],[11,14242,11,14247],[11,14176,11,14181],[11,14182,11,14187],[11,14188,11,14193],[11,14194,11,14199],[11,14200,11,14205],[11,14206,11,14211],[11,14140,11,14145],[11,14146,11,14151],[11,14152,11,14157],[11,14158,11,14163],[11,14164,11,14169],[11,14170,11,14175],[11,14104,11,14109],[11,14110,11,14115],[11,14116,11,14121],[11,14122,11,14127],[11,14128,11,14133],[11,14134,11,14139],[11,14068,11,14073],[11,14074,11,14079],[11,14080,11,14085],[11,14086,11,14091],[11,14092,11,14097],[11,14098,11,14103],[11,14032,11,14037],[11,14038,11,14043],[11,14044,11,14049],[11,14050,11,14055],[11,14056,11,14061],[11,14062,11,14067],[11,13996,11,14001],[11,14002,11,14007],[11,14008,11,14013],[11,14014,11,14019],[11,14020,11,14025],[11,14026,11,14031],[11,13960,11,13965],[11,13966,11,13971],[11,13972,11,13977],[11,13978,11,13983],[11,13984,11,13989],[11,13990,11,13995],[11,13924,11,13929],[11,13930,11,13935],[11,13936,11,13941],[11,13942,11,13947],[11,13948,11,13953],[11,13954,11,13959],[11,13888,11,13893],[11,13894,11,13899],[11,13900,11,13905],[11,13906,11,13911],[11,13912,11,13917],[11,13918,11,13923],[11,13852,11,13857],[11,13858,11,13863],[11,13864,11,13869],[11,13870,11,13875],[11,13876,11,13881],[11,13882,11,13887],[11,13816,11,13821],[11,13822,11,13827],[11,13828,11,13833],[11,13834,11,13839],[11,13840,11,13845],[11,13846,11,13851],[11,13780,11,13785],[11,13786,11,13791],[11,13792,11,13797],[11,13798,11,13803],[11,13804,11,13809],[11,13810,11,13815],[11,13744,11,13749],[11,13750,11,13755],[11,13756,11,13761],[11,13762,11,13767],[11,13768,11,13773],[11,13774,11,13779],[11,13708,11,13713],[11,13714,11,13719],[11,13720,11,13725],[11,13726,11,13731],[11,13732,11,13737],[11,13738,11,13743],[11,13672,11,13677],[11,13678,11,13683],[11,13684,11,13689],[11,13690,11,13695],[11,13696,11,13701],[11,13702,11,13707],[11,13636,11,13641],[11,13642,11,13647],[11,13648,11,13653],[11,13654,11,13659],[11,13660,11,13665],[11,13666,11,13671],[11,13600,11,13605],[11,13606,11,13611],[11,13612,11,13617],[11,13618,11,13623],[11,13624,11,13629],[11,13630,11,13635],[11,13564,11,13569],[11,13570,11,13575],[11,13576,11,13581],[11,13582,11,13587],[11,13588,11,13593],[11,13594,11,13599],[11,13528,11,13533],[11,13534,11,13539],[11,13540,11,13545],[11,13546,11,13551],[11,13552,11,13557],[11,13558,11,13563],[11,13492,11,13497],[11,13498,11,13503],[11,13504,11,13509],[11,13510,11,13515],[11,13516,11,13521],[11,13522,11,13527],[11,13456,11,13461],[11,13462,11,13467],[11,13468,11,13473],[11,13474,11,13479],[11,13480,11,13485],[11,13486,11,13491],[11,13420,11,13425],[11,13426,11,13431],[11,13432,11,13437],[11,13438,11,13443],[11,13444,11,13449],[11,13450,11,13455],[11,13384,11,13389],[11,13390,11,13395],[11,13396,11,13401],[11,13402,11,13407],[11,13408,11,13413],[11,13414,11,13419],[11,13348,11,13353],[11,13354,11,13359],[11,13360,11,13365],[11,13366,11,13371],[11,13372,11,13377],[11,13378,11,13383],[11,13312,11,13317],[11,13318,11,13323],[11,13324,11,13329],[11,13330,11,13335],[11,13336,11,13341],[11,13342,11,13347],[11,13276,11,13281],[11,13282,11,13287],[11,13288,11,13293],[11,13294,11,13299],[11,13300,11,13305],[11,13306,11,13311],[11,13240,11,13245],[11,13246,11,13251],[11,13252,11,13257],[11,13258,11,13263],[11,13264,11,13269],[11,13270,11,13275],[11,13204,11,13209],[11,13210,11,13215],[11,13216,11,13221],[11,13222,11,13227],[11,13228,11,13233],[11,13234,11,13239],[11,13168,11,13173],[11,13174,11,13179],[11,13180,11,13185],[11,13186,11,13191],[11,13192,11,13197],[11,13198,11,13203],[11,13132,11,13137],[11,13138,11,13143],[11,13144,11,13149],[11,13150,11,13155],[11,13156,11,13161],[11,13162,11,13167],[11,13096,11,13101],[11,13102,11,13107],[11,13108,11,13113],[11,13114,11,13119],[11,13120,11,13125],[11,13126,11,13131],[11,13060,11,13065],[11,13066,11,13071],[11,13072,11,13077],[11,13078,11,13083],[11,13084,11,13089],[11,13090,11,13095],[11,13024,11,13029],[11,13030,11,13035],[11,13036,11,13041],[11,13042,11,13047],[11,13048,11,13053],[11,13054,11,13059],[11,12988,11,12993],[11,12994,11,12999],[11,13000,11,13005],[11,13006,11,13011],[11,13012,11,13017],[11,13018,11,13023],[11,12952,11,12957],[11,12958,11,12963],[11,12964,11,12969],[11,12970,11,12975],[11,12976,11,12981],[11,12982,11,12987],[11,12916,11,12921],[11,12922,11,12927],[11,12928,11,12933],[11,12934,11,12939],[11,12940,11,12945],[11,12946,11,12951],[11,12880,11,12885],[11,12886,11,12891],[11,12892,11,12897],[11,12898,11,12903],[11,12904,11,12909],[11,12910,11,12915],[11,12844,11,12849],[11,12850,11,12855],[11,12856,11,12861],[11,12862,11,12867],[11,12868,11,12873],[11,12874,11,12879],[11,12808,11,12813],[11,12814,11,12819],[11,12820,11,12825],[11,12826,11,12831],[11,12832,11,12837],[11,12838,11,12843],[11,12772,11,12777],[11,12778,11,12783],[11,12784,11,12789],[11,12790,11,12795],[11,12796,11,12801],[11,12802,11,12807],[11,12736,11,12741],[11,12742,11,12747],[11,12748,11,12753],[11,12754,11,12759],[11,12760,11,12765],[11,12766,11,12771],[11,12700,11,12705],[11,12706,11,12711],[11,12712,11,12717],[11,12718,11,12723],[11,12724,11,12729],[11,12730,11,12735],[11,12664,11,12669],[11,12670,11,12675],[11,12676,11,12681],[11,12682,11,12687],[11,12688,11,12693],[11,12694,11,12699],[11,12628,11,12633],[11,12634,11,12639],[11,12640,11,12645],[11,12646,11,12651],[11,12652,11,12657],[11,12658,11,12663],[11,12592,11,12597],[11,12598,11,12603],[11,12604,11,12609],[11,12610,11,12615],[11,12616,11,12621],[11,12622,11,12627],[11,12556,11,12561],[11,12562,11,12567],[11,12568,11,12573],[11,12574,11,12579],[11,12580,11,12585],[11,12586,11,12591],[11,12520,11,12525],[11,12526,11,12531],[11,12532,11,12537],[11,12538,11,12543],[11,12544,11,12549],[11,12550,11,12555],[11,12484,11,12489],[11,12490,11,12495],[11,12496,11,12501],[11,12502,11,12507],[11,12508,11,12513],[11,12514,11,12519],[11,12448,11,12453],[11,12454,11,12459],[11,12460,11,12465],[11,12466,11,12471],[11,12472,11,12477],[11,12478,11,12483],[11,12412,11,12417],[11,12418,11,12423],[11,12424,11,12429],[11,12430,11,12435],[11,12436,11,12441],[11,12442,11,12447],[11,12376,11,12381],[11,12382,11,12387],[11,12388,11,12393],[11,12394,11,12399],[11,12400,11,12405],[11,12406,11,12411],[11,12340,11,12345],[11,12346,11,12351],[11,12352,11,12357],[11,12358,11,12363],[11,12364,11,12369],[11,12370,11,12375],[11,12304,11,12309],[11,12310,11,12315],[11,12316,11,12321],[11,12322,11,12327],[11,12328,11,12333],[11,12334,11,12339],[11,12268,11,12273],[11,12274,11,12279],[11,12280,11,12285],[11,12286,11,12291],[11,12292,11,12297],[11,12298,11,12303],[11,12232,11,12237],[11,12238,11,12243],[11,12244,11,12249],[11,12250,11,12255],[11,12256,11,12261],[11,12262,11,12267],[11,12196,11,12201],[11,12202,11,12207],[11,12208,11,12213],[11,12214,11,12219],[11,12220,11,12225],[11,12226,11,12231],[11,12160,11,12165],[11,12166,11,12171],[11,12172,11,12177],[11,12178,11,12183],[11,12184,11,12189],[11,12190,11,12195],[11,12124,11,12129],[11,12130,11,12135],[11,12136,11,12141],[11,12142,11,12147],[11,12148,11,12153],[11,12154,11,12159],[11,12088,11,12093],[11,12094,11,12099],[11,12100,11,12105],[11,12106,11,12111],[11,12112,11,12117],[11,12118,11,12123],[11,12052,11,12057],[11,12058,11,12063],[11,12064,11,12069],[11,12070,11,12075],[11,12076,11,12081],[11,12082,11,12087],[11,12016,11,12021],[11,12022,11,12027],[11,12028,11,12033],[11,12034,11,12039],[11,12040,11,12045],[11,12046,11,12051],[11,11980,11,11985],[11,11986,11,11991],[11,11992,11,11997],[11,11998,11,12003],[11,12004,11,12009],[11,12010,11,12015],[11,11944,11,11949],[11,11950,11,11955],[11,11956,11,11961],[11,11962,11,11967],[11,11968,11,11973],[11,11974,11,11979],[11,11908,11,11913],[11,11914,11,11919],[11,11920,11,11925],[11,11926,11,11931],[11,11932,11,11937],[11,11938,11,11943],[11,11872,11,11877],[11,11878,11,11883],[11,11884,11,11889],[11,11890,11,11895],[11,11896,11,11901],[11,11902,11,11907],[11,11836,11,11841],[11,11842,11,11847],[11,11848,11,11853],[11,11854,11,11859],[11,11860,11,11865],[11,11866,11,11871],[11,11800,11,11805],[11,11806,11,11811],[11,11812,11,11817],[11,11818,11,11823],[11,11824,11,11829],[11,11830,11,11835],[11,11764,11,11769],[11,11770,11,11775],[11,11776,11,11781],[11,11782,11,11787],[11,11788,11,11793],[11,11794,11,11799],[11,11728,11,11733],[11,11734,11,11739],[11,11740,11,11745],[11,11746,11,11751],[11,11752,11,11757],[11,11758,11,11763],[11,11692,11,11697],[11,11698,11,11703],[11,11704,11,11709],[11,11710,11,11715],[11,11716,11,11721],[11,11722,11,11727],[11,11656,11,11661],[11,11662,11,11667],[11,11668,11,11673],[11,11674,11,11679],[11,11680,11,11685],[11,11686,11,11691],[11,11620,11,11625],[11,11626,11,11631],[11,11632,11,11637],[11,11638,11,11643],[11,11644,11,11649],[11,11650,11,11655],[11,11584,11,11589],[11,11590,11,11595],[11,11596,11,11601],[11,11602,11,11607],[11,11608,11,11613],[11,11614,11,11619],[11,11548,11,11553],[11,11554,11,11559],[11,11560,11,11565],[11,11566,11,11571],[11,11572,11,11577],[11,11578,11,11583],[11,11512,11,11517],[11,11518,11,11523],[11,11524,11,11529],[11,11530,11,11535],[11,11536,11,11541],[11,11542,11,11547],[11,11476,11,11481],[11,11482,11,11487],[11,11488,11,11493],[11,11494,11,11499],[11,11500,11,11505],[11,11506,11,11511],[11,11440,11,11445],[11,11446,11,11451],[11,11452,11,11457],[11,11458,11,11463],[11,11464,11,11469],[11,11470,11,11475],[11,11404,11,11409],[11,11410,11,11415],[11,11416,11,11421],[11,11422,11,11427],[11,11428,11,11433],[11,11434,11,11439],[11,11368,11,11373],[11,11374,11,11379],[11,11380,11,11385],[11,11386,11,11391],[11,11392,11,11397],[11,11398,11,11403],[11,11332,11,11337],[11,11338,11,11343],[11,11344,11,11349],[11,11350,11,11355],[11,11356,11,11361],[11,11362,11,11367],[11,11296,11,11301],[11,11302,11,11307],[11,11308,11,11313],[11,11314,11,11319],[11,11320,11,11325],[11,11326,11,11331],[11,11260,11,11265],[11,11266,11,11271],[11,11272,11,11277],[11,11278,11,11283],[11,11284,11,11289],[11,11290,11,11295],[11,11224,11,11229],[11,11230,11,11235],[11,11236,11,11241],[11,11242,11,11247],[11,11248,11,11253],[11,11254,11,11259],[11,11188,11,11193],[11,11194,11,11199],[11,11200,11,11205],[11,11206,11,11211],[11,11212,11,11217],[11,11218,11,11223],[11,11152,11,11157],[11,11158,11,11163],[11,11164,11,11169],[11,11170,11,11175],[11,11176,11,11181],[11,11182,11,11187],[11,11116,11,11121],[11,11122,11,11127],[11,11128,11,11133],[11,11134,11,11139],[11,11140,11,11145],[11,11146,11,11151],[11,11080,11,11085],[11,11086,11,11091],[11,11092,11,11097],[11,11098,11,11103],[11,11104,11,11109],[11,11110,11,11115],[11,11044,11,11049],[11,11050,11,11055],[11,11056,11,11061],[11,11062,11,11067],[11,11068,11,11073],[11,11074,11,11079],[11,11008,11,11013],[11,11014,11,11019],[11,11020,11,11025],[11,11026,11,11031],[11,11032,11,11037],[11,11038,11,11043],[11,10972,11,10977],[11,10978,11,10983],[11,10984,11,10989],[11,10990,11,10995],[11,10996,11,11001],[11,11002,11,11007],[11,10936,11,10941],[11,10942,11,10947],[11,10948,11,10953],[11,10954,11,10959],[11,10960,11,10965],[11,10966,11,10971],[11,10900,11,10905],[11,10906,11,10911],[11,10912,11,10917],[11,10918,11,10923],[11,10924,11,10929],[11,10930,11,10935],[11,10864,11,10869],[11,10870,11,10875],[11,10876,11,10881],[11,10882,11,10887],[11,10888,11,10893],[11,10894,11,10899],[11,10828,11,10833],[11,10834,11,10839],[11,10840,11,10845],[11,10846,11,10851],[11,10852,11,10857],[11,10858,11,10863],[11,10792,11,10797],[11,10798,11,10803],[11,10804,11,10809],[11,10810,11,10815],[11,10816,11,10821],[11,10822,11,10827],[11,10756,11,10761],[11,10762,11,10767],[11,10768,11,10773],[11,10774,11,10779],[11,10780,11,10785],[11,10786,11,10791],[11,10720,11,10725],[11,10726,11,10731],[11,10732,11,10737],[11,10738,11,10743],[11,10744,11,10749],[11,10750,11,10755],[11,10684,11,10689],[11,10690,11,10695],[11,10696,11,10701],[11,10702,11,10707],[11,10708,11,10713],[11,10714,11,10719],[11,10648,11,10653],[11,10654,11,10659],[11,10660,11,10665],[11,10666,11,10671],[11,10672,11,10677],[11,10678,11,10683],[11,10612,11,10617],[11,10618,11,10623],[11,10624,11,10629],[11,10630,11,10635],[11,10636,11,10641],[11,10642,11,10647],[11,10576,11,10581],[11,10582,11,10587],[11,10588,11,10593],[11,10594,11,10599],[11,10600,11,10605],[11,10606,11,10611],[11,10540,11,10545],[11,10546,11,10551],[11,10552,11,10557],[11,10558,11,10563],[11,10564,11,10569],[11,10570,11,10575],[11,10504,11,10509],[11,10510,11,10515],[11,10516,11,10521],[11,10522,11,10527],[11,10528,11,10533],[11,10534,11,10539],[11,10468,11,10473],[11,10474,11,10479],[11,10480,11,10485],[11,10486,11,10491],[11,10492,11,10497],[11,10498,11,10503],[11,10432,11,10437],[11,10438,11,10443],[11,10444,11,10449],[11,10450,11,10455],[11,10456,11,10461],[11,10462,11,10467],[11,10396,11,10401],[11,10402,11,10407],[11,10408,11,10413],[11,10414,11,10419],[11,10420,11,10425],[11,10426,11,10431],[11,10360,11,10365]],"merged_total":13651,"flags":["merged_cut"]}
[{"$f":"Indice!C1","v":"BIOTEC DEL PARAGUAY S.A."},null,"BG"]
[]
[]
["NOTA 10 – ACTIVOS DISPONIBLES PARA LA VENTA"]
[null,"En miles de guaranies"]
[null,2021,2020]
["Propiedad, planta y equipo"]
["(Detallar bienes de uso)","N/A","N/A"]
["Total",{"$f":"B8","v":"N/A"},{"$f":"C8","v":"N/A"}]
[]
["Activos intangibles"]
["(Detallar activos intangibles)","N/A","N/A"]
["Total",{"$f":"B12","v":"N/A"},{"$f":"C12","v":"N/A"}]
[]
["Inversiones"]
["(Detallar Inversiones","N/A","N/A"]
["Total",{"$f":"B16","v":"N/A"},{"$f":"C16","v":"N/A"}]
[]
["Total general",0,0]

{"sheet":"Nota 11","index":15,"n_rows":10,"n_cols":6,"rows_kept":10,"cut":false,"hidden":false,"merged":[[3,0,3,3],[4,1,4,2]]}
[{"$f":"Indice!C1","v":"BIOTEC DEL PARAGUAY S.A."},null,null,null,null,"BG"]
[]
[]
["NOTA 11 – ACTIVOS INTANGIBLES"]
[null,"En miles de guaranies"]
["Activos intangibles",2021,2020]
["Licencias Marcas y Patente",502080044,464776044]
["Menos amortización acumulada",-417141944,-347377040]
[]
["Total general",84938100,117399004]

{"sheet":"Nota 12","index":16,"n_rows":9,"n_cols":5,"rows_kept":9,"cut":false,"hidden":false,"merged":[[5,1,5,2]]}
[{"$f":"Indice!C1","v":"BIOTEC DEL PARAGUAY S.A."},null,null,null,"BG"]
[]
[]
[]
["NOTA 12 – GOODWILL"]
[null,"En miles de guaranies"]
["Goodwill",2021,2020]
[null,"N/A","N/A"]
["Total general",0,0]

{"sheet":"Nota 13","index":17,"n_rows":26,"n_cols":5,"rows_kept":26,"cut":false,"hidden":false,"merged":[]}
[{"$f":"Indice!C1","v":"BIOTEC DEL PARAGUAY S.A."},null,"BG"]
[]
[]
["NOTA 13 – CUENTAS POR PAGAR COMERCIALES"]
["En miles de guaranies"]
["Las cuentas por pagar comerciales se componen como sigue:"]
[]
["Corrientes","Simbología según ISO 4217","Indicación de Moneda",2021,2020]
["Proveedores - Entidades Relacionadas",null,""]
["Otros proveedores del exterior",null,"",12445546197,8218169760]
["Proveedores locales",null,"",1224407668,1320028018]
["Acreesores Varios Milciades Ramos",null,"",4768350,6592500]
["Tarjeta de Credito Familiar",null,"",483664,10137147]
["Total cuentas a pagar por comerciales",null,null,13675205879,9554927425]
[]
[]
[]
["No Corrientes","Simbología según ISO 4217","Indicación de Moneda",2021,2020]
["Proveedores - Entidades Relacionadas",null,"",0,0]
["Otros proveedores del exterior",null,"",0,0]
["Proveedores locales",null,"",0,0]
["(nuevas cuentas a incluir)",null,"",0,0]
["Total cuentas a pagar por comerciales",null,null,0,0]
[]
[]
["Indicación de monedas"]

{"sheet":"Nota 14","index":18,"n_rows":79,"n_cols":12,"rows_kept":79,"cut":false,"hidden":false,"merged":[]}
[{"$f":"Indice!C1","v":"BIOTEC DEL PARAGUAY S.A."},null,null,null,"BG",null,null,null,null,null,null,"BG"]
[]
[]
["NOTA 14 –  PRESTAMOS A CORTO Y LARGO PLAZO"]
[]
["(a) Equivalentes al tipo de cambio referencial de la fecha de presentacion"]
["(b) Obligaciones garantizadas por valor de guaraníes……….."]
[]
["Corrientes"]
[null,null,null,{"$f":"IFERROR(IF(Indice!B6=\"\",\"2XX2\",YEAR(Indice!B6)),\"2XX2\")","v":2021},null,null,null,null,null,2020]
["Préstamos de Entidades Locales","Vencimiento","Símbolo de Moneda","Moneda","Importe (miles de Gs)","Tipo de Garantía",null,"Vencimiento","Símbolo de Moneda","Moneda","Importe (miles de Gs)","Tipo de Garantía"]
["          PRESTAMOS SUDAMERIS BANK",null,"PYG",{"$f":"IFERROR(VLOOKUP(C12,'[1]Base de Monedas'!A:B,2,0),\"\")","v":"Guaraní"},0,null,null,"2021-02-18","PYG",{"$f":"IFERROR(VLOOKUP(I12,'[1]Base de Monedas'!A:B,2,0),\"\")","v":"Guaraní"},1000000000,"Codeudora"]
["          PRESTAMO BANCO BASA S.A.","2021-09-07","PYG",{"$f":"IFERROR(VLOOKUP(C13,'[1]Base de Monedas'!A:B,2,0),\"\")","v":"Guaraní"},{"$f":"1500000000+2342000000","v":3842000000},"Solidaria ",null,"2020-10-01","PYG",{"$f":"IFERROR(VLOOKUP(I13,'[1]Base de Monedas'!A:B,2,0),\"\")","v":"Guaraní"},{"$f":"2000000000+500000000+500000000","v":3000000000},"Solidaria "]
["          PRESTAMO FINANCIERA RIO S.A.E.C.A","2022-04-26","PYG",{"$f":"IFERROR(VLOOKUP(C14,'[1]Base de Monedas'!A:B,2,0),\"\")","v":"Guaraní"},1000000000,"Solidaria ",null,null,"PYG",{"$f":"IFERROR(VLOOKUP(I14,'[1]Base de Monedas'!A:B,2,0),\"\")","v":"Guaraní"}]
["          PRESTAMO BANCOP S.A.","2022-03-20","PYG",{"$f":"IFERROR(VLOOKUP(C15,'[1]Base de Monedas'!A:B,2,0),\"\")","v":"Guaraní"},2000000000,"Codeudora",null,"2021-03-23","PYG",{"$f":"IFERROR(VLOOKUP(I15,'[1]Base de Monedas'!A:B,2,0),\"\")","v":"Guaraní"},{"$f":"500000000+1000000000","v":1500000000},"Codeudora"]
["          PRESTAMO BCO. ATLAS S.A.","2021-07-15","PYG",{"$f":"IFERROR(VLOOKUP(C16,'[1]Base de Monedas'!A:B,2,0),\"\")","v":"Guaraní"},2001000000,"Codeudora",null,null,"PYG",{"$f":"IFERROR(VLOOKUP(I16,'[1]Base de Monedas'!A:B,2,0),\"\")","v":"Guaraní"}]
["          PRESTAMO BANCO  FAMILIAR GS.","2022-03-13","PYG",{"$f":"IFERROR(VLOOKUP(C17,'[1]Base de Monedas'!A:B,2,0),\"\")","v":"Guaraní"},2010410068,"Solidaria ",null,"2021-03-05","PYG",{"$f":"IFERROR(VLOOKUP(I17,'[1]Base de Monedas'!A:B,2,0),\"\")","v":"Guaraní"},2000000000,"Solidaria "]
["          PRESTAMO FIC S.A. DE FINANZAS","2021-09-16","PYG",{"$f":"IFERROR(VLOOKUP(C18,'[1]Base de Monedas'!A:B,2,0),\"\")","v":"Guaraní"},{"$f":"146033721+42128307","v":188162028},"Codeudora",null,"2021-01-04","PYG",{"$f":"IFERROR(VLOOKUP(I18,'[1]Base de Monedas'!A:B,2,0),\"\")","v":"Guaraní"},{"$f":"605137256+2218178776","v":2823316032},"Codeudora"]
["          PRESTAMO FINANCIERA PYO-JAPONESA S.A.","2022-04-05","PYG",{"$f":"IFERROR(VLOOKUP(C19,'[1]Base de Monedas'!A:B,2,0),\"\")","v":"Guaraní"},{"$f":"550000000+1500000000","v":2050000000},"Codeudora",null,"2021-03-23","PYG",{"$f":"IFERROR(VLOOKUP(I19,'[1]Base de Monedas'!A:B,2,0),\"\")","v":"Guaraní"},1801100000,"Codeudora"]
["          PRESTAMO BCO. CONTINENTAL GS.","2021-08-23","PYG",{"$f":"IFERROR(VLOOKUP(C20,'[1]Base de Monedas'!A:B,2,0),\"\")","v":"Guaraní"},750000000,"Codeudora"]
["          PRESTAMO BCO. BBVA","2021-06-22","PYG",{"$f":"IFERROR(VLOOKUP(C21,'[1]Base de Monedas'!A:B,2,0),\"\")","v":"Guaraní"},0,"Solidaria ",null,"2020-09-21","PYG",{"$f":"IFERROR(VLOOKUP(I21,'[1]Base de Monedas'!A:B,2,0),\"\")","v":"Guaraní"},3000000000,"Solidaria "]
["          PRESTAMO BCO. VISION S.A.E.C.A. GS.","2022-06-09","PYG",{"$f":"IFERROR(VLOOKUP(C22,'[1]Base de Monedas'!A:B,2,0),\"\")","v":"Guaraní"},1515228362,"Solidaria ",null,"2021-01-01","PYG",{"$f":"IFERROR(VLOOKUP(I22,'[1]Base de Monedas'!A:B,2,0),\"\")","v":"Guaraní"},1466814711,"Codeudora"]
["          PRESTAMOS CAJA MUTUAL DE COOP. DEL PY","2021-07-09","PYG",{"$f":"IFERROR(VLOOKUP(C23,'[1]Base de Monedas'!A:B,2,0),\"\")","v":"Guaraní"},500000000,"Codeudora"]
["          PRESTAMO DE TERCEROS","2021-04-24","PYG",{"$f":"IFERROR(VLOOKUP(C24,'[1]Base de Monedas'!A:B,2,0),\"\")","v":"Guaraní"},{"$f":"+'[1]2020-2021'!D138","v":500000000},"Solidaria "]
["          PRESTAMO BANCO INTERFISA","2022-04-12","PYG",{"$f":"IFERROR(VLOOKUP(C25,'[1]Base de Monedas'!A:B,2,0),\"\")","v":"Guaraní"},1000000000,"Solidaria ",null,null,null,{"$f":"IFERROR(VLOOKUP(I25,'[1]Base de Monedas'!A:B,2,0),\"\")","v":""},1000000000,"Solidaria "]
["          PRESTAMO BANCO ITAÚ","2022-04-01","PYG",{"$f":"IFERROR(VLOOKUP(C26,'[1]Base de Monedas'!A:B,2,0),\"\")","v":"Guaraní"},{"$f":"907172110+1034849776+1030909683+1800000000","v":4772931569},"Codeudora",null,"2020-06-12","PYG",{"$f":"IFERROR(VLOOKUP(I26,'[1]Base de Monedas'!A:B,2,0),\"\")","v":"Guaraní"},2600000000,"Codeudora"]
["          PRESTAMO GNB PARAGUAY SA GS",null,"PYG",{"$f":"IFERROR(VLOOKUP(C27,'[1]Base de Monedas'!A:B,2,0),\"\")","v":"Guaraní"},null,null,null,"2020-08-01","PYG",{"$f":"IFERROR(VLOOKUP(I27,'[1]Base de Monedas'!A:B,2,0),\"\")","v":"Guaraní"},900000000,"Codeudora"]
["          PRESTAMO FINANCIERA EL COMERCIO","2021-06-17","PYG",{"$f":"IFERROR(VLOOKUP(C28,'[1]Base de Monedas'!A:B,2,0),\"\")","v":"Guaraní"},0,"Codeudora",null,null,"PYG",{"$f":"IFERROR(VLOOKUP(I28,'[1]Base de Monedas'!A:B,2,0),\"\")","v":"Guaraní"},1010360784,"Solidaria "]
["(incluir otras entidades)"]
["Deudas bursátiles",null,null,{"$f":"IFERROR(VLOOKUP(C30,'[1]Base de Monedas'!A:B,2,0),\"\")","v":""},null,null,null,null,null,{"$f":"IFERROR(VLOOKUP(I30,'[1]Base de Monedas'!A:B,2,0),\"\")","v":""}]
["(Incluir programas de forma individual)",null,null,{"$f":"IFERROR(VLOOKUP(C31,'[1]Base de Monedas'!A:B,2,0),\"\")","v":""},null,null,null,null,null,{"$f":"IFERROR(VLOOKUP(I31,'[1]Base de Monedas'!A:B,2,0),\"\")","v":""}]
["Préstamos de Entidades en el Exterior",null,null,{"$f":"IFERROR(VLOOKUP(C32,'[1]Base de Monedas'!A:B,2,0),\"\")","v":""},null,null,null,null,null,{"$f":"IFERROR(VLOOKUP(I32,'[1]Base de Monedas'!A:B,2,0),\"\")","v":""}]
["Nombre de la entidad financiera",null,null,{"$f":"IFERROR(VLOOKUP(C33,'[1]Base de Monedas'!A:B,2,0),\"\")","v":""},null,null,null,null,null,{"$f":"IFERROR(VLOOKUP(I33,'[1]Base de Monedas'!A:B,2,0),\"\")","v":""}]
["Nombre de la entidad financiera",null,null,{"$f":"IFERROR(VLOOKUP(C34,'[1]Base de Monedas'!A:B,2,0),\"\")","v":""},null,null,null,null,null,{"$f":"IFERROR(VLOOKUP(I34,'[1]Base de Monedas'!A:B,2,0),\"\")","v":""}]
["(incluir otras entidades)",null,null,{"$f":"IFERROR(VLOOKUP(C35,'[1]Base de Monedas'!A:B,2,0),\"\")","v":""},null,null,null,null,null,{"$f":"IFERROR(VLOOKUP(I35,'[1]Base de Monedas'!A:B,2,0),\"\")","v":""}]
["Deudas bursátiles",null,null,{"$f":"IFERROR(VLOOKUP(C36,'[1]Base de Monedas'!A:B,2,0),\"\")","v":""},null,null,null,null,null,{"$f":"IFERROR(VLOOKUP(I36,'[1]Base de Monedas'!A:B,2,0),\"\")","v":""}]
["(Incluir programas de forma individual)",null,null,{"$f":"IFERROR(VLOOKUP(C37,'[1]Base de Monedas'!A:B,2,0),\"\")","v":""},null,null,null,null,null,{"$f":"IFERROR(VLOOKUP(I37,'[1]Base de Monedas'!A:B,2,0),\"\")","v":""}]
["Intereses préstamos entidades financieras a pagar",null,null,{"$f":"IFERROR(VLOOKUP(C38,'[1]Base de Monedas'!A:B,2,0),\"\")","v":""},null,null,null,null,null,{"$f":"IFERROR(VLOOKUP(I38,'[1]Base de Monedas'!A:B,2,0),\"\")","v":""}]
["Intereses a pagar",null,"PYG","Guaraní",1032678987,"Codeudora",null,null,"PYG",{"$f":"IFERROR(VLOOKUP(I39,'[1]Base de Monedas'!A:B,2,0),\"\")","v":"Guaraní"},1172639616,"Codeudora"]
["(-) Intereses a Devengar",null,"PYG",{"$f":"IFERROR(VLOOKUP(C40,'[1]Base de Monedas'!A:B,2,0),\"\")","v":"Guaraní"},{"$f":"+'[1]2020-2021'!D143","v":-1030107287},"Codeudora",null,null,"PYG",{"$f":"IFERROR(VLOOKUP(I40,'[1]Base de Monedas'!A:B,2,0),\"\")","v":"Guaraní"},{"$f":"-1245729786+13333370","v":-1232396416},"Codeudora"]
["Intereses deudas bursátiles a pagar",null,null,{"$f":"IFERROR(VLOOKUP(C41,'[1]Base de Monedas'!A:B,2,0),\"\")","v":""}]
["Intereses a pagar",null,null,{"$f":"IFERROR(VLOOKUP(C42,'[1]Base de Monedas'!A:B,2,0),\"\")","v":""},3914495896]
["(-) Intereses a Devengar",null,null,{"$f":"IFERROR(VLOOKUP(C43,'[1]Base de Monedas'!A:B,2,0),\"\")","v":""},-3925250003.9856205]
["Total",null,null,{"$f":"IFERROR(VLOOKUP(C44,'[1]Base de Monedas'!A:B,2,0),\"\")","v":""},{"$f":"SUM($E$12:E43)","v":22121549619.014381},null,null,null,null,null,{"$f":"SUM(K12:K43)","v":22041834727}]
[]
[]
["No Corrientes"]
[null,null,null,2021,null,null,null,null,null,2020]
["Préstamos de Entidades Locales","Vencimiento","Símbolo de Moneda","Moneda","Importe (miles de Gs)","Tipo de garantía",null,"Vencimiento","Símbolo de Moneda","Moneda","Importe (miles de Gs)","Tipo de Garantía"]
["          PRESTAMO BCO. CONTINENTAL GS.",null,"PYG","Guaraní",null,"Codeudora",null,null,null,""]
["Nombre de la entidad financiera",null,null,{"$f":"IFERROR(VLOOKUP(C51,'[1]Base de Monedas'!A:B,2,0),\"\")","v":""},null,null,null,null,null,{"$f":"IFERROR(VLOOKUP(I51,'[1]Base de Monedas'!A:B,2,0),\"\")","v":""}]
["(incluir otras entidades)",null,null,{"$f":"IFERROR(VLOOKUP(C52,'[1]Base de Monedas'!A:B,2,0),\"\")","v":""},null,null,null,null,null,{"$f":"IFERROR(VLOOKUP(I52,'[1]Base de Monedas'!A:B,2,0),\"\")","v":""}]
["Deudas bursátiles",null,null,{"$f":"IFERROR(VLOOKUP(C53,'[1]Base de Monedas'!A:B,2,0),\"\")","v":""}]
["SERIE 1 (uno)"," 26/09/2022","PYG",{"$f":"IFERROR(VLOOKUP(C54,'[1]Base de Monedas'!A:B,2,0),\"\")","v":"Guaraní"},3000000000,null,null," 26/09/2022","PYG","Guaraní",3000000000]
["SERIE 2 (dos)","2023-03-22","PYG",{"$f":"IFERROR(VLOOKUP(C55,'[1]Base de Monedas'!A:B,2,0),\"\")","v":"Guaraní"},3000000000,null,null,"2023-03-22","PYG","Guaraní",3000000000]
["SERIE 3 (tres)","2023-06-21","PYG",{"$f":"IFERROR(VLOOKUP(C56,'[1]Base de Monedas'!A:B,2,0),\"\")","v":"Guaraní"},3000000000,null,null,"2023-06-21","PYG","Guaraní",3000000000]
["SERIE 4 (cuatro)","2023-09-20","PYG",{"$f":"IFERROR(VLOOKUP(C57,'[1]Base de Monedas'!A:B,2,0),\"\")","v":"Guaraní"},3000000000,null,null,"2023-09-20","PYG","Guaraní",3000000000]
["SERIE 5 (cinco)","2024-03-20","PYG",{"$f":"IFERROR(VLOOKUP(C58,'[1]Base de Monedas'!A:B,2,0),\"\")","v":"Guaraní"},3000000000,null,null,"2024-03-20","PYG","Guaraní",3000000000]
["SERIE 6 (seis)","2023-04-03","PYG",{"$f":"IFERROR(VLOOKUP(C59,'[1]Base de Monedas'!A:B,2,0),\"\")","v":"Guaraní"},1000000000,null,null,"2023-04-03","PYG",{"$f":"IFERROR(VLOOKUP(I59,'[1]Base de Monedas'!G:H,2,0),\"\")","v":""},1000000000]
["SERIE 7 (siete)","2023-10-02","PYG",{"$f":"IFERROR(VLOOKUP(C60,'[1]Base de Monedas'!A:B,2,0),\"\")","v":"Guaraní"},1000000000,null,null,"2023-10-02","PYG",{"$f":"IFERROR(VLOOKUP(I60,'[1]Base de Monedas'!G:H,2,0),\"\")","v":""},1000000000]
["SERIE 8 (ocho)","2024-04-02","PYG",{"$f":"IFERROR(VLOOKUP(C61,'[1]Base de Monedas'!A:B,2,0),\"\")","v":"Guaraní"},1500000000,null,null,"2024-04-02","PYG",{"$f":"IFERROR(VLOOKUP(I61,'[1]Base de Monedas'!G:H,2,0),\"\")","v":""},1500000000]
["SERIE 9 (nueve)","2024-10-01","PYG",{"$f":"IFERROR(VLOOKUP(C62,'[1]Base de Monedas'!A:B,2,0),\"\")","v":"Guaraní"},1500000000,null,null,"2024-10-01","PYG",{"$f":"IFERROR(VLOOKUP(I62,'[1]Base de Monedas'!G:H,2,0),\"\")","v":""},1500000000]
["SERIE 10 (diez)","2025-03-31","PYG",{"$f":"IFERROR(VLOOKUP(C63,'[1]Base de Monedas'!A:B,2,0),\"\")","v":"Guaraní"},3000000000,null,null,"2025-03-31","PYG",{"$f":"IFERROR(VLOOKUP(I63,'[1]Base de Monedas'!G:H,2,0),\"\")","v":""},3000000000]
["SERIE 11 (once)","2024-07-25","PYG",{"$f":"IFERROR(VLOOKUP(C64,'[1]Base de Monedas'!A:B,2,0),\"\")","v":"Guaraní"},4000000000,null,null,"2024-07-25","PYG",{"$f":"IFERROR(VLOOKUP(I64,'[1]Base de Monedas'!G:H,2,0),\"\")","v":""},4000000000]
["SERIE 12 (doce)","2025-05-22","PYG",{"$f":"IFERROR(VLOOKUP(C65,'[1]Base de Monedas'!A:B,2,0),\"\")","v":"Guaraní"},3000000000,null,null,"2025-05-22","PYG",{"$f":"IFERROR(VLOOKUP(I65,'[1]Base de Monedas'!G:H,2,0),\"\")","v":""},3000000000]
["Préstamos de Entidades en el Exterior",null,null,{"$f":"IFERROR(VLOOKUP(C66,'[1]Base de Monedas'!A:B,2,0),\"\")","v":""},null,null,null,null,null,{"$f":"IFERROR(VLOOKUP(I66,'[1]Base de Monedas'!A:B,2,0),\"\")","v":""}]
["Nombre de la entidad financiera",null,null,{"$f":"IFERROR(VLOOKUP(C67,'[1]Base de Monedas'!A:B,2,0),\"\")","v":""},null,null,null,null,null,{"$f":"IFERROR(VLOOKUP(I67,'[1]Base de Monedas'!A:B,2,0),\"\")","v":""}]
["Nombre de la entidad financiera",null,null,{"$f":"IFERROR(VLOOKUP(C68,'[1]Base de Monedas'!A:B,2,0),\"\")","v":""},null,null,null,null,null,{"$f":"IFERROR(VLOOKUP(I68,'[1]Base de Monedas'!A:B,2,0),\"\")","v":""}]
["(incluir otras entidades)",null,null,{"$f":"IFERROR(VLOOKUP(C69,'[1]Base de Monedas'!A:B,2,0),\"\")","v":""},null,null,null,null,null,{"$f":"IFERROR(VLOOKUP(I69,'[1]Base de Monedas'!A:B,2,0),\"\")","v":""}]
["Deudas bursátiles",null,null,{"$f":"IFERROR(VLOOKUP(C70,'[1]Base de Monedas'!A:B,2,0),\"\")","v":""},null,null,null,null,null,{"$f":"IFERROR(VLOOKUP(I70,'[1]Base de Monedas'!A:B,2,0),\"\")","v":""}]
["(Incluir programas de forma individual)",null,null,{"$f":"IFERROR(VLOOKUP(C71,'[1]Base de Monedas'!A:B,2,0),\"\")","v":""},null,null,null,null,null,{"$f":"IFERROR(VLOOKUP(I71,'[1]Base de Monedas'!A:B,2,0),\"\")","v":""}]
["Intereses préstamos entidades financieras a pagar",null,null,{"$f":"IFERROR(VLOOKUP(C72,'[1]Base de Monedas'!A:B,2,0),\"\")","v":""},null,null,null,null,null,{"$f":"IFERROR(VLOOKUP(I72,'[1]Base de Monedas'!A:B,2,0),\"\")","v":""}]
["Intereses a pagar",null,"PYG",{"$f":"IFERROR(VLOOKUP(C73,'[1]Base de Monedas'!A:B,2,0),\"\")","v":"Guaraní"},0,"Codeudora",null,null,null,{"$f":"IFERROR(VLOOKUP(I73,'[1]Base de Monedas'!A:B,2,0),\"\")","v":""}]
["(-) Intereses a Devengar",null,"PYG",{"$f":"IFERROR(VLOOKUP(C74,'[1]Base de Monedas'!A:B,2,0),\"\")","v":"Guaraní"},0,"Codeudora"]
["Intereses deudas bursátiles a pagar",null,null,{"$f":"IFERROR(VLOOKUP(C75,'[1]Base de Monedas'!A:B,2,0),\"\")","v":""},null,null,null,null,null,{"$f":"IFERROR(VLOOKUP(I75,'[1]Base de Monedas'!A:B,2,0),\"\")","v":""}]
["Intereses  DE BONOS a pagar",null,"PYG",{"$f":"IFERROR(VLOOKUP(C76,'[1]Base de Monedas'!A:B,2,0),\"\")","v":"Guaraní"},6397359595,null,null,null,"PYG","Guarani",14477806866]
["(-) Intereses a Devengar",null,"PYG",{"$f":"IFERROR(VLOOKUP(C77,'[1]Base de Monedas'!A:B,2,0),\"\")","v":"Guaraní"},-6265268500.0539751,null,null,null,"PYG","Guarani",-14115768508]
["Total",null,null,{"$f":"IFERROR(VLOOKUP(C78,'[1]Base de Monedas'!A:B,2,0),\"\")","v":""},{"$f":"SUM($E$50:E77)","v":30132091094.946026},null,null,null,null,{"$f":"IFERROR(VLOOKUP(I78,'[1]Base de Monedas'!A:B,2,0),\"\")","v":""},{"$f":"SUM(K50:K77)","v":30362038358}]
[null,null,null,null,null,null,null,null,null,""]

{"sheet":"Nota 15","index":19,"n_rows":15,"n_cols":4,"rows_kept":15,"cut":false,"hidden":false,"merged":[[6,1,6,2]]}
[{"$f":"Indice!C1","v":"BIOTEC DEL PARAGUAY S.A."},null,null,"BG"]
[]
[]
[]
["NOTA 15 – PORCION CORRIENTE DE LA DEUDA A LARGO PLAZO"]
[]
[null,"En miles de guaranies"]
["Porción corriente de la deuda a largo plazo",2021,2020]
["Cuentas por pagar comerciales",0,0]
["Préstamos bancarios",0,0]
["Bonos bursátiles",0,0]
["Intereses bancarios a pagar",0,0]
["Bonos Emitidos a Pagar LP",0,0]
[null,0,0]
["Total general",0,0]

{"sheet":"Nota 16","index":20,"n_rows":12,"n_cols":6,"rows_kept":12,"cut":false,"hidden":false,"merged":[[5,1,5,2]]}
[{"$f":"Indice!C1","v":"BIOTEC DEL PARAGUAY S.A."},null,null,null,null,"BG"]
[]
[]
["NOTA 16 – REMUNERACIONES Y CARGAS SOCIALES A PAGAR"]
[]
[null,"En miles de guaranies"]
["Remuneraciones y cargas sociales a pagar",2021,2020]
["Sueldo y otras remuneraciones a pagar",0,0]
["Aportes y retenciones a pagar",166556866,45089432]
["Remuneraciones al personal superior a pagar",0,0]
["(Indicar otras cuentas)"]
["Total",166556866,45089432]

{"sheet":"Nota 17","index":21,"n_rows":13,"n_cols":7,"rows_kept":13,"cut":false,"hidden":false,"merged":[[6,1,6,2]]}
[{"$f":"Indice!C1","v":"BIOTEC DEL PARAGUAY S.A."},null,null,null,null,null,"BG"]
[]
[]
[]
["NOTA 17 –  IMPUESTOS A PAGAR"]
[]
[null,"En miles de guaranies"]
["Impuestos a pagar",2021,2020]
["Impuesto a la renta a pagar",0,223191228]
["Otros impuestos a pagar",0,22500000]
["Retención de Renta / Iva p/ Flete",0,758813]
["Retención de Impuesto a Igresar",31091641,21758093]
["Total",31091641,268208134]

{"sheet":"Nota 18","index":22,"n_rows":13,"n_cols":4,"rows_kept":13,"cut":false,"hidden":false,"merged":[[3,0,3,3],[6,0,7,0],[5,1,5,2]]}
[{"$f":"Indice!C1","v":"BIOTEC DEL PARAGUAY S.A."},null,null,"BG"]
[]
[]
["NOTA 18 -  PROVISIONES"]
[]
[null,"En miles de guaranies"]
["Provisiones",2021,2020]
[]
["Alquileres a Pagar",0,0]
["Dividendos a Pagar",9687129447,16896978364]
["Honorarios Profesionales a Pagar",0,0]
["Otras Cuentas a Pagar",359000,0]
["Total",9687488447,16896978364]

{"sheet":"Nota 19","index":23,"n_rows":20,"n_cols":7,"rows_kept":20,"cut":false,"hidden":false,"merged":[[3,0,3,1]]}
[{"$f":"Indice!C1","v":"BIOTEC DEL PARAGUAY S.A."},null,null,"BG"]
[]
["NOTA 19 – OTROS PASIVOS CORRIENTES y NO CORRIENTES"]
["En miles de guaranies"]
[]
["Corrientes",2021,2020,null,"No Corrientes",2021,2020]
["Retencion de IVA a pagar",0,0,null,"Retencion de IVA a pagar",0,0]
["Retencion Impuesto a la renta a Pagar",0,0,null,"Retencion Impuesto a la renta a Pagar",0,0]
["Impuestos diferidos",0,0,null,"Impuestos diferidos",0,0]
["Otros ingresos diferidos (detallar cuenta)",0,0,null,"Otros ingresos diferidos",0,0]
["Otros Pasivos con Entidades relacionadas ",0,0,null,"Otros Pasivos con Entidades relacionadas ",0,0]
["Previsiones para contingencias/Indemnizaciones y despidos",0,0,null,"Previsiones para contingencias/Indemnizaciones y despidos",0,0]
["Prestamos de Socios GS",1400000000,0,null,"Prestamos de Socios GS",0,0]
["Prestamos de Socios M/E",664237597,629407158,null,"Prestamos de Socios M/E",0,0]
["Anticipos de Cliente",20686487,45515090,null,"Anticipos de Cliente",0,0]
["Sueldos y Jornales a Pagar",0,0]
["Aguinaldo a Pagar",302636800,196468237]
["Intereses s/ Bonos a Pagar",0,0,null,"Intereses s/ Bonos a Pagar",0,0]
["Acreedores Varios",396430155,0,null,"(nuevas cuentas a incluir)"]
["Total ",2783991039,871390485,null,"Total ",0,0]

{"sheet":"Nota 20","index":24,"n_rows":11,"n_cols":4,"rows_kept":11,"cut":false,"hidden":false,"merged":[[3,0,3,3]]}
[{"$f":"Indice!C1","v":"BIOTEC DEL PARAGUAY S.A."},null,null,"BG"]
[]
[]
["NOTA 20 – CAPITAL INTEGRADO"]
[]
["Fecha",2021,2020]
["Monto Capital Social",0,0]
["Monto Capital Integrado",15000000000,12000000000]
["Cantidad de Acciones",15000,12000]
["Valor Nominal de Acciones",1000000,1000000]
["Total",15000000000,12000000000]

{"sheet":" Nota 21","index":25,"n_rows":29,"n_cols":6,"rows_kept":29,"cut":false,"hidden":false,"merged":[[3,0,3,5],[5,1,5,2]]}
[{"$f":"Indice!C1","v":"BIOTEC DEL PARAGUAY S.A."},null,null,null,null,"BG"]
[]
[]
["NOTA 21 – RESERVAS"]
[]
[null,"En miles de guaranies"]
[null,2021,2020]
["a  Reserva de revalúo",{"$f":"+B9+B10","v":2195468553},{"$f":"+'[1]2020-2021'!E165","v":770442553}]
["a.1. Reserva de revalúo",{"$f":"+'[1]2020-2021'!D165","v":770442553},{"$f":"+'[1]2020-2021'!E165","v":770442553}]
["a.2. Reserva de revalúo técnico",{"$f":"+'[1]2020-2021'!D166","v":1425026000},0]
[]
[]
[]
[]
[]
[]
[]
[]
["b Reserva legal",2336722151,1618994215]
[]
[]
[]
[]
["c Reservas estatutarias",{"$f":"+SUM($B28:B$29)","v":0},{"$f":"+SUM($B28:C$29)","v":0}]
[]
[]
[]
["d Reservas facultativas",0,0]
["d.1. (nuevas cuentas a incluir)"]

{"sheet":"Nota 22","index":26,"n_rows":9,"n_cols":6,"rows_kept":9,"cut":false,"hidden":false,"merged":[[5,1,5,2]]}
[{"$f":"Indice!C1","v":"BIOTEC DEL PARAGUAY S.A."},null,null,null,null,"BG"]
[]
[]
["NOTA 21 –  DIFERENCIA TRANSITORIA POR CONVERSION"]
[]
[null,"En miles de guaranies"]
[null,2021,2020]
["Diferencia transitoria por conversión","N/A","N/A"]
["Total",0,0]

{"sheet":"Nota 23","index":27,"n_rows":10,"n_cols":6,"rows_kept":10,"cut":false,"hidden":false,"merged":[[5,1,5,2]]}
[{"$f":"Indice!C1","v":"BIOTEC DEL PARAGUAY S.A."},null,null,null,null,"BG"]
[]
[]
["NOTA 23 –  RESULTADOS ACUMULADOS"]
[]
[null,"En miles de guaranies"]
[null,2021,2020]
["Resultado de ejercicios anteriores",8236971613,0]
["Resultado del ejercicio actual",10636830780,-1786188882]
["Totales",18873802393,-1786188882]

{"sheet":"Nota 24","index":28,"n_rows":9,"n_cols":6,"rows_kept":9,"cut":false,"hidden":false,"merged":[[5,1,5,2]]}
[{"$f":"Indice!C1","v":"BIOTEC DEL PARAGUAY S.A."},null,null,null,null,"BG"]
[]
[]
["NOTA 24 –  INTERES MINORITARIO"]
[]
[null,"En miles de guaranies"]
[null,2021,2020]
["Interes Minoritario","N/A","N/A"]
["Total",0,0]

{"sheet":"Nota 25","index":29,"n_rows":26,"n_cols":5,"rows_kept":26,"cut":false,"hidden":false,"merged":[[7,1,7,2]]}
[{"$f":"Indice!C1","v":"BIOTEC DEL PARAGUAY S.A."},null,null,null,"ER"]
[]
[]
[]
["NOTA 25 –  VENTAS"]
[]
[]
[null,"En miles de guaranies"]
[null,2021,2020]
["Ventas"]
["Ventas linea de negocio 1"]
["Ventas del Sector Publico",20845408485,13742810113]
["Venas del Sector Privado",33210625160,6838490120]
["Ingresos Extraordinarios",0,0]
["Exterior",0,0]
["Contado",0,0]
["Crédito",0,0]
["Ventas linea de negocio 2"]
["Local",0,0]
["Contado",0,0]
["Crédito",0,0]
["Exterior",0,0]
["Contado",0,0]
["Crédito",0,0]
["(nuevas lineas de negocio a incluir)"]
["Total",54056033645,20581300233]

{"sheet":"Nota 26","index":30,"n_rows":22,"n_cols":5,"rows_kept":22,"cut":false,"hidden":false,"merged":[[4,0,4,5],[6,1,6,2],[7,1,7,2]]}
[{"$f":"Indice!C1","v":"BIOTEC DEL PARAGUAY S.A."},null,null,null,"ER"]
[]
[]
[]
["NOTA 26 - COSTO DE VENTAS"]
[]
[]
[null,"Miles de guaraníes"]
["Costo de ventas",2021,2020]
["Linea de negocio 1"]
["Existencia inicial del inventario",24050116279,14589293931]
["+ Compra de bienes y servicios",17562780426,9460822348]
["+ Costo de producción",29101607167,11041326511]
["- Existencia final de inventario",-41612896705,-24050116279]
["Otros Ingresos Extraordinario",0,0]
["Linea de negocio 2"]
["Existencia inicial del inventario",0,0]
["+ Compra de bienes y servicios",0,0]
["+ Costo de producción",0,0]
["- Existencia final de inventario",0,0]
["(nuevas cuentas a incluir) "]
["Total costo de ventas",29101607167,11041326511]

{"sheet":"Nota 27","index":31,"n_rows":42,"n_cols":7,"rows_kept":42,"cut":false,"hidden":false,"merged":[[9,0,10,0]]}
[{"$f":"Indice!C1","v":"BIOTEC DEL PARAGUAY S.A."},null,null,null,null,null,"ER"]
[]
[]
[]
["NOTA 27 - GASTOS"]
[]
["El rubro está compuesto de la siguiente forma: "]
[]
["Miles de guaraníes"]
[null,null,2021,null,null,2020]
[null,"Gastos de Ventas","Gastos Administrativos","Total","Gastos de Ventas","Gastos Administrativos","Total"]
["Movilidad y viáticos",47605850,10600975,58206825,48785655,5198979,53984634]
["Gastos de alquiler",0,229727269,229727269,0,214729168,214729168]
["Computación y redes",218637,722727,941364,0,327727,327727]
["Gastos por servicios",185979474,88842263,274821737,185898156,86608726,272506882]
["Honorarios profesionales y asesoramiento",312282378,279959764,592242142,267127360,236625066,503752426]
["Investigación de mercado",0,0,0,0,0,0]
["Impuestos y tasas",3138764,0,3138764,3075213,0,3075213]
["Gastos de reparación y mantenimiento",104408546,8179090,112587636,51227677,14942452,66170129]
["Gastos del personal y capacitación",909091,0,909091,0,0,0]
["Seguros pagados",118886009,9656339,128542348,107440632,9683161,117123793]
["Otros gastos de operación",4999757079,264244462,5264001541,715493222,160238552,875731774]
["Remuneraciones de administradores, directores, síndicos y consejo de vigilancia",0,975000000,975000000,0,812500000,812500000]
["Sueldos y Jornales",1751681126,388576427,2140257553,1350355791,305459079,1655814870]
["Indemnizacion",49000000,56833620,105833620,10833333,0,10833333]
["Preaviso",54992720,0,54992720,16250000,0,16250000]
["Aporte Patronal",283340970,286076206,569417176,180776556,122380519,303157075]
["Aporte Ley 2051/03 Art 41 -DNCP",51821111,0,51821111,38753773,0,38753773]
["Comisiones Pagadas",1313492724,0,1313492724,1265344165,0,1265344165]
["Aguinaldos",240600318,32381367,272981685,127524351,25488620,153012971]
["Contribuciones Sociales",300000,0,300000,300000,0,300000]
["Regalías y Honorarios por servicios técnicos",0,0,0,0,0,0]
["Gastos de Publicidad y Propaganda",5533927,0,5533927,17061367,7918182,24979549]
["Intereses, multas y recargos impositivos",0,0,0,0,0,0]
["Multas por Incumplimiento - Licitacion",8488679,0,8488679,2762889,0,2762889]
["Depreciación bienes de uso",0,1746089574,1746089574,0,1542363641,1542363641]
["Amortización activos intangibles",0,35361618,35361618,0,17201643,17201643]
["Combutible y Lubricantes",171751814,16246831,187998645,135476651,6747189,142223840]
["Patente e Impuestos",31305238,0,31305238,41741630,0,41741630]
["Previsiones",0,0,0,0,0,0]
["(nuevas cuentas a incluir)",null,null,0,null,null,0]
["Total",9735494455,4428498532,14163992987,4566228421,3568412704,8134641125]

{"sheet":"Nota 28","index":32,"n_rows":17,"n_cols":7,"rows_kept":17,"cut":false,"hidden":false,"merged":[[3,0,3,4],[5,1,5,2]]}
[{"$f":"Indice!C1","v":"BIOTEC DEL PARAGUAY S.A."},null,null,null,"ER"]
[]
[]
["Nota 28 - Otros Ingresos y gastos operativos"]
[]
["Miles de guaraníes"]
[]
["Otros ingresos",2021,2020,null,"Otros gastos",2021,2020]
["          OTROS INGRESOS",49191323,5797313,null,"PERDIDA POR DIFERENCIA DE CAMBIO",2511134979,592049960]
["          SOBRANTE EN CAJA",315101,24842,null,"PERDIDA POR MERCADERIAS VENCIDAS",716609819,883949156]
["          INTERESES COBRADOS",11021232,3588800,null,"DIFERENCIA O FALTANTE EN CAJA",-2198,2866]
["          UTILIDAD - DIFERENCIA DE CAMBIO",2331846936,526555764,null,"AJUSTE DE INVENTARIO",957,0]
["          INTERESES GANADOS",89662007,14880420,null,"COSTO DE ACTIVO FIJO",240000,0]
["          DESCUENTOS OBTENIDOS",45148121,17337750]
["          AJUSTE POR INVENTARIO",1231426792,0]
["          VENTA DE ACTIVO FIJO",441620,119927100]
["Total",3759053132,688111989,null,"Total",3227983557,1476001982]

{"sheet":"Nota 29","index":33,"n_rows":18,"n_cols":7,"rows_kept":18,"cut":false,"hidden":false,"merged":[]}
[{"$f":"Indice!C1","v":"BIOTEC DEL PARAGUAY S.A."},null,null,null,"ER"]
[]
[]
[]
["NOTA 29 - INGRESOS Y GASTOS FINANCIEROS NETOS"]
["Miles de guaraníes"]
[]
["Ingresos Financieros netos",{"$f":"IFERROR(IF(Indice!B6=\"\",\"2XX2\",YEAR(Indice!B6)),\"2XX2\")","v":2021},2020,null,"Gastos Financieros netos",{"$f":"IFERROR(IF(Indice!B6=\"\",\"2XX2\",YEAR(Indice!B6)),\"2XX2\")","v":2021},2020]
["          OTROS INGRESOS",0,0,null,"PERDIDA POR DIFERENCIA DE CAMBIO",0,0]
["          SOBRANTE EN CAJA",0,0,null,"PERDIDA POR MERCADERIAS VENCIDAS",0,0]
["          INTERESES COBRADOS",0,0]
["          UTILIDAD - DIFERENCIA DE CAMBIO",0,0,null,"DIFERENCIA O FALTANTE EN CAJA",0,0]
["          INTERESES GANADOS",0,0,null,"AJUSTE DE INVENTARIO",0,0]
["          DESCUENTOS OBTENIDOS",0,0,null,"Intereses a bancos e instituciones financieras",3084531453,2403631486]
["          AJUSTE POR INVENTARIO",0,0]
["          VENTA DE ACTIVO FIJO",0,0]
[]
["Total ingresos financieros",0,0,null,"Total gastos financieros",3084531453,2403631486]

{"sheet":"Nota 30","index":34,"n_rows":10,"n_cols":5,"rows_kept":10,"cut":false,"hidden":false,"merged":[[5,1,5,2]]}
[{"$f":"Indice!C1","v":"BIOTEC DEL PARAGUAY S.A."},null,null,null,"ER"]
[]
[]
["Nota 30 - Resultado de inversiones en asociadas"]
["Miles de guaraníes"]
[]
[]
["Resultado de inversiones en asociadas",2021,2020]
["(Detallar cuenta)","N/A","N/A"]
["Total"]

{"sheet":"Nota 31","index":35,"n_rows":10,"n_cols":5,"rows_kept":10,"cut":false,"hidden":false,"merged":[[4,0,4,1],[5,1,5,2]]}
[{"$f":"Indice!C1","v":"BIOTEC DEL PARAGUAY S.A."},null,null,null,"ER"]
[]
[]
["Nota 31 - Resultado participación minoritaria"]
["Miles de guaraníes"]
[]
[]
["Resultado participación minoritaria",2021,2020]
["(Detallar cuenta)","N/A","N/A"]
["Total",0,0]

{"sheet":"Nota 32","index":36,"n_rows":14,"n_cols":5,"rows_kept":14,"cut":false,"hidden":false,"merged":[[5,1,5,2]]}
[{"$f":"Indice!C1","v":"BIOTEC DEL PARAGUAY S.A."},null,null,null,"ER"]
[]
[]
["Nota 32 - IMPUESTO A LA RENTA"]
["En miles de guaraníes"]
[]
[null,2021,2020]
["Impuesto a la renta",0,0]
[]
[]
[]
[]
[]
["Total",{"$f":"SUM($B8:B13)","v":0},{"$f":"SUM($C8:C13)","v":0}]

{"sheet":"Nota 33","index":37,"n_rows":10,"n_cols":5,"rows_kept":10,"cut":false,"hidden":false,"merged":[[4,0,4,1]]}
[{"$f":"Indice!C1","v":"BIOTEC DEL PARAGUAY S.A."},null,null,null,"ER"]
[]
[]
["Nota 33 - Resultado extraordinario neto de impuesto a la renta"]
["En miles de guaraníes"]
[]
[null,2021,2020]
["Conceptos"]
["(Detallar)","N/A","N/A"]
["Total",0,0]

{"sheet":"Nota 34","index":38,"n_rows":12,"n_cols":5,"rows_kept":12,"cut":false,"hidden":false,"merged":[[4,0,4,1]]}
[{"$f":"Indice!C1","v":"BIOTEC DEL PARAGUAY S.A."},null,null,null,"ER"]
[]
[]
["Nota 34 - Resultado sobre actividades discontinuadas neto de impuesto a la renta"]
["En miles de guaraníes"]
[]
["Resultado sobre actividades discontinuadas neto de impuesto a la renta",2021,2020]
[]
["(nueva cuenta a incluir)","N/A","N/A"]
["Subtotal","N/A","N/A"]
["- Impuesto a la renta","N/A","N/A"]
["Total",0,0]

{"sheet":"Nota 35","index":39,"n_rows":10,"n_cols":5,"rows_kept":10,"cut":false,"hidden":false,"merged":[]}
[{"$f":"Indice!C1","v":"BIOTEC DEL PARAGUAY S.A."},null,null,null,"ER"]
[]
[]
["NOTA 35- UTILIDAD (PÉRDIDA) NETA DEL AÑO Y POR ACCION ORDINARIA"]
["La Sociedad calcula la utilidad neta por acción sobre la base de la utilidad del año y 12.000 acciones ordinarias de voto múltiple de valor nominal G 1.000.000.- cada una con derecho a 5 votos por acción."]
[]
[null,2021,2020]
["Cantidad de Acciones Ordinarias en Circulación",15000,12000]
["Utilidad Neta",8236971613,-1786188882]
["Utilidad Neta por Acción Ordinaria",549131.44086666661,-148849.0735]

{"sheet":"Nota 36","index":40,"n_rows":17,"n_cols":5,"rows_kept":17,"cut":false,"hidden":false,"merged":[[5,0,5,8],[3,0,3,4],[9,0,11,4],[16,0,18,4]]}
[{"$f":"Indice!C1","v":"BIOTEC DEL PARAGUAY S.A."},null,null,null,"Indice"]
[]
[]
["NOTA 36 - ACTIVOS GRAVADOS"]
[]
["Los siguientes bienes de propiedad de la Sociedad han sido hipotecados y prendados en garantía de obligaciones financieras."]
[]
[{"$f":"IFERROR(\"Al \"&DAY(Indice!B6)&\" de \"&VLOOKUP(MONTH(Indice!B6),Indice!S:T,2,0)&\" de \"&YEAR(Indice!B6-365),\"Al dia... de mes… de año 2XX1…\")","v":"Al 30 de Junio de 2020"}]
["Tipo de Activo","Datos  del activo gravado","Tipo de garantía","Importe (indicar   moneda)","A favor de"]
["NO APLICABLE"]
[]
[]
[]
[]
[{"$f":"IFERROR(\"Al \"&DAY(Indice!B6)&\" de \"&VLOOKUP(MONTH(Indice!B6),Indice!S:T,2,0)&\" de \"&YEAR(Indice!B6-1),\"Al dia... de mes… de año 2XX2…\")","v":"Al 30 de Junio de 2021"}]
["Tipo de Activo","Datos  del activo gravado","Tipo de garantía","Importe (indicar   moneda)","A favor de"]
["NO APLICABLE"]

{"sheet":"Nota 37","index":41,"n_rows":15,"n_cols":5,"rows_kept":15,"cut":false,"hidden":false,"merged":[[14,0,14,7],[4,0,4,8],[5,0,5,8],[10,0,11,7]]}
[{"$f":"Indice!C1","v":"BIOTEC DEL PARAGUAY S.A."},null,null,null,"Indice"]
[]
[]
["NOTA 37 - CONTINGENCIAS Y COMPROMISOS "]
["(Esta nota debería incluir un breve detalle de contratos con terceros, vigente a la fecha de cierre del ejercicio, cuyo incumplimiento o cláusula específica podrían generar obligaciones contingentes para el cliente). "]
[{"$f":"IFERROR(\"Los principales contratos suscriptos por la Sociedad, vigentes al  \"&DAY(Indice!B6)&\" de \"&VLOOKUP(MONTH(Indice!B6),Indice!S:T,2,0)&\" de \"&YEAR(Indice!B6-1)&\" son:\",\"Los principales contratos suscriptos por la Sociedad, vigentes al … de …  20X2 son:\")","v":"Los principales contratos suscriptos por la Sociedad, vigentes al  30 de Junio de 2021 son:"}]
["a) N/A"]
["b) N/A"]
[]
[]
[{"$f":"IFERROR(\"Al  \"&DAY(Indice!B6)&\" de \"&VLOOKUP(MONTH(Indice!B6),Indice!S:T,2,0)&\" de \"&YEAR(Indice!B6-1)&\" no existen situaciones contingentes, ni reclamos que pudieran resultar en la generación de obligaciones para la Sociedad adicionales a las que se presentan en estos estados financieros.\",\"Al … de …………... 20X2 no existen situaciones contingentes, ni reclamos que pudieran resultar en la generación de obligaciones para la Sociedad adicionales a las que se presentan en estos estados financieros.\")","v":"Al  30 de Junio de 2021 no existen situaciones contingentes, ni reclamos que pudieran resultar en la generación de obligaciones para la Sociedad adicionales a las que se presentan en estos estados financieros."}]
[]
[]
[]
["Obs.: Esta información debe estar ajustada  a lo requerido por la Norma de Información Financiera N° 5 Contingencias y sucesos que ocurren después de la fecha del balance. "]

{"sheet":"Nota 38","index":42,"n_rows":25,"n_cols":4,"rows_kept":25,"cut":false,"hidden":false,"merged":[[3,0,3,6],[5,0,5,6],[6,0,6,6],[8,0,8,6]]}
[{"$f":"Indice!C1","v":"BIOTEC DEL PARAGUAY S.A."},null,null,"Índice"]
[]
[]
["NOTA 38 - IMPUESTO DIFERIDO"]
["En miles de guaraníes"]
["Al … de …........... 20X2 la Sociedad constituyó una provisión para impuesto a la renta de Guaraníes  …... (Al … de …...............20X1:  Guaraníes  …....) / (La Sociedad no ha constituido provisión para impuesto a la renta, debido a que a esa fecha la misma generó renta imponible que fue compensada con quebrantos impositivos acumulados a esa fecha). "]
["La Sociedad contabiliza el impuesto a la renta por el método de lo diferido, método del pasivo. El mencionado método establece la determinación de activos o pasivos impositivos diferidos netos basados en las diferencias temporales y temporarias, con cargo a la línea Impuesto a la renta del Estado de resultados."]
[]
["El siguiente cuadro detalla las diferencias temporales a la tasa del impuesto a los efectos de determinación del impuesto diferido:"]
[]
[null,{"$f":"IFERROR(IF(Indice!B6=\"\",\"2XX2\",YEAR(Indice!B6)),\"2XX2\")","v":2021},{"$f":"+IFERROR(YEAR(Indice!B6-365),\"2XX1\")","v":2020}]
["Activos y pasivos impositivos diferidos: ","N/A","N/A"]
["Caja y Bancos","N/A","N/A"]
["Inversiones","N/A","N/A"]
["Previsión para deudores incobrables","N/A","N/A"]
["Bienes de uso","N/A","N/A"]
["Activos intangibles","N/A","N/A"]
["Previsión del pasivo","N/A","N/A"]
["Deudas comerciales y bancarias","N/A","N/A"]
["Bienes de cambio","N/A","N/A"]
["Sub - total  ","N/A","N/A"]
["Previsión para impuestos diferidos netos ","N/A","N/A"]
["Total activo/pasivo impositivo diferido neto antes de quebrantos","N/A","N/A"]
["Quebranto impositivo","N/A","N/A"]
["Total"]

{"sheet":"Nota 39","index":43,"n_rows":9,"n_cols":5,"rows_kept":9,"cut":false,"hidden":false,"merged":[[5,0,5,8],[8,0,8,8]]}
[{"$f":"Indice!C1","v":"BIOTEC DEL PARAGUAY S.A."},null,null,null,"Indice"]
[]
[]
[]
["NOTA 39 - HECHOS POSTERIORES"]
["(En caso en que entre la fecha del cierre del ejercicio y la fecha de emisión de los estados financieros existan hechos posteriores significativos deberá evaluarse el tipo de hecho posterior del que se trate y modificar esta nota según corresponda)."]
[]
[]
["Entre la fecha de cierre del ejercicio y la fecha de preparación de estos estados financieros, no han ocurrido hechos significativos de carácter financiero o de otra índole que afecten la situación patrimonial o financiera o los resultados de la Sociedad al 31 de Marzo 2021."]

{"sheet":"Nota 40","index":44,"n_rows":34,"n_cols":3,"rows_kept":34,"cut":false,"hidden":false,"merged":[[7,0,7,6],[23,0,23,5]]}
[{"$f":"Indice!C1","v":"BIOTEC DEL PARAGUAY S.A."},null,"Indice"]
[]
[]
[]
["NOTA 40 - SALDOS Y TRANSACCIONES CON PARTES RELACIONADAS"]
["Miles de guaraníes"]
[]
[]
[]
[null,{"$f":"IFERROR(IF(Indice!B6=\"\",\"2XX2\",YEAR(Indice!B6)),\"2XX2\")","v":2021},2020]
["ACTIVO","N/A","N/A"]
["Inversiones temporales","N/A","N/A"]
["Cuentas a cobrar comerciales","N/A","N/A"]
["Otros créditos","N/A","N/A"]
["Total activo","N/A","N/A"]
["PASIVO","N/A","N/A"]
["Cuentas por pagar comerciales","N/A","N/A"]
["Préstamos a corto plazo","N/A","N/A"]
["Provisiones","N/A","N/A"]
["Préstamos a largo plazo","N/A","N/A"]
["Otros pasivos","N/A","N/A"]
["Total pasivo","N/A","N/A"]
[]
[]
[]
[null,{"$f":"IFERROR(IF(Indice!B6=\"\",\"2XX2\",YEAR(Indice!B6)),\"2XX2\")","v":2021},2019]
["Costo de ventas","N/A","N/A"]
["Compras a ….","N/A","N/A"]
[]
["Gastos administrativos","N/A","N/A"]
["Honorarios por servicios","N/A","N/A"]
["Otros ","N/A","N/A"]
["Gastos financieros ","N/A","N/A"]
["Intereses pagados por préstamos","N/A","N/A"]