{"text_format":"1","workbook":"xlsx","n_sheets":34,"sheets":["Indice","Portada ","Firma del Auditor externo","BG","ER","EVPN","EFE","Nota1","Nota 2","Nota 3","Nota 4","Nota 5","Nota 6","Nota 7","Nota 8","Nota 9","Nota 10","Nota 11","Nota 12","Nota 13","Nota 14","Nota 15","Nota 16.1","Nota 16.2","Nota 17","Nota 18","Nota 19","Nota 20","Nota 21","Nota 22","Nota 23","Nota 24","Nota 25","Nota 26"],"not_rendered":{"charts":0,"images":1,"macros":1,"external_links":0,"defined_names":2,"comments":0,"pivot_tables":0},"unopened":[],"bounds":{"document_bytes":16777216,"sheet_cells":100000,"rows_first":2000,"rows_last":500,"rows_between":2000,"halvings":0,"cell_chars":16384,"cell_head_chars":4096},"cells_cut":0,"cells_raw":0,"read":"whole","date_system":"1900"}

{"sheet":"Indice","index":0,"n_rows":52,"n_cols":4,"rows_kept":52,"cut":false,"hidden":false,"merged":[]}
[null,"Sociedad:","CEMENTOS CONCEPCIÓN S.A.E."]
[]
[]
[]
[]
["Fecha Presentación:","2020-12-31"]
[]
[]
[null,null,"INDICE","REF."]
[null,null,"Portada","Portada "]
{"$rows_left_out":43}
{"sheet":"Portada ","index":1,"n_rows":69,"n_cols":8,"rows_kept":69,"cut":false,"hidden":false,"merged":[[6,1,11,6],[12,1,15,6],[16,1,21,6]]}
[]
[]
[null,"1.              IDENTIFICACIÓN"]
[]
[null,"1.1          NOMBRE O RAZÓN SOCIAL: Cementos Concepción Sociedad Anónima Emisora (CECON S.A.E.)"]
[]
[null,"1.2          ANTECEDENTES DE CONSTITUCIÓN SOCIAL Y REFORMAS ESTATUTARIAS: es una compañía por acciones legalmente constituida en fecha 17 de agosto de 2000, con el nombre de CALERA RISSO SOCIEDAD ANÓNIMA COMERCIAL, INMOBILIARIA E INDUSTRIAL - (CARISA S.A.C.I.I.), por escritura pública Nº 109, pasada ante la notaria y escribana pública Eustaquia Benitez de Carrillo (titular del registro Nro. 96), e inscripta en la Dirección General de los Registros Públicos, Registro de Personas Jurídicas y Asociaciones según A.I. Nro. 1916 bajo el Nro. 630, folio 6351, Serie B en fecha 22/09/2000 y en el Registro Público de Comercio según A.I. Nro. 1916 bajo el Nro. 805, folio 5794 y Sgtes., Serie B en fecha 22/09/2000, con un capital inicial de Gs. 9.000.000.000.-"]
[]
[]
[]
{"$rows_left_out":60}
{"sheet":"Firma del Auditor externo","index":2,"n_rows":10,"n_cols":3,"rows_kept":10,"cut":false,"hidden":false,"merged":[[9,2,10,9],[3,2,4,9],[6,2,6,9]]}
[]
[]
[]
[null,null,"INFORME DE AUDITORIA DE LOS ESTADOS FINANCIEROS POR EL EJERCICIO FINALIZADO EL 31 DE DICIEMBRE DEL 2020"]
[]
[]
[null,null,"Presentado en forma comparativa con el ejercicio anterior"]
[]
[]
[null,null,"La firma del Auditor Externo Independiente es a fines de identificación con Dictamen emitido en fecha 30 de abril del 2021"]
{"$rows_left_out":1}
{"sheet":"BG","index":3,"n_rows":51,"n_cols":7,"rows_kept":51,"cut":false,"hidden":false,"merged":[[28,2,28,3],[30,2,30,3],[31,2,31,3],[32,2,32,3],[45,2,45,3],[6,0,6,6],[8,0,8,6],[55,5,55,6],[46,2,46,3],[24,2,24,3],[23,2,23,3],[20,2,20,3],[21,2,21,3],[22,2,22,3],[29,2,29,3],[7,0,7,6],[42,2,42,3],[13,2,13,3],[14,2,14,3],[15,2,15,3],[17,2,17,3],[61,5,61,6],[62,1,62,3],[11,1,11,3],[26,1,26,3],[40,1,40,3],[39,1,39,3],[47,1,47,3],[60,5,60,6],[25,1,25,3],[48,1,48,3],[33,2,33,3],[36,2,36,3],[41,2,41,3],[44,2,44,3],[43,2,43,3],[56,5,56,6]]}
[null,null,null,{"$f":"Indice!C1","v":"CEMENTOS CONCEPCIÓN S.A.E."},"Indice"]
[]
[]
[]
[]
[]
["BALANCE GENERAL AL 31 DE DICIEMBRE DE 2020"]
["Comparativo con el ejercicio anterior"]
["(Expresado en guaraníes – Nota 2.a)"]
[]
{"$rows_left_out":42}
{"sheet":"ER","index":4,"n_rows":33,"n_cols":4,"rows_kept":33,"cut":false,"hidden":false,"merged":[[44,2,44,3],[6,0,6,3],[7,0,7,3],[8,0,8,3],[9,0,9,3],[38,2,38,3]]}
[{"$f":"Indice!C1","v":"CEMENTOS CONCEPCIÓN S.A.E."},"Indice",null,{"$f":"ER!A4","v":" "}]
[]
[]
[" "]
[]
[]
["ESTADO DE RESULTADOS POR EL EJERCICIO FINALIZADO EL 31 DE DICIEMBRE DE 2020"]
["Comparativo con el ejercicio anterior"]
[" (Expresado en guaraníes – Nota 2.a)"]
[]
{"$rows_left_out":24}
{"sheet":"EVPN","index":5,"n_rows":35,"n_cols":18,"rows_kept":35,"cut":false,"hidden":false,"merged":[[16,0,17,0],[15,2,15,5],[15,9,15,13],[16,2,17,2],[16,5,17,5],[16,7,17,7],[16,9,17,9],[16,11,17,11],[7,5,7,15],[8,5,8,15],[9,5,9,15],[16,15,17,15],[16,17,17,17],[16,13,17,13]]}
[{"$f":"Indice!C1","v":"CEMENTOS CONCEPCIÓN S.A.E."},null,null,null,null,null,null,"Indice"]
[]
[]
[]
[]
[]
[]
[null,null,null,null,null,"ESTADO DE EVOLUCIÓN DEL PATRIMONIO NETO POR EL EJERCIO FINALIZADO EL 31 DE DICIEMBRE DE 2020 "]
[null,null,null,null,null,"Comparativo con el ejercicio anterior"]
[null,null,null,null,null," (Expresado en guaraníes)"]
{"$rows_left_out":26}
{"sheet":"EFE","index":6,"n_rows":38,"n_cols":3,"rows_kept":38,"cut":false,"hidden":false,"merged":[[2,0,2,2],[4,0,4,2],[5,0,5,2],[6,0,6,2],[7,0,7,2]]}
[{"$f":"Indice!C1","v":"CEMENTOS CONCEPCIÓN S.A.E."}]
[]
[]
[]
["ESTADO DE FLUJOS DE EFECTIVO POR EL EJERCICIO FINALIZADO EL 31 DE DICIEMBRE DE 2020"]
["Comparativo con el ejercicio anterior"]
[" (Expresado en guaraníes)"]
[]
[]
[]
{"$rows_left_out":29}
{"sheet":"Nota1","index":7,"n_rows":18,"n_cols":12,"rows_kept":18,"cut":false,"hidden":false,"merged":[[17,0,21,8],[10,0,15,8],[5,0,5,8]]}
[{"$f":"Indice!C1","v":"CEMENTOS CONCEPCIÓN S.A.E."},null,null,null,null,null,null,null,"BG",null,null,"Indice"]
[]
[null,null,null,null,"NOTAS A LOS ESTADOS FINANCIEROS AL 31 DE DICIEMBRE DE 2020"]
[null,null,null,null,"Comparativo con el ejercicio anterior"]
[null,null,null,null," (Expresado en guaraníes)"]
[" "]
[]
[]
["NOTA 1 – DESCRIPCIÓN DE LA NATURALEZA Y DEL NEGOCIO DE LA COMPAÑÍA"]
[]
{"$rows_left_out":9}
{"sheet":"Nota 2","index":8,"n_rows":129,"n_cols":9,"rows_kept":129,"cut":false,"hidden":false,"merged":[[69,0,72,8],[74,0,75,8],[77,0,78,8],[80,0,81,8],[68,0,68,8],[30,0,30,8],[33,1,33,2],[33,4,33,8],[34,4,34,5],[34,7,34,8],[65,9,65,10],[66,9,66,10],[67,9,67,10],[41,0,41,8],[47,0,48,8],[52,0,52,4],[57,0,58,8],[66,0,67,8],[65,0,65,8],[62,0,62,8],[85,9,85,10],[86,9,86,10],[86,0,86,8],[84,0,84,8],[85,0,85,8],[84,9,84,10],[130,0,130,8],[96,0,96,8],[127,0,127,8],[128,0,129,8],[97,0,100,8],[102,0,104,8],[106,0,108,8],[122,0,122,8],[123,0,124,8],[25,0,26,8],[23,0,23,8],[24,0,24,8],[19,0,21,8],[120,9,120,10],[96,9,96,10],[87,0,87,8],[87,9,87,10],[117,9,117,10],[118,0,118,8],[117,0,117,8],[91,0,93,8],[110,0,111,8],[114,0,114,8],[115,0,115,8],[119,0,119,8],[28,0,29,8],[5,0,5,8],[56,0,56,8],[61,0,61,8],[60,0,60,8],[18,0,18,8],[42,0,42,8],[46,0,46,8],[51,0,51,8],[7,0,7,8],[44,0,44,8],[45,0,45,8],[8,0,11,8],[13,0,13,8],[14,0,14,8],[15,0,15,8]]}
[{"$f":"Indice!C1","v":"CEMENTOS CONCEPCIÓN S.A.E."},null,null,null,null,null,null,null,"BG"]
[]
[]
[]
[]
["NOTA 2 - RESUMEN DE LAS PRINCIPALES POLÍTICAS CONTABLES"]
[]
["a.   Bases de contabilización (Según NIF Bases de preparación de los Estados Financieros)"]
["Los estados financieros se han preparado siguiendo los criterios de las Normas de Información Financiera (NIF) emitidas por el Consejo de Contadores Públicos del Paraguay sobre la base de cos-tos históricos, excepto para el caso de activos y pasivos en moneda extranjera  y las propiedades, planta y equipo según se explica en la Notas j, y no reconocen en forma integral los efectos de la inflación sobre la situación patrimonial y financiera de la sociedad, sobre los resultados de sus operaciones y los flujos de efectivo, en atención a que la corrección monetaria no constituye una práctica contable obligatoria en el Paraguay. \n"]
[]
{"$rows_left_out":120}
{"sheet":"Nota 3","index":9,"n_rows":21,"n_cols":5,"rows_kept":21,"cut":false,"hidden":false,"merged":[[20,0,20,3]]}
[{"$f":"Indice!C1","v":"CEMENTOS CONCEPCIÓN S.A.E."},null,null,null,"BG"]
[]
[]
[]
[]
[]
["NOTA 3 - EFECTIVO Y EQUIVALENTE DE EFECTIVO"]
[]
["El saldo al 31 de diciembre del 2020 y 2019, es como sigue, en guaraníes:"]
[]
{"$rows_left_out":12}
{"sheet":"Nota 4","index":10,"n_rows":39,"n_cols":6,"rows_kept":39,"cut":false,"hidden":false,"merged":[[6,2,6,3],[2,0,2,2]]}
[{"$f":"Indice!C1","v":"CEMENTOS CONCEPCIÓN S.A.E."},null,null,null,null,"BG"]
[]
["La cartera de cuentas a cobrar consta de dos segmentos bien diferentes, de los cuales uno proviene de las ventas a crédito realizadas a clientes y el otro por un préstamo otorgado a corto plazo y el detalle es como sigue:"]
[]
["NOTA  4 – CUENTAS POR COBRAR COMERCIALES"]
["Las cuentas a cobrar comerciales a corto plazo se integran como sigue:"]
[]
[null,null,{"$f":"IFERROR(IF(Indice!B6=\"\",\"2XX2\",YEAR(Indice!B6)),\"2XX2\")","v":2020},{"$f":"IFERROR(YEAR(Indice!B6-366),\"2XX1\")","v":2019}]
["Deudores por ventas locales","Moneda Local Guaraníes",{"$f":"5645558058-C10-C11-2","v":4296994029.9200001},{"$f":"866038000-D11","v":843750000}]
["Deudores por ventas locales","Moneda Extranjera Dólares",{"$f":"165898*6891.96","v":1143362380.0799999},0]
{"$rows_left_out":30}
{"sheet":"Nota 5","index":11,"n_rows":29,"n_cols":4,"rows_kept":29,"cut":false,"hidden":false,"merged":[[28,0,31,3]]}
[{"$f":"Indice!C1","v":"CEMENTOS CONCEPCIÓN S.A.E."},null,null,"BG"]
[]
[]
["NOTA 5 - OTROS CRÉDITOS"]
[]
["El saldo al 31 de diciembre del 2020 y 2019, es como sigue, en guaraníes:"]
[]
["Corrientes"]
[]
["Concepto",{"$f":"IFERROR(IF(Indice!B6=\"\",\"2XX2\",YEAR(Indice!B6)),\"2XX2\")","v":2020},{"$f":"IFERROR(YEAR(Indice!B6-366),\"2XX1\")","v":2019}]
{"$rows_left_out":20}
{"sheet":"Nota 6","index":12,"n_rows":16,"n_cols":5,"rows_kept":16,"cut":false,"hidden":false,"merged":[[4,0,4,1],[15,0,15,4]]}
[{"$f":"Indice!C1","v":"CEMENTOS CONCEPCIÓN S.A.E."},null,null,null,"BG"]
[]
[]
["Nota 6 - OTROS VALORES – FIDEICOMISO "]
[]
[" El saldo al 31 de diciembre del 2020 y 2019, es como sigue, en guaraníes:"]
[]
[null,{"$f":"IFERROR(IF(Indice!B6=\"\",\"2XX2\",YEAR(Indice!B6)),\"2XX2\")","v":2020},{"$f":"+IFERROR(YEAR(Indice!B6-366),\"2XX1\")","v":2019}]
["Conceptos"]
["Fideicomiso Cta. Reserva - Moneda local Guaraníes",4277295761,0]
{"$rows_left_out":7}
{"sheet":"Nota 7","index":13,"n_rows":14,"n_cols":4,"rows_kept":14,"cut":false,"hidden":false,"merged":[[6,1,6,2],[5,0,5,6],[3,0,3,2]]}
[{"$f":"Indice!C1","v":"CEMENTOS CONCEPCIÓN S.A.E."},null,null,"BG"]
[]
[]
["NOTA 7 – INVENTARIO"]
[]
["El saldo al 31 de diciembre 2020 y 2019, es como sigue, en guaraníes:"]
[]
["Concepto",{"$f":"IFERROR(IF(Indice!B6=\"\",\"2XX2\",YEAR(Indice!B6)),\"2XX2\")","v":2020},{"$f":"IFERROR(YEAR(Indice!B6-366),\"2XX1\")","v":2019}]
["Productos terminados",16514912613,1391832927]
["Productos en proceso",861069624,0]
{"$rows_left_out":5}
{"sheet":"Nota 8","index":14,"n_rows":17,"n_cols":5,"rows_kept":17,"cut":false,"hidden":false,"merged":[[3,0,3,5]]}
[{"$f":"Indice!C1","v":"CEMENTOS CONCEPCIÓN S.A.E."},null,null,"BG"]
[]
[]
["Nota 8 - INVERSIONES PERMANENTES"]
[]
["Las inversiones en sociedades se describen a continuación:"]
[]
["Periodo",{"$f":"IFERROR(IF(Indice!B6=\"\",\"2XX2\",YEAR(Indice!B6)),\"2XX2\")","v":2020},{"$f":"IFERROR(YEAR(Indice!B6-366),\"2XX1\")","v":2019}]
["Total Inversión",46750000,0]
[]
{"$rows_left_out":8}
{"sheet":"Nota 9","index":15,"n_rows":31,"n_cols":11,"rows_kept":31,"cut":false,"hidden":false,"merged":[[2,0,2,9],[5,8,5,9]]}
[{"$f":"Indice!C1","v":"CEMENTOS CONCEPCIÓN S.A.E."},null,null,null,null,null,null,null,"BG"]
[]
["NOTA 9 - PROPIEDADES, PLANTA Y EQUIPO - NETO"]
[]
[]
[null,"Costo histórico revaluado al inicio del año","Adquisiciones","Transferencia","Valor de origen final","Depreciación acumulada revaluada al inicio del año","Depreciación del año","Depreciación acumulada al final del ejercicio","Valor neto contable"]
[null,null,null,null,null,null,null,null,{"$f":"IFERROR(IF(Indice!B6=\"\",\"2XX2\",YEAR(Indice!B6)),\"2XX2\")","v":2020},{"$f":"IFERROR(YEAR(Indice!B6-366),\"2XX1\")","v":2019},"Vida útil"]
["Construcciones y Mejoras",42255487,29687231316,0,29729486803,1760645,1760645,3521290,29725965513,{"$f":"+B8","v":42255487},"40 años"]
["Embarcaciones",0,239582000,0,239582000,0,0,0,239582000,0,"10 años"]
["Equipos",1005754987,3637584392,0,4643339379,0,201150998,201150998,4442188381,1005754987,"5 años"]
{"$rows_left_out":22}
{"sheet":"Nota 10","index":16,"n_rows":15,"n_cols":6,"rows_kept":15,"cut":false,"hidden":false,"merged":[[3,0,3,3],[4,1,4,2],[14,0,14,2]]}
[{"$f":"Indice!C1","v":"CEMENTOS CONCEPCIÓN S.A.E."},null,null,null,null,"BG"]
[]
[]
["NOTA 10 – ACTIVOS INTANGIBLES"]
[]
[]
[]
["Activos intangibles",{"$f":"IFERROR(IF(Indice!B6=\"\",\"2XX2\",YEAR(Indice!B6)),\"2XX2\")","v":2020},{"$f":"IFERROR(YEAR(Indice!B6-366),\"2XX1\")","v":2019}]
["Licencias",{"$f":"3405055205+55955000","v":3461010205},1858651363]
[]
{"$rows_left_out":6}
{"sheet":"Nota 11","index":17,"n_rows":16,"n_cols":5,"rows_kept":16,"cut":false,"hidden":false,"merged":[]}
[{"$f":"Indice!C1","v":"CEMENTOS CONCEPCIÓN S.A.E."},null,"BG"]
[]
[]
["NOTA 11 – CUENTAS POR PAGAR COMERCIALES"]
[]
["El saldo al 31 de diciembre del 2020 y 2019, es como sigue, en guaraníes:"]
[]
["Corrientes","Simbología según ISO 4217","Indicación de Moneda",{"$f":"IFERROR(IF(Indice!B6=\"\",\"2XX2\",YEAR(Indice!B6)),\"2XX2\")","v":2020},{"$f":"IFERROR(YEAR(Indice!B6-366),\"2XX1\")","v":2019}]
["Proveedores - Entidades Relacionadas","PYG",{"$f":"IFERROR(VLOOKUP(B9,#REF!,2,0),\"\")","v":""},1646950043,51768290]
["Proveedores - Entidades Relacionadas","USD",{"$f":"IFERROR(VLOOKUP(B10,#REF!,2,0),\"\")","v":""},2031127,0]
{"$rows_left_out":7}
{"sheet":"Nota 12","index":18,"n_rows":63,"n_cols":12,"rows_kept":63,"cut":false,"hidden":false,"merged":[[60,0,60,4],[62,0,62,4]]}
[{"$f":"Indice!C1","v":"CEMENTOS CONCEPCIÓN S.A.E."},null,null,null,"BG",null,null,null,null,null,null,"BG"]
[]
[]
["NOTA 12 –  DEUDAS FINANCIERAS CORRIENTE"]
[]
[]
[]
[]
["Corrientes"]
[null,null,null,{"$f":"IFERROR(IF(Indice!B6=\"\",\"2XX2\",YEAR(Indice!B6)),\"2XX2\")","v":2020},null,null,null,null,null,{"$f":"IFERROR(YEAR(Indice!B6-366),\"2XX1\")","v":2019}]
{"$rows_left_out":54}
{"sheet":"Nota 13","index":19,"n_rows":13,"n_cols":4,"rows_kept":13,"cut":false,"hidden":false,"merged":[[3,0,3,3],[7,0,8,0]]}
[{"$f":"Indice!C1","v":"CEMENTOS CONCEPCIÓN S.A.E."},null,null,"BG"]
[]
[]
["NOTA 13 -  PROVISIONES"]
[]
["El saldo al 31 de diciembre del 2020 y 2019, es como sigue, en guaraníes:"]
[]
["Provisiones",{"$f":"IFERROR(IF(Indice!B6=\"\",\"2XX2\",YEAR(Indice!B6)),\"2XX2\")","v":2020},{"$f":"IFERROR(YEAR(Indice!B6-366),\"2XX1\")","v":2019}]
[]
["Honorarios Profesionales a Pagar",4514755,8000000]
{"$rows_left_out":4}
{"sheet":"Nota 14","index":20,"n_rows":12,"n_cols":4,"rows_kept":12,"cut":false,"hidden":false,"merged":[[3,0,3,1]]}
[{"$f":"Indice!C1","v":"CEMENTOS CONCEPCIÓN S.A.E."},null,null,"BG"]
[]
["NOTA 14 – OTROS PASIVOS CORRIENTES y NO CORRIENTES"]
[]
[]
["Corrientes",{"$f":"IFERROR(IF(Indice!B6=\"\",\"2XX2\",YEAR(Indice!B6)),\"2XX2\")","v":2020},{"$f":"IFERROR(YEAR(Indice!B6-366),\"2XX1\")","v":2019}]
["Retencion de IVA a pagar",57717823,113990498]
["Retencion Impuesto a la renta a Pagar",251209084,289537951]
["Anticipos de Clientes",95005491,428115770]
["Otros Pasivos",900133,900000]
{"$rows_left_out":3}
{"sheet":"Nota 15","index":21,"n_rows":28,"n_cols":3,"rows_kept":28,"cut":false,"hidden":false,"merged":[[7,0,7,6]]}
[{"$f":"Indice!C1","v":"CEMENTOS CONCEPCIÓN S.A.E."},null,"Indice"]
[]
[]
[]
["NOTA 15 - SALDOS CON PARTES RELACIONADAS"]
[]
[]
[]
[]
[null,{"$f":"IFERROR(IF(Indice!B6=\"\",\"2XX2\",YEAR(Indice!B6)),\"2XX2\")","v":2020},{"$f":"+IFERROR(YEAR(Indice!B6-366),\"2XX1\")","v":2019}]
{"$rows_left_out":19}
{"sheet":"Nota 16.1","index":22,"n_rows":37,"n_cols":7,"rows_kept":37,"cut":false,"hidden":false,"merged":[[5,0,5,7],[10,0,11,0]]}
[{"$f":"Indice!C1","v":"CEMENTOS CONCEPCIÓN S.A.E."},null,null,null,null,null,"ER"]
[]
[]
[]
["NOTA 16.1 - GASTOS ADMINISTRATIVOS Y DE VENTAS"]
[]
[]
["El saldo de los “Gastos Administrativos” y “Gastos de Ventas” al 31 de diciembre del 2020 y 2019, es como sigue, en guaraníes:"]
[]
[]
{"$rows_left_out":28}
{"sheet":"Nota 16.2","index":23,"n_rows":10,"n_cols":7,"rows_kept":10,"cut":false,"hidden":false,"merged":[[3,0,3,4]]}
[{"$f":"Indice!C1","v":"CEMENTOS CONCEPCIÓN S.A.E."},null,null,null,"ER"]
[]
[]
["Nota 16.2 - OTROS INGRESOS"]
[]
["El saldo de los “Otros Ingresos” al 31 de diciembre del 2020 y 2019, es como sigue, en guaraníes:"]
[]
["Otros ingresos",{"$f":"IFERROR(IF(Indice!B6=\"\",\"2XX2\",YEAR(Indice!B6)),\"2XX2\")","v":2020},{"$f":"+IFERROR(YEAR(Indice!B6-366),\"2XX1\")","v":2019},null,null,{"$f":"IFERROR(IF(Indice!B6=\"\",\"2XX2\",YEAR(Indice!B6)),\"2XX2\")","v":2020},{"$f":"+IFERROR(YEAR(Indice!B6-366),\"2XX1\")","v":2019}]
["Otros Ingresos",{"$f":"316720944-3790578","v":312930366},4490707]
["Total",{"$f":"SUM($B$9:B9)","v":312930366},{"$f":"SUM($C$9:C9)","v":4490707},null,null,{"$f":"SUM($F$9:F9)","v":0},{"$f":"SUM($G$9:G9)","v":0}]
{"$rows_left_out":1}
{"sheet":"Nota 17","index":24,"n_rows":13,"n_cols":5,"rows_kept":13,"cut":false,"hidden":false,"merged":[]}
[{"$f":"Indice!C1","v":"CEMENTOS CONCEPCIÓN S.A.E."},null,null,null,"ER"]
[]
[]
[]
["NOTA 17 - INGRESOS Y GASTOS FINANCIEROS NETOS"]
[]
["El saldo al 31 de diciembre del 2020 y 2019, es como sigue, en guaraníes:"]
[]
["Ingresos Financieros netos",{"$f":"IFERROR(IF(Indice!B6=\"\",\"2XX2\",YEAR(Indice!B6)),\"2XX2\")","v":2020},{"$f":"+IFERROR(YEAR(Indice!B6-366),\"2XX1\")","v":2019}]
[" Diferencia de Cambio neto",11188142308,16714348519]
{"$rows_left_out":4}
{"sheet":"Nota 18","index":25,"n_rows":17,"n_cols":5,"rows_kept":17,"cut":false,"hidden":false,"merged":[[5,1,5,2]]}
[{"$f":"Indice!C1","v":"CEMENTOS CONCEPCIÓN S.A.E."},null,null,null,"ER"]
[]
[]
["Nota 18 - IMPUESTO A LA RENTA Y DIFERIDO"]
["El detalle del activo por impuesto diferido y corriente es el siguiente: "]
[]
["Activo por impuesto diferido",2020,2019]
[]
["Quebrantos impositivos acumulados (neto)",844880621,0]
["Total",844880621,0]
{"$rows_left_out":8}
{"sheet":"Nota 19","index":26,"n_rows":17,"n_cols":4,"rows_kept":17,"cut":false,"hidden":false,"merged":[[2,0,2,4]]}
[{"$f":"Indice!C1","v":"CEMENTOS CONCEPCIÓN S.A.E."},null,null,"BG"]
[]
["NOTA 19 - CAPITAL SOCIAL"]
[]
["Integrado"]
["El capital integrado al 31 de diciembre de 2020 asciende a Gs. 330.000.000.000 y está representado por 330.000 acciones nominativas, ordinarias de valor nominal Gs. 1.000.000 cada una."]
[]
["Aportes para Futura Integración de Acciones"]
["Durante el ejercicio 2019 la sociedad ha recibido aportes para futura integración de acciones por Gs. 288.626.013.084, que sumado al saldo inicial de Gs. 402.816.791 totalizó la suma de Gs. 289.028.829.875. De dicho saldo fue capitalizada la suma de Gs. 288.893.000.0000, quedando para futura integración de acciones un total de Gs. 135.829.875.-"]
[]
{"$rows_left_out":8}
{"sheet":"Nota 20","index":27,"n_rows":6,"n_cols":4,"rows_kept":6,"cut":false,"hidden":false,"merged":[[2,0,2,4]]}
[{"$f":"Indice!C1","v":"CEMENTOS CONCEPCIÓN S.A.E."},null,null,"BG"]
[]
["NOTA 20 - RESERVA DE REVALUO"]
[]
["El saldo de este rubro corresponde a la revaluación anual obligatoria de los bienes de uso, que fue realizada tal como lo exige la disposición legal y reglamentaria impositiva vigentes. A partir del ejercicio 2020 esta ya no fue hecha adecuándose a las modificaciones legales y también a las NIF Normas de Información Financiera."]
["El incremento patrimonial producido por el revalúo de los bienes de uso podrá ser capitalizado, no pudiendo ser distribuido como dividendo, utilidad o beneficio."]

{"sheet":"Nota 21","index":28,"n_rows":7,"n_cols":4,"rows_kept":7,"cut":false,"hidden":false,"merged":[[3,0,3,4]]}
[]
[{"$f":"Indice!C1","v":"CEMENTOS CONCEPCIÓN S.A.E."},null,null,"BG"]
[]
["NOTA 21 - RESERVA LEGAL Y OTRAS RESERVAS"]
[]
["NOTA 21.1 RESERVA LEGAL: Al cierre del 31 de diciembre de 2019, la Empresa ha constituido la suma de Gs. 2.624.662 en concepto de Reserva Legal, que representa el 5% sobre el resultado utilidad del ejercicio cerrado al 31.12.2018, que fue de Gs. 52.493.238. Además, al cierre del 30 de junio de 2020, la Empresa ha constituido la suma de Gs. 38.290.179 en concepto de Reserva Legal, que representa el 5% sobre el resultado utilidad del ejercicio cerrado al 31.12.2019, que fue de Gs. 765.803.588. En total se ha constituido Reserva Legal por Gs. 40.914.841.-"]
["NOTA 21.2 RESERVA FACULTATIVA: Al cierre del 30 de junio de 2020, la Empresa ha constituido la suma de Gs. 318.439.394 en concepto de Reserva Facultativa, que corresponde a las utilidades netas luego de la Reserva Legal."]

{"sheet":"Nota 22","index":29,"n_rows":15,"n_cols":5,"rows_kept":15,"cut":false,"hidden":false,"merged":[[3,0,3,4]]}
[{"$f":"Indice!C1","v":"CEMENTOS CONCEPCIÓN S.A.E."},null,null,null,"Indice"]
[]
[]
["NOTA 22 - BIENES DE USO CON DISPONIBILIDAD RESTRINGIDA"]
[]
[]
["Tipo de Activo","Datos  del activo gravado","Tipo de garantía","Importe (indicar moneda)","A favor de"]
["Vehículo Terrestre","HYUNDAI HD72 5,5 TONELADAS CHASIS CON CABINA , CHASIS N° KMFGA17PPLC344048, MOTOR N° D4DDKJ681888, COLOR BLANCO","Prenda",170537890,"AUTOMOTOR S.A."]
["Vehículo Terrestre","HYUNDAI HD72 5,5 TONELADAS CHASIS CON CABINA , CHASIS N° KMFGA17PPLC344035, MOTOR N° D4DDKJ681790, COLOR BLANCO","Prenda",171262603,"AUTOMOTOR S.A."]
["Vehículo Terrestre","MARCA KIA, MODELO K2700 (PU) CHASIS: KNCSHY71CL7410278, AÑO 2020, COLO BLANCO ","Prenda",135343347,"GARDEN AUTOMOTOR S.A."]
{"$rows_left_out":6}
{"sheet":"Nota 23","index":30,"n_rows":6,"n_cols":4,"rows_kept":6,"cut":false,"hidden":false,"merged":[[3,0,3,6],[5,0,5,6]]}
[{"$f":"Indice!C1","v":"CEMENTOS CONCEPCIÓN S.A.E."},null,null,"Índice"]
[]
[]
["NOTA 23 - RESTRICCION DE LA DISTRIBUCION DE UTILIDADES"]
[]
["RESTRICCION DE LA DISTRIBUCION DE UTILIDADES\n\na)\tDe acuerdo con la legislación vigente y los estatutos sociales, las sociedades por acciones y las de responsabilidad limitada, deben constituir una reserva legal no menor del 5% de las utilidades netas del ejercicio, hasta alcanzar el 20% del capital suscripto.\n\nb)\tEl incremento patrimonial producido por el revalúo de los bienes de uso podrá ser capitalizado, no pudiendo ser distribuido como dividendo, utilidad o beneficio.\n\nc)\tHasta el 31 de diciembre de 2019, de acuerdo con la Ley Nº 125/91, modificada por la Ley 2421/04 que establece el régimen tributario, las utilidades obtenidas y remesadas a beneficiarios radicados en el exterior se hallan sujetas a una retención del 15% en concepto de impuesto a la renta gravada con una tasa adicional de impuesto a la renta del 5% para la entidad.\n\nd)\tCon la entrada en vigencia de la Ley 6380/19 a partir del 1° de enero del 2020, las utilidades generadas no distribuidas al cierre del ejercicio 2019 estarán sujetas a una retención del 8% en concepto del Utilidades IDU en el momento de la remesa o acreditamiento a personas físicas o jurídicas domiciliadas en el país, mientras que la tasa será del 15% cuando se tratase de no domiciliados. Excepcionalmente durante el primer año de vigencia de la Ley las ganancias acumuladas generadas en ejercicios anteriores y que no fueron capitalizadas ni distribuidas."]

{"sheet":"Nota 24","index":31,"n_rows":6,"n_cols":5,"rows_kept":6,"cut":false,"hidden":false,"merged":[[9,0,9,7],[5,0,6,7]]}
[{"$f":"Indice!C1","v":"CEMENTOS CONCEPCIÓN S.A.E."},null,null,null,"Indice"]
[]
[]
["NOTA 24 - CONTINGENCIAS Y COMPROMISOS "]
[]
["Al 31 de diciembre de 2020 no existen situaciones contingentes, ni reclamos que pudieran resultar compromisos para la Sociedad, adicionales a las que se presentan en los Estados Financieros."]

{"sheet":"Nota 25","index":32,"n_rows":6,"n_cols":4,"rows_kept":6,"cut":false,"hidden":false,"merged":[[3,0,3,6],[5,0,5,6]]}
[{"$f":"Indice!C1","v":"CEMENTOS CONCEPCIÓN S.A.E."},null,null,"Índice"]
[]
[]
["NOTA 25: SITUACIÓN DE PANDEMIA COVID-19"]
[]
["A mediados de marzo del 2020, la Organización Mundial de la Salud declaró al brote de coronavirus COVID-19 como una pandemia. La situación de emergencia sobre la salud pública se expandió prácticamente en todo el mundo y los distintos países han tomado diversas medidas para hacerle frente. Esta situación y las medidas adoptadas han afectado significativamente la actividad económica internacional con impactos diversos en los distintos países y sectores de negocio. La Dirección de la Compañía estima que esta situación generará un impacto adverso sobre las operaciones de la Compañía, pero las incertidumbres en relación con los efectos, extensión y duración de esta cuestión no permiten una estimación razonable de ese impacto a la fecha de emisión de los presentes estados financieros, lo que dependerá de la gravedad de la emergencia sanitaria y del éxito de las medidas tomadas y que se tomen en el futuro."]

{"sheet":"Nota 26","index":33,"n_rows":11,"n_cols":5,"rows_kept":11,"cut":false,"hidden":false,"merged":[[10,0,11,8]]}
[{"$f":"Indice!C1","v":"CEMENTOS CONCEPCIÓN S.A.E."},null,null,null,"Indice"]
[]
[]
[]
["NOTA 26 - HECHOS POSTERIORES"]
[]
["A la fecha de emisión de estos Estados Financieros , han ocurrido los siguientes eventos:"]
[]
["a) En fecha 12/03/2021 se ha emitido la serie 3 del Programa de emisión global por Gs. 100.000.000.000 con una tasa del 9,25% anual a un plazo de 10 años, con vencimiento trimestral de intereses y pago de Capital al final del período."]
[]
{"$rows_left_out":1}