{"text_format":"1","workbook":"xlsx","n_sheets":46,"sheets":["Indice","BG","ER","EVPN","EFE","Nota1","Nota 2","Nota 3","Nota 4","Nota 5","Nota 6","Nota 7","Nota 8","Nota 9","Nota 10","Nota 11","Nota 12","Nota 13","Nota 14","Nota 15","Nota 16","Nota 17","Nota 18","Nota 19","Nota 20"," Nota 21","Nota 22","Nota 23","Nota 24","Nota 25","Nota 26","Nota 27","Nota 28","Nota 29","Nota 30","Nota 31","Nota 32","Nota 33","Nota 34","Nota 35","Nota 36","Nota 37","Nota 38","Nota 39","Nota 40","Base de Monedas"],"not_rendered":{"charts":0,"images":5,"macros":1,"external_links":0,"defined_names":37,"comments":0,"pivot_tables":0},"unopened":[],"bounds":{"document_bytes":16777216,"sheet_cells":100000,"rows_first":2000,"rows_last":500,"rows_between":2000,"halvings":0,"cell_chars":16384,"cell_head_chars":4096},"cells_cut":0,"cells_raw":0,"read":"whole","date_system":"1900"}

{"sheet":"Indice","index":0,"n_rows":66,"n_cols":20,"rows_kept":66,"cut":false,"hidden":false,"merged":[]}
[null,"Sociedad:","GRUPO VAZQUEZ S.A.E."]
[null,null,null,null,null,null,null,null,null,null,null,null,null,null,null,null,null,null,1,"Enero"]
[null,null,null,null,null,null,null,null,null,null,null,null,null,null,null,null,null,null,2,"Febrero"]
[null,null,null,null,null,null,null,null,null,null,null,null,null,null,null,null,null,null,3,"Marzo"]
[null,null,null,null,null,null,null,null,null,null,null,null,null,null,null,null,null,null,4,"Abril"]
["Fecha Presentación:","2021-09-30",null,null,null,null,null,null,null,null,null,null,null,null,null,null,null,null,5,"Mayo"]
[null,null,null,null,null,null,null,null,null,null,null,null,null,null,null,null,null,null,6,"Junio"]
[null,null,null,null,null,null,null,null,null,null,null,null,null,null,null,null,null,null,7,"Julio"]
{"$rows_left_out":59}
{"sheet":"BG","index":1,"n_rows":67,"n_cols":7,"rows_kept":67,"cut":false,"hidden":false,"merged":[[82,3,82,6],[44,2,44,3],[77,5,77,6],[78,1,78,3],[76,5,76,6],[64,1,64,3],[72,5,72,6],[11,1,11,3],[31,1,31,3],[50,1,50,3],[48,1,48,3],[62,1,62,3],[29,1,29,3],[39,2,39,3],[43,2,43,3],[45,2,45,3],[51,2,51,3],[56,2,56,3],[53,2,53,3],[13,2,13,3],[14,2,14,3],[15,2,15,3],[16,2,16,3],[6,0,6,6],[8,0,8,6],[71,5,71,6],[58,2,58,3],[60,2,60,3],[28,2,28,3],[25,2,25,3],[26,2,26,3],[20,2,20,3],[22,2,22,3],[24,2,24,3],[34,2,34,3],[7,0,7,6],[23,2,23,3],[57,2,57,3],[52,2,52,3],[37,2,37,3],[38,2,38,3],[61,2,61,3],[55,2,55,3],[17,2,17,3],[27,2,27,3],[33,2,33,3],[35,2,35,3],[36,2,36,3],[54,2,54,3],[42,2,42,3],[59,2,59,3]]}
[null,null,null,{"$f":"Indice!C1","v":"GRUPO VAZQUEZ S.A.E."},"Indice"]
[]
[]
[]
[]
[]
["BALANCE GENERAL"]
[{"$f":"IFERROR(IF(Indice!B6=\"\",\"Al dia... de mes… de año 2XX2…\",\"Al \"&DAY(Indice!B6)&\" de \"&VLOOKUP(MONTH(Indice!B6),Indice!S:T,2,0)&\" de \"&YEAR(Indice!B6)),\"Al dia... de mes… de año 2XX2…\")","v":"Al 30 de Septiembre de 2021"}]
{"$rows_left_out":60}
{"sheet":"ER","index":2,"n_rows":35,"n_cols":4,"rows_kept":35,"cut":false,"hidden":false,"merged":[[46,2,46,3],[6,0,6,3],[7,0,7,3],[8,0,8,3],[9,0,9,3],[40,2,40,3]]}
[{"$f":"Indice!C1","v":"GRUPO VAZQUEZ S.A.E."},"Indice",null,{"$f":"ER!A4","v":" "}]
[]
[]
[" "]
[]
[]
["ESTADO DE RESULTADOS"]
[{"$f":"IFERROR(IF(Indice!B6=\"\",\"Al dia... de mes… de año 2XX2…\",\"Al \"&DAY(Indice!B6)&\" de \"&VLOOKUP(MONTH(Indice!B6),Indice!S:T,2,0)&\" de \"&YEAR(Indice!B6)),\"Al dia... de mes… de año 2XX2…\")","v":"Al 30 de Septiembre de 2021"}]
{"$rows_left_out":28}
{"sheet":"EVPN","index":3,"n_rows":44,"n_cols":23,"rows_kept":44,"cut":false,"hidden":false,"merged":[[12,8,14,8],[12,10,14,10],[12,20,14,20],[12,22,14,22],[8,0,8,18],[9,0,9,18],[13,2,14,2],[13,6,14,6],[13,12,14,12],[13,14,14,14],[13,18,14,18],[13,0,14,0],[12,2,12,6],[12,12,12,18],[13,4,14,4],[13,16,14,16]]}
[{"$f":"Indice!C1","v":"GRUPO VAZQUEZ S.A.E."},null,null,null,null,null,null,null,"Indice"]
[]
[]
[]
[]
[]
[null,null,null,null,null,null,"ESTADO DE EVOLUCIÓN DEL PATRIMONIO NETO"]
[null,null,null,null,null,null,null,null,{"$f":"IFERROR(IF(Indice!B6=\"\",\"Al dia... de mes… de año 2XX2…\",\"Al \"&DAY(Indice!B6)&\" de \"&VLOOKUP(MONTH(Indice!B6),Indice!S:T,2,0)&\" de \"&YEAR(Indice!B6)),\"Al dia... de mes… de año 2XX2…\")","v":"Al 30 de Septiembre de 2021"}]
{"$rows_left_out":37}
{"sheet":"EFE","index":4,"n_rows":42,"n_cols":3,"rows_kept":42,"cut":false,"hidden":false,"merged":[[2,0,2,2],[6,0,6,2],[7,0,7,2],[8,0,8,2],[9,0,9,2]]}
[{"$f":"Indice!C1","v":"GRUPO VAZQUEZ S.A.E."},null,"Indice"]
[]
[]
[]
[]
[]
["ESTADO DE FLUJOS DE EFECTIVO"]
[{"$f":"IFERROR(IF(Indice!B6=\"\",\"Al dia... de mes… de año 2XX2…\",\"Al \"&DAY(Indice!B6)&\" de \"&VLOOKUP(MONTH(Indice!B6),Indice!S:T,2,0)&\" de \"&YEAR(Indice!B6)),\"Al dia... de mes… de año 2XX2…\")","v":"Al 30 de Septiembre de 2021"}]
{"$rows_left_out":35}
{"sheet":"Nota1","index":5,"n_rows":17,"n_cols":9,"rows_kept":17,"cut":false,"hidden":false,"merged":[[7,0,7,8],[10,9,10,11],[11,0,11,8],[12,0,12,8],[16,0,16,8],[14,0,14,8],[13,0,13,8],[15,0,15,8],[14,10,14,18],[15,10,15,18],[16,10,16,18]]}
[{"$f":"Indice!C1","v":"GRUPO VAZQUEZ S.A.E."},null,null,null,null,null,null,null,"BG"]
[]
[]
[]
[]
["NOTAS A LOS ESTADOS FINANCIEROS CORRESPONDIENTES AL PERIODO TERMINADO",null,null,null,null,null,null,{"$f":"IFERROR(IF(Indice!B6=\"\",\"Al dia... de mes… de año 2XX2…\",\"Al \"&DAY(Indice!B6)&\" de \"&VLOOKUP(MONTH(Indice!B6),Indice!S:T,2,0)&\" de \"&YEAR(Indice!B6)),\"Al dia... de mes… de año 2XX2…\")","v":"Al 30 de Septiembre de 2021"}]
["Presentadas en forma comparativa según lo establecido en la resolucion CNV CG N° 6/19 Titulo 31 Capitulo 3 Articulo 3°"]
[" "]
{"$rows_left_out":10}
{"sheet":"Nota 2","index":6,"n_rows":64,"n_cols":9,"rows_kept":64,"cut":false,"hidden":false,"merged":[[5,0,5,8],[41,0,41,8],[45,0,45,8],[42,0,42,8],[12,0,12,8],[6,0,6,8],[11,0,11,8],[9,0,9,8],[30,0,30,8],[33,0,33,8],[34,0,34,8],[82,5,82,9],[63,0,63,8],[8,0,8,8],[16,0,16,8],[15,0,15,8],[32,0,32,8],[13,0,13,8],[14,0,14,8],[21,1,21,3],[22,1,22,3],[23,1,23,3],[24,1,24,3],[28,0,28,8],[31,0,31,8],[65,0,65,8],[62,0,62,8],[60,0,60,8],[56,0,56,8],[52,0,52,8],[53,0,53,8],[57,0,57,8],[54,0,54,8],[59,0,59,8],[51,0,51,8],[17,1,17,3],[18,1,18,3],[19,1,19,3],[20,1,20,3],[50,0,50,8],[46,0,46,8],[49,0,49,8],[27,0,27,8],[37,0,37,8],[38,0,38,8],[47,0,47,8],[48,0,48,8],[35,0,35,8]]}
[{"$f":"Indice!C1","v":"GRUPO VAZQUEZ S.A.E."},null,null,null,null,null,null,null,"BG"]
[]
[]
[]
[]
["NOTA 2 - RESUMEN DE LAS PRINCIPALES POLÍTICAS CONTABLES"]
["Resumen de las principales políticas contables: a modo referencial, se incluyen las siguientes revelaciones de políticas contables en estados financieros de uso general que podrá ser tenida en consideración por las sociedades emisoras para la preparación de este capítulo de los estados financieros:"]
[]
{"$rows_left_out":57}
{"sheet":"Nota 3","index":7,"n_rows":17,"n_cols":5,"rows_kept":17,"cut":false,"hidden":false,"merged":[]}
[{"$f":"Indice!C1","v":"GRUPO VAZQUEZ S.A.E."},null,null,null,"BG"]
[]
[]
[]
[]
["NOTA 3 - EFECTIVO Y EQUIVALENTE DE EFECTIVO"]
["En miles de guaranies"]
[]
{"$rows_left_out":10}
{"sheet":"Nota 4","index":8,"n_rows":20,"n_cols":5,"rows_kept":20,"cut":false,"hidden":false,"merged":[[4,0,4,2],[8,1,8,2]]}
[{"$f":"Indice!C1","v":"GRUPO VAZQUEZ S.A.E."},null,null,null,"BG"]
[]
[]
[]
["NOTA 4 - INVERSIONES TEMPORALES"]
["En miles de guaranies"]
[]
["La composición de la cuenta es la siguiente:"]
{"$rows_left_out":13}
{"sheet":"Nota 5","index":9,"n_rows":29,"n_cols":8,"rows_kept":29,"cut":false,"hidden":false,"merged":[[8,2,8,3],[16,2,16,3]]}
[{"$f":"Indice!C1","v":"GRUPO VAZQUEZ S.A.E."},null,null,null,null,"BG"]
[]
[]
[]
["NOTA  5 – CUENTAS POR COBRAR COMERCIALES"]
["En miles de guaranies"]
[]
["Las cuentas a cobrar comerciales a corto plazo se integran como sigue:"]
{"$rows_left_out":22}
{"sheet":"Nota 6","index":10,"n_rows":22,"n_cols":7,"rows_kept":22,"cut":false,"hidden":false,"merged":[]}
[{"$f":"Indice!C1","v":"GRUPO VAZQUEZ S.A.E."},null,null,"BG"]
[]
[]
[]
["NOTA 6 - OTROS CRÉDITOS"]
["En miles de guaranies"]
[]
["El rubro de otros créditos se compone como sigue:"]
{"$rows_left_out":15}
{"sheet":"Nota 7","index":11,"n_rows":14,"n_cols":4,"rows_kept":14,"cut":false,"hidden":false,"merged":[[8,1,8,2],[4,0,4,2]]}
[{"$f":"Indice!C1","v":"GRUPO VAZQUEZ S.A.E."},null,null,"BG"]
[]
[]
[]
["NOTA 7 – INVENTARIOS"]
["En miles de guaranies"]
[]
["Los bienes de cambio están compuestos de la siguiente manera:"]
{"$rows_left_out":7}
{"sheet":"Nota 8","index":12,"n_rows":40,"n_cols":12,"rows_kept":40,"cut":false,"hidden":false,"merged":[[4,0,4,5],[26,0,26,5]]}
[{"$f":"Indice!C1","v":"GRUPO VAZQUEZ S.A.E."},null,null,"BG"]
[]
[]
[]
["Nota 8 - INVERSIONES EN ASOCIADAS"]
["En miles de guaraníes"]
[]
["Las inversiones en sociedades donde no se ejerce control se describen a continuación"]
{"$rows_left_out":33}
{"sheet":"Nota 9","index":13,"n_rows":20,"n_cols":13,"rows_kept":20,"cut":false,"hidden":false,"merged":[[4,0,4,12]]}
[{"$f":"Indice!C1","v":"GRUPO VAZQUEZ S.A.E."},null,null,null,null,null,null,null,null,null,null,"BG"]
[]
[]
[]
["NOTA 9 - PROPIEDADES, PLANTA Y EQUIPO - NETO"]
["En miles de guaraníes",null,null,null,null,null,null,null,null,-1]
[]
[null,"Costo histórico revaluado al inicio del año","Adquisiciones","Bajas","Revalúo del año","Valor de origen revaluado al final del año","Depreciación acumulada revaluada al inicio del año","Depreciación del año","Bajas de depreciaciones acumuladas","Revalúo depreciación acumulada del año","Depreciación acumulada revaluada al final del año","Valor neto contable"]
{"$rows_left_out":13}
{"sheet":"Nota 10","index":14,"n_rows":13,"n_cols":3,"rows_kept":13,"cut":false,"hidden":false,"merged":[]}
[{"$f":"Indice!C1","v":"GRUPO VAZQUEZ S.A.E."},null,"BG"]
[]
[]
[]
["NOTA 10 – ACTIVOS EN FIDEICOMISO"]
["En miles de guaranies"]
[]
[null,"Setiembre 2021","Diciembre 2020"]
{"$rows_left_out":6}
{"sheet":"Nota 11","index":15,"n_rows":14,"n_cols":6,"rows_kept":14,"cut":false,"hidden":false,"merged":[[4,0,4,3]]}
[{"$f":"Indice!C1","v":"GRUPO VAZQUEZ S.A.E."},null,null,null,null,"BG"]
[]
[]
[]
["NOTA 11 – ACTIVOS INTANGIBLES"]
["En miles de guaranies"]
[]
["Activos intangibles","Setiembre 2021","Diciembre 2020"]
{"$rows_left_out":7}
{"sheet":"Nota 12","index":16,"n_rows":12,"n_cols":5,"rows_kept":12,"cut":false,"hidden":false,"merged":[]}
[{"$f":"Indice!C1","v":"GRUPO VAZQUEZ S.A.E."},null,null,null,"BG"]
[]
[]
[]
["NOTA 12 – GOODWILL"]
["En miles de guaranies"]
[]
["Goodwill","Setiembre 2021","Diciembre 2020"]
{"$rows_left_out":5}
{"sheet":"Nota 13","index":17,"n_rows":22,"n_cols":5,"rows_kept":22,"cut":false,"hidden":false,"merged":[]}
[{"$f":"Indice!C1","v":"GRUPO VAZQUEZ S.A.E."},null,"BG"]
[]
[]
[]
["NOTA 13 – CUENTAS POR PAGAR COMERCIALES"]
["En miles de guaranies"]
[]
["Las cuentas por pagar comerciales se componen como sigue:"]
{"$rows_left_out":15}
{"sheet":"Nota 14","index":18,"n_rows":58,"n_cols":12,"rows_kept":58,"cut":false,"hidden":false,"merged":[]}
[{"$f":"Indice!C1","v":"GRUPO VAZQUEZ S.A.E."},null,null,null,"BG",null,null,null,null,null,null,"BG"]
[]
[]
[]
["NOTA 14 –  PRESTAMOS A CORTO Y LARGO PLAZO"]
["En miles de guaranies"]
[]
["Corrientes"]
{"$rows_left_out":51}
{"sheet":"Nota 15","index":19,"n_rows":18,"n_cols":4,"rows_kept":18,"cut":false,"hidden":false,"merged":[[6,1,6,2]]}
[{"$f":"Indice!C1","v":"GRUPO VAZQUEZ S.A.E."},null,null,"BG"]
[]
[]
[]
["NOTA 15 – PORCION CORRIENTE DE LA DEUDA A LARGO PLAZO"]
["En miles de guaranies"]
[]
["Porción corriente de la deuda a largo plazo","Setiembre 2021","Diciembre 2020"]
{"$rows_left_out":11}
{"sheet":"Nota 16","index":20,"n_rows":11,"n_cols":6,"rows_kept":11,"cut":false,"hidden":false,"merged":[[5,0,5,1]]}
[{"$f":"Indice!C1","v":"GRUPO VAZQUEZ S.A.E."},null,null,null,null,"BG"]
[]
[]
[]
["NOTA 16 – REMUNERACIONES Y CARGAS SOCIALES A PAGAR"]
["En miles de guaranies"]
[]
["Remuneraciones y cargas sociales a pagar","Setiembre 2021","Diciembre 2020"]
{"$rows_left_out":4}
{"sheet":"Nota 17","index":21,"n_rows":11,"n_cols":4,"rows_kept":11,"cut":false,"hidden":false,"merged":[[5,0,5,1]]}
[{"$f":"Indice!C1","v":"GRUPO VAZQUEZ S.A.E."},null,null,"BG"]
[]
[]
[]
["NOTA 17 –  IMPUESTOS A PAGAR"]
["En miles de guaranies"]
[]
["Impuestos a pagar","Setiembre 2021","Diciembre 2020"]
{"$rows_left_out":4}
{"sheet":"Nota 18","index":22,"n_rows":13,"n_cols":4,"rows_kept":13,"cut":false,"hidden":false,"merged":[[4,0,4,3],[7,0,8,0],[5,0,5,1]]}
[{"$f":"Indice!C1","v":"GRUPO VAZQUEZ S.A.E."},null,null,"BG"]
[]
[]
[]
["NOTA 18 -  PROVISIONES"]
["En miles de guaranies"]
[]
["Provisiones","Setiembre 2021","Diciembre 2020"]
{"$rows_left_out":6}
{"sheet":"Nota 19","index":23,"n_rows":15,"n_cols":7,"rows_kept":15,"cut":false,"hidden":false,"merged":[[5,0,5,1]]}
[{"$f":"Indice!C1","v":"GRUPO VAZQUEZ S.A.E."},null,null,"BG"]
[]
[]
[]
["NOTA 19 – OTROS PASIVOS CORRIENTES y NO CORRIENTES"]
["En miles de guaranies"]
[]
["Corrientes","Setiembre 2021","Diciembre 2020",null,"No Corrientes","Setiembre 2021","Diciembre 2020"]
{"$rows_left_out":8}
{"sheet":"Nota 20","index":24,"n_rows":15,"n_cols":4,"rows_kept":15,"cut":false,"hidden":false,"merged":[[4,0,4,3],[5,0,5,1]]}
[{"$f":"Indice!C1","v":"GRUPO VAZQUEZ S.A.E."},null,null,"BG"]
[]
[]
[]
["NOTA 20 – CAPITAL INTEGRADO"]
["En miles de guaranies"]
[]
["Fecha","Setiembre 2021","Diciembre 2020"]
{"$rows_left_out":8}
{"sheet":" Nota 21","index":25,"n_rows":23,"n_cols":6,"rows_kept":23,"cut":false,"hidden":false,"merged":[[3,0,3,5],[4,0,4,1]]}
[{"$f":"Indice!C1","v":"GRUPO VAZQUEZ S.A.E."},null,null,null,null,"BG"]
[]
[]
["NOTA 21 – RESERVAS"]
["En miles de guaranies"]
[]
[null,"Setiembre 2021","Diciembre 2020"]
["a  Reserva de revalúo",0,0]
{"$rows_left_out":16}
{"sheet":"Nota 22","index":26,"n_rows":9,"n_cols":4,"rows_kept":9,"cut":false,"hidden":false,"merged":[[5,0,5,1]]}
[{"$f":"Indice!C1","v":"GRUPO VAZQUEZ S.A.E."},null,null,"BG"]
[]
[]
[]
["NOTA 21 –  DIFERENCIA TRANSITORIA POR CONVERSION"]
["En miles de guaranies"]
[]
[null,"Setiembre 2021","Diciembre 2020"]
{"$rows_left_out":2}
{"sheet":"Nota 23","index":27,"n_rows":10,"n_cols":3,"rows_kept":10,"cut":false,"hidden":false,"merged":[[4,0,4,1]]}
[{"$f":"Indice!C1","v":"GRUPO VAZQUEZ S.A.E."},null,"BG"]
[]
[]
["NOTA 23 –  RESULTADOS"]
["En miles de guaranies"]
[]
[null,"Setiembre 2021","Diciembre 2020"]
["Resultado de ejercicios anteriores",0,0]
{"$rows_left_out":3}
{"sheet":"Nota 24","index":28,"n_rows":8,"n_cols":3,"rows_kept":8,"cut":false,"hidden":false,"merged":[[4,0,4,1]]}
[{"$f":"Indice!C1","v":"GRUPO VAZQUEZ S.A.E."},null,"BG"]
[]
[]
["NOTA 24 –  INTERES MINORITARIO"]
["En miles de guaranies"]
[]
[null,"Setiembre 2021","Diciembre 2020"]
["Interes Minoritario"]
{"$rows_left_out":1}
{"sheet":"Nota 25","index":29,"n_rows":18,"n_cols":4,"rows_kept":18,"cut":false,"hidden":false,"merged":[[5,0,5,1]]}
[{"$f":"Indice!C1","v":"GRUPO VAZQUEZ S.A.E."},null,null,"ER"]
[]
[]
[]
["NOTA 25 –  VENTAS"]
["En miles de guaranies"]
[]
["Ventas","Setiembre 2021","Setiembre 2020"]
{"$rows_left_out":11}
{"sheet":"Nota 26","index":30,"n_rows":15,"n_cols":3,"rows_kept":15,"cut":false,"hidden":false,"merged":[[4,0,4,2],[5,0,5,1]]}
[{"$f":"Indice!C1","v":"GRUPO VAZQUEZ S.A.E."},null,"ER"]
[]
[]
[]
["NOTA 26 - COSTO DE VENTAS"]
["Miles de guaraníes"]
[]
["Costo de ventas","Setiembre 2021","Setiembre 2020"]
{"$rows_left_out":8}
{"sheet":"Nota 27","index":31,"n_rows":46,"n_cols":7,"rows_kept":46,"cut":false,"hidden":false,"merged":[[9,0,10,0]]}
[{"$f":"Indice!C1","v":"GRUPO VAZQUEZ S.A.E."},null,null,null,null,null,"ER"]
[]
[]
[]
["NOTA 27 - GASTOS"]
["Miles de guaraníes"]
[]
["El rubro está compuesto de la siguiente forma: "]
{"$rows_left_out":39}
{"sheet":"Nota 28","index":32,"n_rows":20,"n_cols":7,"rows_kept":20,"cut":false,"hidden":false,"merged":[[4,0,4,4],[5,1,5,2]]}
[{"$f":"Indice!C1","v":"GRUPO VAZQUEZ S.A.E."},null,null,null,"ER"]
[]
[]
[]
["Nota 28 - Otros Ingresos y gastos operativos"]
["Miles de guaraníes"]
[]
["Otros ingresos","Setiembre 2021","Setiembre 2020",null,"Otros gastos","Setiembre 2021","Setiembre 2020"]
{"$rows_left_out":13}
{"sheet":"Nota 29","index":33,"n_rows":12,"n_cols":7,"rows_kept":12,"cut":false,"hidden":false,"merged":[]}
[{"$f":"Indice!C1","v":"GRUPO VAZQUEZ S.A.E."},null,null,null,"ER"]
[]
[]
[]
["NOTA 29 - GASTOS FINANCIEROS Y CONVERSION DE MONEDA EXTRANJERA"]
["Miles de guaraníes"]
[]
["Gastos Financieros ","Setiembre 2021","Setiembre 2020",null,"Conversion de Moneda","Setiembre 2021","Setiembre 2020"]
{"$rows_left_out":5}
{"sheet":"Nota 30","index":34,"n_rows":13,"n_cols":5,"rows_kept":13,"cut":false,"hidden":false,"merged":[[6,1,6,2]]}
[{"$f":"Indice!C1","v":"GRUPO VAZQUEZ S.A.E."},null,null,null,"ER"]
[]
[]
[]
["Nota 34 - Resultado de inversiones en asociadas"]
["Miles de guaraníes"]
[]
[]
{"$rows_left_out":6}
{"sheet":"Nota 31","index":35,"n_rows":12,"n_cols":5,"rows_kept":12,"cut":false,"hidden":false,"merged":[[5,0,5,1],[6,1,6,2]]}
[{"$f":"Indice!C1","v":"GRUPO VAZQUEZ S.A.E."},null,null,null,"ER"]
[]
[]
[]
["Nota 31 - Resultado participación minoritaria"]
["Miles de guaraníes"]
[]
[]
{"$rows_left_out":5}
{"sheet":"Nota 32","index":36,"n_rows":10,"n_cols":3,"rows_kept":10,"cut":false,"hidden":false,"merged":[[6,1,6,2]]}
[{"$f":"Indice!C1","v":"GRUPO VAZQUEZ S.A.E."},null,"ER"]
[]
[]
[]
["Nota 32 - IMPUESTO A LA RENTA"]
["En miles de guaraníes"]
[]
[null,"Setiembre 2021","Setiembre 2020"]
{"$rows_left_out":3}
{"sheet":"Nota 33","index":37,"n_rows":11,"n_cols":5,"rows_kept":11,"cut":false,"hidden":false,"merged":[[5,0,5,1]]}
[{"$f":"Indice!C1","v":"GRUPO VAZQUEZ S.A.E."},null,null,null,"ER"]
[]
[]
[]
["Nota 33 - Resultado extraordinario neto de impuesto a la renta"]
["En miles de guaraníes"]
[]
[null,"Setiembre 2021","Setiembre 2020"]
{"$rows_left_out":4}
{"sheet":"Nota 34","index":38,"n_rows":12,"n_cols":5,"rows_kept":12,"cut":false,"hidden":false,"merged":[[5,0,5,1]]}
[{"$f":"Indice!C1","v":"GRUPO VAZQUEZ S.A.E."},null,null,null,"ER"]
[]
[]
[]
["Nota 34 - Resultado sobre actividades discontinuadas neto de impuesto a la renta"]
["En miles de guaraníes"]
[]
["Resultado sobre actividades discontinuadas neto de impuesto a la renta","Setiembre 2021","Setiembre 2020"]
{"$rows_left_out":5}
{"sheet":"Nota 35","index":39,"n_rows":11,"n_cols":3,"rows_kept":11,"cut":false,"hidden":false,"merged":[[5,0,5,1]]}
[{"$f":"Indice!C1","v":"GRUPO VAZQUEZ S.A.E."},null,"ER"]
[]
[]
[]
["NOTA 35- UTILIDAD (PÉRDIDA) NETA DEL AÑO Y POR ACCION ORDINARIA"]
["En miles de guaraníes"]
[]
[null,"Setiembre 2021","Setiembre 2020"]
{"$rows_left_out":4}
{"sheet":"Nota 36","index":40,"n_rows":17,"n_cols":5,"rows_kept":17,"cut":false,"hidden":false,"merged":[[4,0,4,4]]}
[{"$f":"Indice!C1","v":"GRUPO VAZQUEZ S.A.E."},null,null,null,"Indice"]
[]
[]
[]
["NOTA 36 - ACTIVOS GRAVADOS"]
["En miles de guaraníes"]
[]
["Los siguientes bienes de propiedad de la Sociedad han sido hipotecados y prendados en garantía de obligaciones financieras."]
{"$rows_left_out":10}
{"sheet":"Nota 37","index":41,"n_rows":6,"n_cols":5,"rows_kept":6,"cut":false,"hidden":false,"merged":[[5,0,6,7]]}
[{"$f":"Indice!C1","v":"GRUPO VAZQUEZ S.A.E."},null,null,null,"Indice"]
[]
[]
[]
["NOTA 37 - CONTINGENCIAS Y COMPROMISOS "]
[{"$f":"IFERROR(\"Al  \"&DAY(Indice!B6)&\" de \"&VLOOKUP(MONTH(Indice!B6),Indice!S:T,2,0)&\" de \"&YEAR(Indice!B6-1)&\" no existen situaciones contingentes, ni reclamos que pudieran resultar en la generación de obligaciones para la Sociedad adicionales a las que se presentan en estos estados financieros.\",\"Al … de …………... 20X2 no existen situaciones contingentes, ni reclamos que pudieran resultar en la generación de obligaciones para la Sociedad adicionales a las que se presentan en estos estados financieros.\")","v":"Al  30 de Septiembre de 2021 no existen situaciones contingentes, ni reclamos que pudieran resultar en la generación de obligaciones para la Sociedad adicionales a las que se presentan en estos estados financieros."}]

{"sheet":"Nota 38","index":42,"n_rows":24,"n_cols":4,"rows_kept":24,"cut":false,"hidden":false,"merged":[[3,0,3,6],[5,0,5,6],[7,0,7,6]]}
[{"$f":"Indice!C1","v":"GRUPO VAZQUEZ S.A.E."},null,null,"Índice"]
[]
[]
["NOTA 38 - IMPUESTO DIFERIDO"]
["En miles de guaraníes"]
["Al 30 de Setiembre 2021 la Sociedad constituyó una provisión para impuesto a la renta de Guaraníes  1.935.297 (Al 31 de diciembre 2020:  Guaraníes 1.289.750)."]
[]
["El siguiente cuadro detalla las diferencias temporales a la tasa del impuesto a los efectos de determinación del impuesto diferido:"]
{"$rows_left_out":17}
{"sheet":"Nota 39","index":43,"n_rows":8,"n_cols":5,"rows_kept":8,"cut":false,"hidden":false,"merged":[[10,0,10,8],[6,0,6,8],[7,0,7,8]]}
[{"$f":"Indice!C1","v":"GRUPO VAZQUEZ S.A.E."},null,null,null,"Indice"]
[]
[]
[]
["NOTA 39 - HECHOS POSTERIORES"]
[]
["Con posterioridad al 30 de Setiembre de 2021, la Organización Mundial de la Salud mantiene vigente al brote de coronavirus (COVID-19) como una pandemia. La situación de emergencia sobre la salud pública se expandió prácticamente en todo el mundo y los distintos países han tomado diversas medidas para hacerle frente. Esta situación y las medidas adoptadas han afectado significativamente la actividad económica internacional con impactos diversos en los distintos países y sectores de negocio. La Dirección de la Sociedad estima que esta situación podría generar un impacto negativo sobre las operaciones de la Sociedad, pero las incertidumbres en relación con los efectos, extensión y duración de esta cuestión no permiten una estimación razonable de ese impacto a la fecha de emisión de los presentes estados financieros, lo que dependerá de la gravedad de la emergencia sanitaria y del éxito de las medidas tomadas y que se tomen en el futuro."]
["Grupo Vázquez S.A.E., accionista controlante de Credicentro S.A.E.C.A., suscribió en fecha 9 de abril de 2020 la compra de la mayoría del paquete accionario de la entidad financiera regulada: Financiera El Comercio S.A.E.C.A. La transacción fue aprobada por el Banco Central de Paraguay en fecha 6 de septiembre de 2021, teniendo también opinión favorable de la Dirección de Investigaciones de la Comisión Nacional de Competencia."]
{"$rows_left_out":1}
{"sheet":"Nota 40","index":44,"n_rows":34,"n_cols":3,"rows_kept":34,"cut":false,"hidden":false,"merged":[]}
[{"$f":"Indice!C1","v":"GRUPO VAZQUEZ S.A.E."},null,"Indice"]
[]
[]
[]
["NOTA 40 - SALDOS Y TRANSACCIONES CON PARTES RELACIONADAS"]
["Miles de guaraníes"]
[]
[null,"Setiembre 2021","Diciembre 2020"]
{"$rows_left_out":27}
{"sheet":"Base de Monedas","index":45,"n_rows":179,"n_cols":3,"rows_kept":179,"cut":false,"hidden":false,"merged":[]}
["PYG","Guaraní","Índice"]
["USD","Dólar estadounidense"]
["EUR","Euro"]
["AED","Dírham de los Emiratos Árabes Unidos"]
["AFN","Afgani"]
["ALL","Lek"]
["AMD","Dram armenio"]
["ANG","Florín antillano neerlandés"]
{"$rows_left_out":171}