{"text_format":"1","workbook":"xlsx","n_sheets":48,"sheets":["Caratula","Indice","BG","EVPN","ER","EFE","Nota1","Nota 2","Nota 3","Nota 4","Nota 5","Nota 6","Nota 7","Nota 8","Nota 9","Nota 10","cred","Nota 11","Nota 12","Nota 13","Nota 14","Nota 15","Nota 16","Nota 17","Nota 18","Nota 19","Nota 20"," Nota 21","Nota 22","Nota 23","Nota 24","Nota 25","Nota 26","Nota 27","Nota 28","Nota 29","Nota 30","Nota 31","Nota 32","Nota 33","Nota 34","Nota 35","Nota 36","Nota 37","Nota 38","Nota 39","Nota 40","Base de Monedas"],"not_rendered":{"charts":0,"images":3,"macros":1,"external_links":3,"defined_names":4,"comments":0,"pivot_tables":0},"unopened":[],"bounds":{"document_bytes":16777216,"sheet_cells":100000,"rows_first":2000,"rows_last":500,"rows_between":2000,"halvings":0,"cell_chars":16384,"cell_head_chars":4096},"cells_cut":0,"cells_raw":0,"read":"whole","date_system":"1900"}

{"sheet":"Caratula","index":0,"n_rows":25,"n_cols":2,"rows_kept":25,"cut":false,"hidden":false,"merged":[]}
[]
[]
[]
[]
[null," E S T  A  D  O  S      C  O  N  T  A  B  L  E  S              "]
[]
[]
[]
[]
[null,"DENOMINACION:   NICOLAS GONZALEZ ODDONE S.A.E.C.A."]
[]
[]
[null,"DOMICÍLIO LEGAL: DOMINICANA ESQUINA VIA FERREA"]
[]
[]
[null,"ACTIVIDAD PRINCIPAL:  IMPORTACIONES"]
[]
[]
[null,"INSCRIPCION EN EL REGISTRO PUBLICO DE COMERCIO Nº 106 DEL 03/06/64 Y Nº 186 DEL 11/04/96 DE LOS ESTATUTOS SOCIALES Y SUS MODIFICACIONES. -"]
[]
[]
[null,"INSCRIPCION EN LA COMISION NACIONAL DE VALORES: N.º 058 RESOL. Nº 270/96"]
[]
[]
[null,"FECHA DE VENCIMIENTO DEL ESTATUTO SOCIAL:  AÑO 2094"]

{"sheet":"Indice","index":1,"n_rows":59,"n_cols":20,"rows_kept":59,"cut":false,"hidden":false,"merged":[]}
[null,null,"NICOLAS GONZALEZ ODDONE S.A.E.C.A"]
[null,null,null,null,null,null,null,null,null,null,null,null,null,null,null,null,null,null,1,"Enero"]
[null,"                                 ESTADOS CONTABLES AL 31/03/2020","ESTADOS CONTABLES AL 30/09/2020",null,null,null,null,null,null,null,null,null,null,null,null,null,null,null,5,"Mayo"]
[null,null,null,null,null,null,null,null,null,null,null,null,null,null,null,null,null,null,6,"Junio"]
[null,null,null,null,null,null,null,null,null,null,null,null,null,null,null,null,null,null,7,"Julio"]
[null,null,"INDICE","REF.",null,null,null,null,null,null,null,null,null,null,null,null,null,null,8,"Agosto"]
[null,"Informacion General",null,null,null,null,null,null,null,null,null,null,null,null,null,null,null,null,9,"Septiembre"]
[null,null,"Descripción de la naturaleza y del negocio de la Sociedad","Nota 1",null,null,null,null,null,null,null,null,null,null,null,null,null,null,10,"Octubre"]
[null,null,"Resumen de las principales políticas contables","Nota 2",null,null,null,null,null,null,null,null,null,null,null,null,null,null,11,"Noviembre"]
[null,"Balance General",null,"BG",null,null,null,null,null,null,null,null,null,null,null,null,null,null,12,"Diciembre"]
[null,null,"Efectivo y equivalente de efectivo","Nota 3"]
[null,null,"Inversiones temporales","Nota 4"]
[null,null,"Cuentas por cobrar comerciales","Nota 5"]
[null,null,"Otros créditos","Nota 6"]
[null,null,"Inventarios","Nota 7"]
[null,null,"Inversión en asociadas","Nota 8"]
[null,null,"Propiedades, planta y equipo","Nota 9"]
[null,null,"Activos disponibles para la venta","Nota 10"]
[null,null,"Activos intangibles","Nota 11"]
[null,null,"Goodwill","Nota 12"]
[null,null,"Otros Activos","Nota 41"]
[null,null,"Cuentas por pagar proveedores","Nota 13"]
[null,null,"Préstamos a corto plazo","Nota 14"]
[null,null,"Porción corriente de la deuda a largo plazo","Nota 15"]
[null,null,"Remuneraciones y cargas sociales a pagar","Nota 16"]
[null,null,"Impuestos a pagar","Nota 17"]
[null,null,"Provisiones","Nota 18"]
[null,null,"Otros pasivos corrientes","Nota 19"]
[null,null,"Capital integrado","Nota 20"]
[null,null,"Reserva de revalúo","Nota 21"]
[null,null,"Reserva legal","Nota 21"]
[null,null,"Reservas estatutarias","Nota 21"]
[null,null,"Reservas facultativas","Nota 21"]
[null,null,"Diferencia transitoria por conversión","Nota 22"]
[null,null,"Resultados acumulados","Nota 23"]
[null,null,"Interés minoritario","Nota 24"]
[null,"Estado de Resultados ",null,"ER"]
[null,null,"Ventas","Nota 25"]
[null,null,"Costo de ventas","Nota 26"]
[null,null,"Gastos de ventas","Nota 27"]
[null,null,"Gastos administrativos","Nota 27"]
[null,null,"Otros ingresos y gastos operativos/ No Operativos ","Nota 28"]
[null,null,"Ingresos financieros - neto/ Inversiones ","Nota 29"]
[null,null,"Gastos financieros - neto","Nota 29"]
[null,null,"Resultado de inversiones en asociadas","Nota 30"]
[null,null,"Resultado participación minoritaria","Nota 31"]
[null,null,"Impuesto a la renta","Nota 32"]
[null,null,"Resultado extraordinario neto de impuesto a la renta","Nota 33"]
[null,null,"Resultado sobre actividades discontinuadas neto de impuesto a la renta","Nota 34"]
[null,null,"Utilidad/(Pérdida) neta del año","Nota 35"]
[null,null,"Utilidad neta por acción ordinaria","Nota 35"]
[null,"Estado de Evolución del Patrimonio Neto",null,"EVPN"]
[null,"Estado de Flujos de Efectivo",null,"EFE"]
[null,"Otras Notas de los Estados Financieros"]
[null,null,"Activos gravados","Nota 36"]
[null,null,"Contingencias y compromisos","Nota 37"]
[null,null,"Impuesto diferido","Nota 38"]
[null,null,"Hechos posteriores","Nota 39"]
[null,null,"Saldos y transacciones con partes relacionadas","Nota 40"]

{"sheet":"BG","index":2,"n_rows":62,"n_cols":6,"rows_kept":62,"cut":false,"hidden":false,"merged":[[14,1,14,2],[42,1,42,2],[9,1,9,2],[10,1,10,2],[11,1,11,2],[12,1,12,2],[25,1,25,2],[33,1,33,2],[35,1,35,2],[36,1,36,2],[37,1,37,2],[22,1,22,2],[24,1,24,2],[18,1,18,2],[20,1,20,2],[21,1,21,2],[57,1,57,2],[51,1,51,2],[52,1,52,2],[53,1,53,2],[50,1,50,2],[54,1,54,2],[56,1,56,2],[23,1,23,2],[55,1,55,2],[27,1,27,2],[34,1,34,2],[49,1,49,2],[5,2,5,8],[72,4,72,5],[73,0,73,2],[7,0,7,2],[30,0,30,2],[47,0,47,2],[46,0,46,2],[58,0,58,2],[71,4,71,5],[29,0,29,2],[59,0,59,2],[38,1,38,2],[43,1,43,2],[48,1,48,2],[67,4,67,5],[66,4,66,5]]}
[null,null,{"$f":"[1]Indice!C1","v":"NICOLAS GONZALEZ ODDONE S.A.E.C.A"},"Indice"]
[]
[null,null,"BALANCE GENERAL AL 30 DE SETIEMBRE DE 2020 COMPARATIVO CON CIFRAS AL 31 DE DICIEMBRE DE 2019"]
[]
[null,null,null,"Nota","2020-09-30","2019-12-31"]
[null,null,"En miles de guaraníes"]
[]
["ACTIVOS"]
["Activos Corrientes "]
[null,"Efectivo y equivalente de efectivo",null,3,{"$f":"'Nota 3'!C20","v":77990864695},{"$f":"'[1]Nota 3'!D20","v":97761526232}]
[null,"Inversiones Temporales",null,4,{"$f":"'Nota 4'!B17","v":170560051546},{"$f":"'[1]Nota 4'!C15","v":44275981956}]
[null,"Cuentas por Cobrar Comerciales",null,5,{"$f":"'Nota 5'!C19","v":290184371933},{"$f":"+'[1]Nota 5'!D18","v":263030722694.02002}]
[null,"Otros Créditos",null,6,{"$f":"'Nota 6'!B51","v":5683101767},{"$f":"+'[1]Nota 6'!C38+'[1]Nota 6'!C47","v":9270297213}]
[null,"Inventarios ",null,7,{"$f":"'Nota 7'!B26","v":319728589900},{"$f":"+'[1]Nota 7'!C20+'[1]Nota 7'!C25","v":344616645121}]
[null,"Otros Activos Corrientes  ",null,6,{"$f":"'Nota 6'!B66","v":335812624},{"$f":"+'[1]Nota 6'!C63","v":0}]
[null,"TOTAL ACTIVO CORRIENTES ",null,null,{"$f":"SUM(E10:E15)","v":864482792465},{"$f":"SUM(F10:F15)","v":758955173216.02002}]
[]
["Activos no corrientes "]
[null,"Otros créditos ",null,6,{"$f":"'Nota 6'!F11","v":0},{"$f":"'[1]Nota 6'!G11","v":2019685489}]
[null,"Créditos por Ventas","Cuentas por Cobrar Comerciales",5,{"$f":"'Nota 5'!C28","v":362020491},{"$f":"+'[1]Nota 5'!D27","v":2346776684}]
[null,"Inversiones en Asociadas",null,8,{"$f":"'[1]Nota 8'!B10","v":32213537431},{"$f":"'[1]Nota 8'!C10","v":32213537431}]
[null,"Propiedad, planta y equipo ",null,9,{"$f":"'Nota 9'!L55","v":343581983268},{"$f":"'[1]Nota 9'!M55","v":329376781336}]
[null,"Inventarios ",null,7,{"$f":"'Nota 7'!B35","v":1568552657},{"$f":"'[1]Nota 7'!C37","v":1243344831}]
[null,"Activos disponibles para la Venta ",null,10,{"$f":"'[1]Nota 7'!B38","v":0},0]
[null,"Activos Intangibles ",null,11,{"$f":"'Nota 11'!B32","v":2954526483},{"$f":"'[1]Nota 11'!C32","v":3951168574}]
[null,"Goodwill ",null,12,{"$f":"'[1]Nota 12'!B11","v":0},{"$f":"'[1]Nota 12'!C11","v":0}]
[null,"Inversiones Inmobiliarias ",null,10,{"$f":"'Nota 10'!B29","v":42744778105},{"$f":"'Nota 10'!C29","v":39901934764}]
[null,"Total activos no corrientes",null,null,{"$f":"SUM(E19:E27)","v":423425398435},{"$f":"SUM(F19:F27)","v":411053229109}]
[]
["TOTAL ACTIVOS ",null,null,null,{"$f":"+E16+E28","v":1287908190900},{"$f":"+F16+F28","v":1170008402325.02}]
["PASIVOS Y PATRIMONIO NETO"]
[]
["Pasivo Corrientes ",null,null,null,-1]
[null,"Cuentas a Pagar - Comerciales ",null,13,{"$f":"'Nota 13'!B39","v":20920950186},{"$f":"+'Nota 13'!C39","v":38694553008}]
[null,"Prestamos a corto plazo",null,14,{"$f":"'Nota 14'!E26","v":219287827301},{"$f":"'[1]Nota 14'!K26","v":121455939859}]
[null,"Remuneraciones y cargas sociales a pagar",null,16,{"$f":"'Nota 16'!B20","v":1637379651},{"$f":"+'[1]Nota 16'!C13+'[1]Nota 16'!C17","v":2054589083}]
[null,"Impuestos a Pagar",null,17,{"$f":"'Nota 17'!B15","v":4859243763},{"$f":"'[1]Nota 17'!C12","v":1507992706}]
[null,"Provisiones ",null,18,{"$f":"'Nota 18'!B34+'Nota 18'!B48","v":18425072788},{"$f":"18182378518+'[1]Nota 18'!C47","v":18456446493}]
[null,"Otros pasivos corrientes",null,19,{"$f":"'Nota 19'!B24","v":2892631157},{"$f":"+'Nota 19'!C24","v":10273890797}]
[null,"Total Pasivos Corrientes",null,null,{"$f":"SUM(E33:E39)","v":268023104845},{"$f":"SUM(F34:F39)","v":192443411946}]
[]
["Pasivos no corrientes"]
[null,"Préstamos a largo plazo ",null,null,0,0]
[null,"Otros pasivos  no corrientes",null,null,0,0]
[null,"Total pasivos no corrientes",null,null,0,0]
[]
["TOTAL PASIVOS",null,null,null,{"$f":"+E40+E45","v":268023104845},{"$f":"+F40+F45","v":192443411946}]
["PATRIMONIO NETO"]
[null,"Capital integrado",null,20,{"$f":"'[1]Nota 20'!B6","v":643227002000},{"$f":"'[1]Nota 20'!C6","v":643227002000}]
[null,"Reserva de revalúo",null,21,{"$f":"'[1] Nota 21'!B9","v":178972541980},{"$f":"'[1] Nota 21'!C9","v":178972541980}]
[null,"Reserva legal",null,21,{"$f":"' Nota 21'!B15","v":50198695192},{"$f":"'[1] Nota 21'!C14+'[1] Nota 21'!C13","v":46478390374}]
[null,"Reservas de Capitalización",null,21,{"$f":"+' Nota 21'!B31+' Nota 21'!B37+1","v":80073295210},{"$f":"+'[1] Nota 21'!C30+'[1] Nota 21'!C37","v":34480959662}]
[null,"Reservas facultatitvas",null,21,{"$f":"'[1] Nota 21'!B22","v":0},{"$f":"'[1] Nota 21'!C22","v":0}]
[null,"Diferencia transitoria por conversión",null,22,{"$f":"'[1]Nota 22'!B7","v":0},{"$f":"'[1]Nota 22'!C7","v":0}]
[null,"Resultados acumulados",null,23,0,0]
[null,"Resultados del ejercicio",null,23,{"$f":"'Nota 23'!B9","v":67413551673},{"$f":"'[1]Nota 23'!C8","v":74406096363}]
[null,"Subtotal",null,null,{"$f":"SUM(E49:E56)","v":1019885086055},{"$f":"SUM(F49:F56)","v":977564990379}]
[null,"Interés minoritario",null,24,0,{"$f":"'[1]Nota 24'!C7","v":0}]
["TOTAL PATRIMONIO NETO ",null,null,null,{"$f":"E57","v":1019885086055},{"$f":"F57","v":977564990379}]
["TOTAL PASIVO Y PATRIMONIO NETO",null,null,null,{"$f":"+E47+E59","v":1287908190900},{"$f":"F47+F59","v":1170008402325}]
[]
["Las notas que se acompañan forman parte integrante de estos estados."]

{"sheet":"EVPN","index":3,"n_rows":39,"n_cols":24,"rows_kept":39,"cut":false,"hidden":false,"merged":[[10,20,11,20],[10,22,11,22],[10,2,11,2],[10,0,11,0],[5,0,5,17],[6,0,6,17],[9,2,9,6],[9,12,9,19],[10,4,11,4],[10,6,11,6],[10,8,11,8],[10,10,11,10],[10,12,11,12],[10,14,11,14],[10,17,11,17],[10,19,11,19]]}
[{"$f":"[2]Indice!C1","v":"NICOLAS GONZALEZ ODDONE S.A.E.C.A"},null,null,null,null,null,null,null,"Indice"]
[]
[]
[null,null,null,null,null,null,"ESTADO DE EVOLUCIÓN DEL PATRIMONIO NETO"]
[null,null,null,null,null,null,"                AL 30 DE SETIEMBRE DE 2020"]
["Comparativo con igual periodo del año anterior"]
["(En miles de guaraníes)"]
[]
[]
[null,null,"Aporte de los propietarios",null,null,null,null,null,null,null,null,null,"Ganancias reservadas"]
[null,null,"Capital suscripto e integrado",null,"Acciones en Tesoreria",null,"Primas de emisión",null,"Reserva de revalúo",null,"Reserva de revalúo técnico",null,"Reserva legal",null,"Reserva P/ Capitalizacion",null,null,"Resultados acumulados",null,"Resultado del Ejercicio","Interes Minoritario",null,"Total"]
[null,null,null,null,null,null,null,null,null,null,null,null,null,null,null,null,null,"Total",null,"Total"]
[]
["Saldo al 31 de Diciembre 2018",null,270000000000,null,-144200000,null,{"$f":"8329302000-47385000","v":8281917000},null,{"$f":"52949779497+29131439763+379404818+150970387","v":82611594465},null,87405000939,null,43132145220,null,365041931517,null,null,0,null,56789988725,0,null,{"$f":"+C14+E14+G14+I14+K14+M14+O14+R14+U14+T14","v":913118377866},{"$f":"913118377866-W14","v":0}]
["Cambio en política contable"]
["Saldo reestructurado",null,270000000000,null,{"$f":"+E14","v":-144200000},null,{"$f":"+G14","v":8281917000},null,{"$f":"+I14","v":82611594465},null,{"$f":"+K14","v":87405000939},null,{"$f":"+M14","v":43132145220},null,{"$f":"+O14","v":365041931517},null,null,{"$f":"+R14","v":0},null,{"$f":"+T14","v":56789988725},{"$f":"+U14","v":0},null,{"$f":"+C16+E16+G16+I16+K16+M16+O16+R16+U16+T16","v":913118377866}]
["Distribución de dividendos s/Acta de Asamblea Ordinaria N° 90 de fecha 23/04/2019",null,0,null,0,null,0,null,0,null,0,null,2839499436,0,34528313145,null,null,{"$f":"-M17-O17","v":-37367812581},null,0,null,null,{"$f":"SUM(C17:T17)","v":0}]
["Dividendos pagados",null,0,null,0,null,0,null,0,null,0,null,0,null,0,null,null,-19422176144,null,0,null,null,{"$f":"SUM(C18:T18)","v":-19422176144}]
["Transferencia a Resultados Acumulados",null,0,null,0,null,0,null,0,null,0,null,0,null,0,null,null,56789988725,null,{"$f":"-R19","v":-56789988725},null,null,{"$f":"SUM(C19:T19)","v":0}]
["Integración del capital social",null,30000000000,null,0,null,0,null,0,null,0,null,0,null,{"$f":"-C20","v":-30000000000},null,null,0,null,0,null,null,0]
["Reducción del capital social s/Acta de Asamblea General Ordinaria N°… de fecha……..",null,0,null,0,null,0,null,0,null,0,null,0,0,0,null,null,0,null,0,null,null,0]
["Revalúo de activos fijos",null,0,null,0,null,0,null,4848139985,null,0,null,0,null,0,null,null,0,null,0,null,null,4848139985]
["Revalúo técnico",null,0,null,0,null,0,null,0,null,0,null,0,null,0,null,null,0,null,0,null,null,0]
["Resultado del año",null,0,null,0,null,0,null,0,null,0,null,0,null,0,null,null,0,null,52663890125,null,null,52663890125]
[]
["Saldo al 30/09/19",null,{"$f":"C16+C17+C20+C21+C22+C23+C24","v":300000000000},null,{"$f":"E16+E17+E20+E21+E22+E23+E24","v":-144200000},null,{"$f":"G16+G17+G20+G21+G22+G23+G24","v":8281917000},{"$f":"SUM(H14:H25)","v":0},{"$f":"I16+I17+I20+I21+I22+I23+I24","v":87459734450},null,{"$f":"K16+K17+K20+K21+K22+K23+K24","v":87405000939},null,{"$f":"M16+M17+M20+M21+M22+M23+M24","v":45971644656},null,{"$f":"O16+O17+O20+O21+O22+O23+O24","v":369570244662},null,null,{"$f":"SUM(R16:R25)","v":0},null,{"$f":"T16+T17+T20+T21+T22+T23+T24+T19","v":52663890125},{"$f":"U16+U17+U20+U21+U22+U23+U24","v":0},null,{"$f":"+C26+E26+G26+I26+K26+M26+O26+R26+U26+T26","v":951208231832}]
[]
["Saldo al 31 de Diciembre de 2019",null,635041900000,null,-144200000,null,{"$f":"8329302000-47385000","v":8281917000},{"$f":"SUM(H16:H27)","v":0},{"$f":"57008661721+472930672+107394557+33978554091","v":91567541041},null,87405000939,null,{"$f":"45971644656+506745718","v":46478390374},null,34528344662,null,null,0,null,74406096363,{"$f":"U19+U20+U22+U23+U24+U25+U26","v":0},null,{"$f":"+C28+E28+G28+I28+K28+M28+O28+R28+U28+T28","v":977564990379}]
["Transferencia a Resultados Acumulados",null,0,null,0,null,0,null,0,null,0,null,0,null,0,null,null,74406096363,null,{"$f":"-R29","v":-74406096363},null,null,{"$f":"+R29+T29","v":0}]
["Distribución de dividendos s/Acta de Asamblea General Ordinaria N°92 de fecha 30/06/2020",null,null,null,null,null,null,null,null,null,null,null,3720304818,null,45592335547,null,null,{"$f":"-M30-O30","v":-49312640365},null,0,null,null,0]
["Dividendos pagados",null,null,null,null,null,null,null,null,null,null,null,0,null,0,null,null,-25093455998,null,null,null,null,{"$f":"+R31","v":-25093455998}]
["Revalúo de activos fijos",null,0,null,0,null,0,null,0,null,0,null,0,null,0,null,null,0,null,null,null,null,{"$f":"+R32","v":0}]
["Desafectación de la reserva de revalúo técnico"]
[]
["Resultado del año",null,null,null,null,null,null,null,null,null,null,null,null,null,null,null,null,null,null,67413551673,null,null,{"$f":"+T35","v":67413551673}]
[]
["Saldo al 30/09/2020",null,{"$f":"C28+C30+C32+C33+C35","v":635041900000},{"$f":"SUM(D26:D35)","v":0},{"$f":"E28+E30+E32+E33+E35","v":-144200000},null,{"$f":"G28+G30+G32+G33+G35","v":8281917000},null,{"$f":"I28+I30+I32+I33+I35","v":91567541041},null,{"$f":"K28+K30+K32+K33+K35","v":87405000939},null,{"$f":"M28+M30+M32+M33+M35","v":50198695192},null,{"$f":"O28+O30+O32+O33+O35","v":80120680209},null,null,{"$f":"SUM(R28:R33)","v":0},null,{"$f":"T28+T29:T30+T32+T33+T35","v":67413551673},{"$f":"U26+U30+U32+U33+U35","v":0},null,{"$f":"SUM(W28:W35)","v":1019885086054}]
[null,null,null,null,null,null,null,null,null,null,null,null,null,null,null,null,null,null,null,141819648036]
["Las notas que se acompañan forman parte integrante de estos estados."]

{"sheet":"ER","index":4,"n_rows":40,"n_cols":4,"rows_kept":40,"cut":false,"hidden":false,"merged":[[2,0,2,6],[3,0,3,6],[51,2,51,3],[45,2,45,3],[4,0,4,6]]}
[null,"Indice"]
[]
["ESTADO DE RESULTADOS"]
["AL 30 DE SETIEMBRE DE 2020 COMPARATIVO CON CIFRAS AL 30 DE SETIEMBRE DE 2019"]
["(En miles de guaraníes)"]
[]
[null,"Nota","2020-09-30","2019-09-30"]
["Ventas Actividad Comercial ",25,{"$f":"'Nota 25'!B13","v":444197202858},{"$f":"'Nota 25'!C13","v":428703135515}]
["Ventas Actividad Ganadera ",25,{"$f":"'Nota 25'!B19","v":3108940205},{"$f":"'Nota 25'!C19","v":7397614694}]
["Costo de ventas",26,{"$f":"-'Nota 26'!B18","v":-316630983086},{"$f":"-'Nota 26'!C18","v":-304381374360}]
["Utilidad bruta",null,{"$f":"SUM(C8:C10)","v":130675159977},{"$f":"SUM(D8:D10)","v":131719375849}]
[]
["Gastos de ventas",27,{"$f":"-'Nota 27'!B35","v":-50636005435},{"$f":"-'Nota 27'!E35","v":-58515433234}]
["Gastos administrativos ",27,{"$f":"+-'Nota 27'!C35","v":-26204255261},{"$f":"-'Nota 27'!F35","v":-24211613715}]
["Otros ingresos operativos ",28,{"$f":"'Nota 28'!B44","v":14351590896},{"$f":"'Nota 28'!C44","v":12425872636}]
["Otros  gastos operativos ",28,{"$f":"'Nota 28'!F18","v":-6844037835},{"$f":"'Nota 28'!G18","v":-7900776838}]
["Resultado operativo",null,{"$f":"SUM(C13:C16)","v":-69332707635},{"$f":"SUM(D13:D16)","v":-78201951151}]
[]
["Ingresos financieros - neto",29,{"$f":"'Nota 29'!B15","v":24955270346},{"$f":"'Nota 29'!C15","v":22164680358}]
["Gastos financieros -  neto",29,{"$f":"'Nota 29'!F15","v":-12745833019},{"$f":"'Nota 29'!G15","v":-17371904259}]
["Subtotal",null,{"$f":"SUM(C19:C20)","v":12209437327},{"$f":"SUM(D19:D20)","v":4792776099}]
[]
["Resultados No Operativos ","28.1",{"$f":"+'Nota 28'!B74","v":452644312},{"$f":"+'Nota 28'!C74","v":165171512}]
["Ingresos de Inversiones Financieras ",29.1,{"$f":"'Nota 29'!B28","v":1863181585},{"$f":"'Nota 29'!C28","v":1329102812}]
["Gastos de Inversiones Financieras",29.1,{"$f":"'Nota 29'!F31","v":-189203339},{"$f":"'Nota 29'!G31","v":-70992581}]
[]
["Resultados ordinarios antes de impuesto a la renta",null,{"$f":"+C11+C17+C21+C23+C24+C25","v":75678512227},{"$f":"+D11+D17+D21+D23+D24+D25","v":59733482540}]
[]
["Resultado ordinario antes del impuesto a la renta"]
["Impuesto a la renta",32,-8264960554,{"$f":"-'Nota 32'!C9","v":-7069592415}]
[]
["Resultado neto de actividades ordinarias",null,{"$f":"+C27+C30","v":67413551673},{"$f":"+D27+D30","v":52663890125}]
["Resultado extraordinario neto de impuesto a la renta",33,0,0]
["Resultado sobre actividades discontinuadas neto de impuesto a la renta",34,{"$f":"'Nota 34'!B11","v":0},{"$f":"'Nota 34'!C11","v":0}]
[null,null,null,0]
["Utilidad/(Pérdida) neta del año ",null,{"$f":"C32+C33+C34","v":67413551673},{"$f":"D32+D33+D34","v":52663890125}]
["Utilidad neta por acción ordinaria",35,{"$f":"C36/'Nota 35'!B9","v":10618.019610248959},{"$f":"D36/'Nota 35'!C9","v":17563.072024953326}]
[]
[]
["Las notas que se acompañan forman parte integrante de estos estados."]

{"sheet":"EFE","index":5,"n_rows":45,"n_cols":3,"rows_kept":45,"cut":false,"hidden":false,"merged":[[10,0,10,2],[2,0,2,2],[4,0,4,2],[5,0,5,2],[6,0,6,2],[7,0,7,2]]}
[{"$f":"Indice!C1","v":"NICOLAS GONZALEZ ODDONE S.A.E.C.A"}]
[]
[]
[]
["ESTADO DE FLUJOS DE EFECTIVO"]
["Por los periodos comprendidos entre el 01 de enero al 30 de setiembre de 2020"]
["Comparativo con igual periodo del año anterior"]
[]
[]
[null,"2020-09-30","2019-09-30"]
["En miles de guaraníes"]
[]
["FLUJO DE EFECTIVO DE ACTIVIDADES OPERATIVAS"]
["Cobranzas efectuadas a clientes",418292915379,467934450327]
["Pagos efectuados a proveedores y empleados",-257971154585,-209997223546]
["Intereses pagados"]
["Efectivo generado por las operaciones ",-23198896932,-23487623489]
["Intereses pagados",0,0]
["Otros ingresos y (egresos) - neto",-9798323094,-47166786745]
["Pagos de impuesto a la renta",-6330933473,-9552819676]
["Flujo neto de efectivo de actividades operativas",{"$f":"SUM(B14:B20)","v":120993607295},{"$f":"SUM(C14:C20)","v":177729996871}]
[]
["FLUJO DE EFECTIVO DE ACTIVIDADES DE INVERSIÓN "]
["Adquisicion de bienes de uso ",-24745926511,-12015959622]
["Venta de bienes de uso ",0,0]
["Intereses cobrados sobre inversiones",1343301480,0]
["Adquisición de bienes Curtiembre - fideicomitida"]
["Ventas de activos fijos",0,0]
["Aquisición de inversiones",-126284069590,-93277689779]
["Inversiones mobiliarias Permanentes ",0,-11702000000]
[]
["Flujo neto de efectivo de actividades de inversión",{"$f":"+B24+B26+B29","v":-149686694621},{"$f":"SUM(C24:C31)","v":-116995649401}]
[]
[]
["FLUJO DE EFECTIVO DE ACTIVIDADES DE FINANCIACIÓN"]
["(Disminución) Incremento de préstamos",25540306849,-8032898845]
["Aportes de capital recibidos","                                    -   ","                                          -   "]
["Dividendos pagados",-25093455998,-19422176144]
["Intereses Pagados sobre préstamos ",-1265515657,-2235124739]
["Flujo neto de efectivo de actividades de financiamiento",{"$f":"SUM(B36:B39)","v":-818664806},{"$f":"SUM(C36:C39)","v":-29690199728}]
[]
["(Disminución) incremento neto de efectivo ",{"$f":"+B40+B32+B21","v":-29511752132},{"$f":"+C21+C32+C40","v":31044147742}]
["Efecto estimado de la diferencia de cambio sobre el saldo de efectivo ",9741090595,4570908189]
["Efectivo al principio del año ",97761526232,48023427196]
["Efectivo al final del periodo",{"$f":"SUM(B42:B44)","v":77990864695},{"$f":"SUM(C42:C44)","v":83638483127}]

{"sheet":"Nota1","index":6,"n_rows":115,"n_cols":2,"rows_kept":115,"cut":false,"hidden":false,"merged":[[0,10,0,12]]}
[null,"NOTAS A LOS ESTADOS FINANCIEROS POR EL PERIODO FINALIZADO EL 30 DE SETIEMBRE DE 2020"]
[null,"Balance General:  Correspondiente al periódo finalizado el 30 de setiembre de 2020, presentado en forma comparativa con el ejercicio finalizado el 31 de diciembre de 2019"]
[null,"Estado de Resultados: Correspondiente al periódo finalizado el 30 de setiembre de 2020, presentado en forma comparativa con el periódo finalizado el 30 de septiembre de 2019."]
[]
[]
[null,"NOTA 1 – DESCRIPCIÓN DE LA NATURALEZA Y DEL NEGOCIO DE LA COMPAÑÍA"]
[]
[null,"Denominación: NICOLAS GONZALEZ ODDONE S.A.E.C.A"]
[]
[null,"La sociedad fue constituida por escritura de fecha 25 de marzo de 1964, autorizada por el Escribano Público Gervasio Recalde, habiéndose aprobado"]
[null,"los mencionados estatutos y reconocida la personería jurídica de la sociedad por decretodel poder ejecutivo de la nacion Nº 4.180 de fecha 16 de abril "]
[null,"de 1964, e inscriptos en el registro público de comercio por mandato del señor Juez de primera instancia en lo comercial del segundoturno, Dr. Arnaldo Rojas "]
[null,"Rojas Sánchez, bajo el Nº 106 y en la página26 y sgtes., según providencia de fecha 03 de junio del mismo año."]
[null,"Los Estatutos originales sufrieron las siguientes modificaciones:"]
[null,"1º) Por Escritura N°º 77 de fecha 5 de abril de 1976, aprobadas las modificaciones y aumento de capital social a G. 100.000.000 (guaranies cien millones) por "]
[null,"Decreto N° 23039 del 31 de mayo de 1976, e inscriptas en el registro publico de comercio, bajo el N°. 442 y en la pagina 202 en fecha 22 de junio del mismo año;                                                                                                                                                                                                                         "]
[null,"2°)  Por Escritura del 7 de mayo de 1979, aprobadas las modificaciones y aumento de capital social a G. 300.000.000 (guaranies trescientos millones) por decreto "]
[null,"N° 8.425 del 20 de julio de 1979, e inscriptas bajo el N° 999 y en la pagina 145 y sgtes., según providencia del mismo año;   "]
[null,"3°) Por escritura N° 120 del 30 de abril de 1986, aprobadas las modificaciones y aumento de capital social a G 800.000.000 (guaranies ochocientos millones) por "]
[null,"decreto N°. 18459 del 17 de noviembre de 1986, inscripta en el registro publico de comercio, bajo el N°. 1106 y en la pagina 32 vlto., en fecha 3 de diciembre del "]
[null,"mismo año; "]
[null,"4°) por escritura N°. 219 del 6 de noviembre de 1989, aprobada la modificación por aumento de capital a G 3.000.000.000 (guaranies tres mil millones) y "]
[null,"adecuacion al codigo civil, escritura en donde constan los estatutos actualizados de la sociedad, que fueron inscriptos en el registro publico de comercio, bajo el N°. "]
[null,"1423 y al folio 6856 y sgtes., seccion contratos, serie “b”, según providencia del 23 de noviembre de 1989;  "]
[null,"5°) Por escritura N° 84 del 7 de mayo de 1991, con el aumento del capital a G 5.000.000.000 (guaranies cinco mil millones), inscripta en el registro publico de "]
[null,"comercio, según providencia del 22 de mayo de 1991, anotado bajo el N°. 110, folio 520 y sgtes., serie “a”, seccion contratos.,"]
[null,"6°) Por escritura N°. 107 de fecha 28 de diciembre de 1995, pasada ante el escribano Raul A Casabianca, fueron modificados los estatutos sociales para "]
[null,"adecuarlos a la ley del mercado de valores y en consecuencia la transformación de la firma en “SOCIEDAD EMISORA DE CAPITAL ABIERTO” y acogerse a los "]
[null,"beneficios de la  Ley N°. 548/95 y aumento de capital social a la suma de G 30.000.000.000 (treinta mil millones de guaranies); tomándose razon en la dirección "]
[null,"general de los registros publicos, registro de personas jurídicas y asociaciones,  según A I. N° 309 de fecha 1 de abril de 1996, anotado bajo el n° 197 folio 2558 "]
[null,"y sgtes., serie “a” de fecha dos de abril de 1996 y registro publico de comercio, anotado bajo el n° 186, serie “a” folio 2730 y sgtes., seccion contratos, en fecha "]
[null,"11 de abril de 1996 y escritura complementaria N° 109 de fecha 29 de diciembre de 1995,  bajo el n° 198 folio 2580 y sgtes., serie “a” de fecha 2 de abril de 1996 y"]
[null,"registro publico de comercio anotado bajo el N° 187 serie “a” folio 2751 y sgtes. seccion contratos, en fecha 11 de abril de 1996;  "]
[null,"7°) Escritura N° 21 de fecha 8 de mayo del año 1996, fue protocolizado el Acta N° 49 de fecha 12 de abril del año 1996 de Asamblea General Extraordinaria, "]
[null,"aumento de capital a la suma de G 50.000.000.000 (guaranies cincuenta mil millones) inscripto en la Dirección General de los Registros Publicos, Registro de "]
[null,"Personas Jurídicas y Asociaciones, según A. I. N° 705 de fecha 4 de julio de 1996, anotado bajo el n° 365 serie “A” al folio 4756 y sgtes. en fecha 5 de julio de 1996 y"]
[null,"registro publico de comercio anotado bajo el N° 716 serie “d” al folio 6104 y sgtes. seccion contratos en fecha 9 de julio de 1996;   "]
[null,"8°)  Escritura N° 23 de fecha 10 de marzo del año 1999, fue protocolizado el Acta N° 54 de fecha 22 de febrero del año 1999 de Asamblea General Extraordinaria de"]
[null,"modificación de los arts.1° y 6°  del contrato de constitución social, según providencia de fecha 19 de mayo de 1999, A. I. N° 797, anotado bajo el N° 491 serie “a” "]
[null,"al folio 3966 y sgtes. seccion contratos y registro de personas jurídicas y asociaciones bajo el N° 102 serie “C” al folio 1357 y sgtes. en fecha 25 de mayo de 1999."]
[null,"9°) Escritura N°  78 de fecha  31 de diciembre de 2001, fue protocolizado el Acta N°. 57 de Asamblea General Extraordinaria de fecha 7 de diciembre de 2001 de "]
[null,"emisión de titulos de deudas, emisión de acciones, aumento de capital a la suma de G 70.000.000.000  (guaranies setenta mil millones) y prorroga de duración, "]
[null,"inscripto en la dirección general de los registros publicos, registro publico de comercio, A. I.  N° 347 providencia de fecha 19 de marzo de 2002, bajo el N° 149 serie"]
[null," “B” folios 1016 y sgtes. en fecha 22 de marzo de 2002 seccion contratos y registro de personas jurídicas y asociaciones bajo el n° 82 serie “G”  folios 947 y sgtes"]
[null,"en fecha 1 de abril de 2002; "]
[null,"10°) Escritura N° 5 de fecha 2 de mayo de 2003, fue protocolizado el Acta N°. 61 de fecha 31 de marzo de 2003 de Asamblea General Extraordinaria referente a la "]
[null,"a la emisión de acciones y aumento de capital a la suma de G 100.000.000.000 (guaranies cien mil millones) modificándose los articulos 5º y 33º del contrato social, "]
[null,"inscripta en la direccion general de los registros publicos, registro de personas jurídicas y asociaciones, según A. I. N° 1218 de fecha 17 de julio de 2003, bajo el N° 426, "]
[null,"folio 5780, serie “F” y en el registro de contratos del registro publico de comercio bajo el N° 587, serie “b”, folios 7162 y sgtes. en fecha 30 de julio de 2003."]
[null,"11º) Escritura Nº  17 de fecha 8 de mayo de 2006, fue protocolizado el Acta N°. 66 de fecha 7 de abril de 2006 de Asamblea General Extraordinaria, referante a la emisión "]
[null,"de acciones y aumento de capital social a la suma de G 150.000.000.000.-(guaranies ciento cincuenta mil millones) modificándose los articulos 5º y 33º de los estatutos"]
[null,"sociales, inscripta en la dirección general de los registros publicos, registro publico de comercio, según A. I. N° 1216 de fecha 10 de julio de 2006, bajo el nº 847  serie e, "]
[null,"folios 8330 y sgtes. de la seccion contratos y en la seccion personas jurídicas y asociaciones bajo el nº 547, serie “b”, folios 5844 y sgtes. "]
[null,"en fecha 25 de julio de 2006.  "]
[null,"12º) Escritura Nº 8 de fecha 5 de mayo de 2008, fueron protocolizadas las actas, Nº  68 de fecha 14 de abril de 2008 de Asamblea Extraordinaria, referente al aumento del "]
[null,"capital social a la suma de doscientos mil millones de guaranies ( G. 200.000.000.000 ), por la que se modifican los articulos 5º y 33º de los estatutos sociales y  la Nº 69 "]
[null,"de Asamblea General Ordinaria, por la que se emiten acciones, inscripta en la direccion general de los registros  publicos, registro publico de comercio, dictamen nº 1985, "]
[null,"según providencia de fecha 3 de junio de 2008, bajo el nº 194, serie “c”, folio 1818 de la seccion contratos y en la seccion personas juridicas y asociaciones bajo el  "]
[null,"nº 589 y al folio 6814, el 6 de junio de 2008; "]
[null,"13º) Escritura Nº 7 de fecha 16 de abril de 2010, fue protocolizada el Acta Nº 72 de fecha 31 de marzo de 2010 de Asamblea General Extraordinaria, referente a la emision de"]
[null,"de acciones y aumento del capital social a la suma de doscientos cincuenta mil millones de guaranies (G250.000.000.000), modificandose los articulos 5º y 33º del estatuto "]
[null,"social, inscripta en  la Direccion General de los Registros Publicos, Registro Publico de Comercio, dictamen Nº 1772 de fecha 3 de mayo de 2010, bajo el Nº 192, serie “g”, "]
[null,"folio 2021, de la seccion contratos, el 10 de mayo de 2010 y en la seccion  personas juridicas y asociaciones bajo el nº 99 y al folio 988, serie “e” , el 10 de mayo de 2010;  "]
[null,"14º) Escritura Nº 12 de fecha 3 de junio de 2013, fue protocolizada el Acta Nº 79 de fecha  24 de mayo de 2013 de Asamblea General Extraordinaria, referente a la emision de"]
[null," acciones y  aumento del capital social a la suma de doscientos setenta mil millones de guaranies (G 270.000.000.000.), modificandose los articulos 5º y 33º del estatuto "]
[null,"social, inscripta en  la direccion general de los registros publicos, registro publico de comercio, bajo el Nº 140, serie “h”, folio 1479 y sgtes., de la seccion contratos, el 18 de "]
[null,"junio de 2013 y en la seccion personas juridicas y asociaciones bajo el nº 538 y al folio 6508, serie “d” , el 18 de junio de 2013;                                                                                                                                    "]
[null,"15º) Escritura Nº 3 de fecha 12 de mayo de 2016, fue protocolizada el Acta Nº 84 de fecha 11 de abril de 2016 de Asamblea General Extraordinaria, referente al  aumento"]
[null," del capital social a la suma de trescientos mil millones de guaranies (G 300.000.000.000.), modificandose los articulos 5º y 33º del estatuto social, inscripta en  la direccion "]
[null,"general de los registros publicos, seccion personas juridicas y asociaciones matricula juridica Nº 5293 y en la seccion comercio matricula comercial Nº 5585 de fecha 7 "]
[null,"de julio de 2016."]
[null,"16°)  Escritura Nº 13 de fecha 22 de octubre de 2018, fue protocolizada el Acta Nº 88 de fecha 05 de octubre de 2018 de Asamblea Extraordinaria, referente al  aumento del"]
[null,"capital social a la suma de ochocientos mil millones de guaranies (G 800.000.000.000.), modificandose los articulos 5º y 33º del estatuto social, inscripta en  la direccion "]
[null,"general de los registros publicos, seccion personas juridicas y asociaciones matricula juridica Nº 5293 de fecha 20 de marzo de 2019 y en la seccion comercio, matricula "]
[null,"comercial Nº 5585 de fecha 16 julio de 2019;                                                                   "]
[null,"17°) Escritura Nº 1, fecha 21 de enero 2020, fue protocolizada el Acta Nº 91 de fecha 11 de diciembre de 2019 de Asamblea Extraordinaria, Desmaterialización "]
[null,"de acciones, modificandose los articulos 4°, 5º, 6°, 7° y 23º del estatuto social, inscripta en  la direccion general de los registros publicos, seccion personas juridicas y "]
[null,"asociaciones matricula juridica Nº 5293 de fecha 26 de febrero de 2020 y en la seccion comercio, matricula comercial Nº 5585 de fecha 26 de febrero de 2020. "]
[]
[null,"La Sociedad tiene por objeto:"]
[]
[null,"a)         Importar y exportar toda clase de mercaderías, por cuenta propia o de terceros y/o asociada a terceros: comprar y vender bienes muebles o inmuebles y constituir derechos reales sobre ellos."]
[]
[null,"b)         Ejercer representaciones, comisiones, mandatos o consignaciones."]
[]
[null,"c)         Elaborar o industrializar todo género de productos o materias primas nacionales o extranjeras."]
[]
[null,"d)        Dar o tomar participación en cualquier sociedad, dentro o fuera del país que se realice con los objetos que se han indicado."]
[]
[null,"e)         Promover la radicación de capitales, empresas e industrias en la República del Paraguay."]
[]
[null,"f)          Explotar empresas de transportes y practicar, en fin, todo acto de comercio lícito."]
[]
[null,"En el año 1996 la Comisión  Nacional de Valores por medio de la Resolución N° 270/96 autoriza la inscripción definitiva de la Compañía como Sociedad Emisora de Capital Abierto. "]
[]
[]
[null,"A la fecha el Capital Integrado asciende a Gs. 635.041.900.000"]
[null,"Ejercicio Fiscal "]
[]
[null,"Conforme a los Estatutos Sociales y para adecuarse a los requerimientos de la Ley 125/91 y sus reglamentaciones el cierre del ejercicio económico y fiscal será el 31 de diciembre de cada año, por lo tanto los estados contables abarcarán el ejercicio correspondiente entre el 1 de enero al 31 de diciembre de cada año civil."]
[]
[null,"COMPOSICION DEL CAPITAL"]
[]
[null,"A     C     C     I     O     N    E     S"]
[null,"                                                   Nº  DE VOTOS QUE     SUSCRIPTO                  INTEGRADO                                                                                                  "]
[null,"  CANTIDAD       TIPO                    OTORGA C/U.                GS.                            GS.                                                       "]
[null,"  "]
[null,"3.792.183.-   ORDIN/NOMINATIVAS      5                              379.218.300.000.-                  379.219.300.000.-"]
[null,"   1.355.574.-     ORDIN/NOMINATIVAS     4                                135.557.400.000.-                    135.557.400.000.-"]
[null,"1.201.220.-     PREFE./NOMINATIVAS       1 RESTR                    120.122.000.000.-                    120.122.000.000.-"]
[null,"  6.348.977.-                                                                               634.897.700.000.-                        634.897.700.000.-"]
[null,"ACCIONES EN TESORERIA"]
[null,"        1.442.-   PREFER./NOMINATIVAS                                           144.200.000.-                        144.200.000.- "]
[null,"6.350.419.-                                                                                635.041.900.000.-                 635.041.900.000.-"]
[null,"========                                                                                  =============                    ============="]

{"sheet":"Nota 2","index":7,"n_rows":87,"n_cols":8,"rows_kept":87,"cut":false,"hidden":false,"merged":[[7,0,7,8],[58,0,58,8],[58,9,58,10],[87,0,87,8],[104,5,104,13],[61,0,61,8],[75,0,75,8],[68,0,68,8],[63,0,63,8],[64,0,64,8],[65,0,65,8],[69,9,69,10],[63,9,63,10],[64,9,64,10],[61,9,61,10],[85,0,85,8],[56,9,56,10],[57,0,57,8],[57,9,57,10],[56,0,56,8],[49,0,49,8],[50,0,50,8],[86,0,86,8],[42,0,42,8],[53,0,53,8],[54,0,54,8],[43,0,43,8],[44,0,44,8],[45,0,45,8],[46,0,46,8],[47,0,47,8],[73,0,73,8],[62,0,62,8],[72,0,72,8],[12,0,12,8],[13,0,13,8],[32,0,32,8],[35,0,35,8],[39,0,39,8],[14,0,14,8],[36,0,36,8],[40,0,40,8],[59,9,59,10],[60,9,60,10],[2,0,2,8],[41,0,41,8],[11,0,11,8],[10,0,10,8],[5,0,5,8],[6,0,6,8],[37,0,37,8],[38,0,38,8],[4,0,4,8],[8,0,8,8],[15,0,15,8],[33,0,33,8],[24,1,24,9],[72,9,72,10],[67,0,67,8],[65,9,65,10],[59,0,59,8],[60,0,60,8]]}
[{"$f":"Indice!C1","v":"NICOLAS GONZALEZ ODDONE S.A.E.C.A"},null,null,"Indice"]
[]
["NOTA 2 - RESUMEN DE LAS PRINCIPALES POLÍTICAS CONTABLES"]
[]
["a.   Bases de contabilización "]
["Los presentes estados financieros se han preparado siguiendo los criterios de las Normas de Información Financiera (NIF) emitidas por el Consejo de Contadores Públicos del Paraguay sobre la base de costos históricos, excepto para el caso de activos y pasivos en moneda extranjera  y las propiedades, planta y equipo según se explica en los puntos c ) y k), y no reconocen en forma integral los efectos de la inflación sobre la situación patrimonial y financiera de la sociedad, sobre los resultados de sus operaciones y los flujos de efectivo, en atención a que la corrección monetaria no constituye una práctica contable obligatoria en el Paraguay. \n"]
["Según el índice general de precios del consumo (IPC) publicado por el Banco Central del Paraguay, la inflación acumulada del tercer  trimestre fue de 0,5% en el año 2020 y 1,6% en el año 2019.\n\n"]
["Algunas cifras correspondientes al periodo del 2019 fueron reclasificadas en los presentes estados financieros con el fin de hacerlas comparables con las del periodo \nactual y facilitar la comparación. "]
["actual y facilitar la comparación."]
[]
["b.   Uso de estimaciones contables"]
["La preparación de los presentes estados contables requiere que la Gerencia y el Directorio de la sociedad realicen estimaciones y evaluaciones que afectan el monto de los activos y pasivos registrados y contingentes revelados a fecha de cierre de cada balance, así como también los ingresos y egresos registrados en el ejercicio. El Directorio estima que los resultados reales futuros podrían diferir, en forma poco significativa, de las estimaciones y evaluaciones realizadas a la fecha de preparación de los presentes estados contables."]
[]
["c.   Moneda extranjera"]
["Los activos y pasivos en moneda extranjera se valúan a los tipos de cambio vigentes a la fecha de cierre del balance, publicados por la administración tributaria."]
["Las diferencias de cambio originadas por fluctuaciones en los tipos de cambio producidos entre las fechas de concertación de las operaciones y su liquidación o valuación al cierre del balance, son reconocidas en resultados."]
[null,null,"2020-09-30",null,null,null,"2019-12-31"]
[null,"Indicar moneda","Simbología ","Miles de Gs.",null,"Indicar moneda","Simbología","             Miles de Gs."]
["Activos C.","Euros ","€",{"$f":"50402697+86620612","v":137023309},null,"Euros ","€",120951819]
["Activos C.","Dólar Estadounidense  ","$",{"$f":"48508414871-50402697-86620612+170560051546+2988932900+599648016+73768030+170730750+31123710+682189396+424768181+5782864374","v":229685468465},null,"Dólar Estadounidense  ","$",{"$f":"218293350006","v":218293350006}]
["Activos N.C.","Dólar Estadounidense  ","$",{"$f":"220451535","v":220451535},null,"Dólar Estadounidense  ","$",{"$f":"283640229","v":283640229}]
["Pasivos C.","Dólar Estadounidense  ","$",{"$f":"151734402643+20903856980+9036945574+305338299+494456650","v":182475000146},null,"Dólar Estadounidense  ","$",126327026043]
[]
[]
[null,"El detalle de las cotizaciones de la moneda extranjera operada por la sociedad es el siguiente:"]
[]
[null,null,"2020-09-30",null,null,null,"2019-12-31"]
[null,"Indicar moneda","Simbología ","Cotización  Gs.",null,"Indicar moneda","Simbología ","Cotización Gs."]
["Activos ","Euros ","€",8176,null,"Euros ","€",7217]
["Activos ","Dólar Estadounidense  ","$",6979,null,"Dólar Estadounidense  ","$",6442]
["Pasivos ","Dólar Estadounidense  ","$",6990,null,"Dólar Estadounidense  ","$",6464]
[]
["d.   Efectivo y equivalentes de efectivo"]
["Los saldos de este rubro al 30 de setiembre de 2020 y 31 de diciembre de 2019, están compuestos por fondos de libre disponibilidad en poder de la Sociedad y en Bancos de plaza, en las modalidades de cuentas corrientes y cajas de ahorros en guaraníes y en moneda extranjera."]
[]
["e.   Inversiones"]
["Las inversiones temporales se valúan de acuerdo a los siguientes criterios de valuación:\n* Colocaciones financieras en moneda extranjera: a su valor de cotización al cierre del año/período . Ver Nota 4\n*  Las inversiones no corrientes en sociedades donde no se ejerce el control, se valúan al valor patrimonial proporcional. Ver Nota 8\n"]
["Obs.: En caso de la existencia de saldos y transacciones con partes relacionadas, la información que corresponda a ser expuesta por la sociedad, se ajustará  a lo requerido por la Norma de Información Financiera N° 7 Revelaciones de partes relacionadas."]
[]
["f. Previsión para cuentas de dudoso cobro/incobrables"]
["La Sociedad constituye previsiones sobre las cuentas de dudoso cobro o de difícil recuperabilidad, teniendo en cuenta el análisis de la Gerencia sobre   la antigüedad y cobrabilidad de cada uno de los créditos.  Las cuentas a cobrar en Gestión de Cobro Judicial y las que se encuentran en Convocatoria de Acreedores y/o Quiebra, han sido provisionadas en su totalidad.   "]
["Criterio para Previsiones                                                                                                                                                  "]
["1. Clientes que registran atrasos y estan por ser demandados. "]
["2. Clientes que tienen cuentas con otros proveedores y no estan pudiendo pagar."]
["3. Clientes con cheque devueltos."]
["4. Clientes que presentan atrasos normales."]
["5. Clientes sobregirados de acuerdo al límite de créditos establecido por el comité correspondiente."]
["6. Clientes que refinancian sus cuentas. "]
[]
["g. Inventarios"]
["Las existencias están valuadas al costo de adquisición más todos los gastos necesarios hasta la puesta en depósitos de la Compañía. La salida de las existencias es registrada utilizando el sistema de precio promedio ponderado. La Sociedad efectúa previsiones por obsolescencia de acuerdo al análisis de la Gerencia sobre la desvalorización y/o obsolescencia de los mismos.\n\nA partir del ejercicio 2008, la Compañía utiliza el Criterio del Valor Neto de Realización para valuar su hacienda vacuna. Ver Nota 7\n"]
["A partir del ejercicio 2008, la compañía utiliza el criterio del valor neto de realización para valuar su hacienda vacuna. Ver Nota 7"]
[]
["h. Activos disponibles para la venta"]
["Los activos disponibles para la venta representan bienes que fueron desafectados de la actividad productiva y se mantienen con el único objetivo de ser vendidos.  Los mismos se valúan, sin amortizar, al menor entre el valor de mercado de los mismos y su costo (valor libro) al momento de su designación como disponibles para la venta."]
[]
["i. Previsiones para desvalorización y deterioro de inventarios"]
["Las previsiones para desvalorización y deterioro de inventarios han sido estimadas tomando como base la valorización del stock deteriorado existente al cierre del ejercicio."]
[]
["j. Propiedades, planta y equipo"]
["Las propiedades, planta y equipo se exponen a su costo histórico ajustado por el % del valor residual  emitido por la Autoridad Tributaria, menos la correspondiente depreciación acumulada. El incremento neto por la re-expresión se acredita a la respectiva reserva patrimonial, cuyo saldo puede ser utilizado únicamente para  aumentar el capital."]
["El costo de las mejoras que extienden la vida útil de los bienes o aumentan su capacidad productiva es imputado a las cuentas respectivas del activo. Los gastos de mantenimiento son cargados a resultados."]
["La depreciación es calculada por el método de línea recta, conforme a la vida útil definida por la administración tributaria. "]
[]
["k. Intangibles"]
["Los intangibles se exponen a su costo incurrido menos las correspondientes amortizaciones acumuladas al cierre del año, y son reconocidas en los resultados."]
[]
["l. Reconocimiento de ingresos y egresos"]
["Los estados contables se preparan sobre la base de lo devengado. Bajo tal base los efectos de las transacciones y otros eventos son reconocidos cuando ocurren (y no cuando el efectivo o su equivalente es recibido o pagado) y son registrados en los libros contables y presentados en los estados financieros en los períodos a que se refieren. \n"]
[]
[]
[]
["m. Impuesto a la renta"]
["El Impuesto a la Rental, es calculado en base al resultado contable, ajustado por las partidas que la ley tributaria incluye o excluye para la actividad grabable, a esta cifra final se aplica la tasa del 10% en concepto de Impuesto a la renta empresarial 6380 de modernización del sistema tributario nacional. \n\n"]
[]
["n. Restricciones a la distribución de utilidades"]
["No existen restricciones a la distribución de utilidades mas que lo sigueinte: "]
["•\t La legislación paraguaya establece una transferencia del 5% de las utilidades del ejercicio para la constitución de una reserva legal hasta completar el 20% del "]
["capital integrado."]
["• \tDe acuerdo a la ley Nº 6380/19 que deroga los libros I, III y IV de la Ley N° 125/91, la cual dispone aplicar dentro del primer año de vigencia una tasa única y"]
["extraordinaria de retención equivalente al 5% de Impuesto a los dividendos (IDU) sobre los importes netos de las utilidades a ser distribuidas. Además, de una retención "]
["equivalente al 5% de Impuesto a los dividendos (IDU) sobre los importes netos de las utilidades a ser distribuidas. Además, de una retención sujeta a una tasa equivalente al 10% "]
["para las utilidades que sean remesadas o acreditadas a beneficiarios radicados en el exterior. "]
[]
[]
["o. Acciones de tesoreria"]
["Al 30 de setiembre de 2020, el saldo de Acciones en Tesorería es de 1.442 acciones. El valor nominal de dichas acciones es de G. 100.000.- cada una. El tratamiento contable que corresponde es el de las acciones propias en cartera, por lo que se las registró por su valor nominal en una cuenta denominada Acciones en Tesorería, y por la diferencia de valor entre el valor pagado y el valor nominal se debitó a otra cuenta denominada Prima de Recompra de Acciones, actuando ambas cuentas como Reguladoras del Patrimonio Neto."]

{"sheet":"Nota 3","index":8,"n_rows":20,"n_cols":4,"rows_kept":20,"cut":false,"hidden":false,"merged":[]}
[{"$f":"[1]Indice!C1","v":"NICOLAS GONZALEZ ODDONE S.A.E.C.A"},null,null,"BG"]
[]
["NOTA 3 - EFECTIVO Y EQUIVALENTE DE EFECTIVO"]
["En miles de guaranies"]
[]
["La composición de la cuenta es la siguiente:"]
[]
["Cuentas ",null,"2020-09-30","2019-12-31"]
[]
["Recaudaciones a Depositar",null,2717405259,5361218035]
["Fondo Fijo",null,{"$f":"13500000+10000000+24500000+12000000+25000000+10000000+3000000","v":98000000},96000000]
["Fondo de Sencillo ",null,{"$f":"1000000+2200000+2000000","v":5200000},3000000]
[null,null,{"$f":"SUM(C10:C12)","v":2820605259},{"$f":"SUM(D10:D12)","v":5460218035}]
[]
["Bancos Cuentas Corrientes - Moneda Local (Gs)",null,5341809731,1321712423]
["Bancos Locales Cajas de Ahorros - Moneda Local (Gs)",null,21320034834,60832378882]
["Bancos Locales CTA.CTE Y C.AH - Moneda Extranjera (USD)",null,{"$f":"48508414871-50402697-86620612","v":48371391562},{"$f":"570893904+29455371169","v":30026265073}]
["Bancos Locales - Moneda Extranjera (EU)",null,{"$f":"50402697+86620612","v":137023309},120951819]
[null,null,{"$f":"SUM(C15:C18)","v":75170259436},{"$f":"SUM(D15:D18)","v":92301308197}]
["Total Disponibilidades",null,{"$f":"+C13+C19","v":77990864695},{"$f":"+D13+D19","v":97761526232}]

{"sheet":"Nota 4","index":9,"n_rows":17,"n_cols":3,"rows_kept":17,"cut":false,"hidden":false,"merged":[[2,0,2,2],[6,1,6,2],[3,0,3,1]]}
[{"$f":"[1]Indice!C1","v":"NICOLAS GONZALEZ ODDONE S.A.E.C.A"},null,"BG"]
[]
["NOTA 4 - INVERSIONES TEMPORIAS - INVERSIONES FINANCIERAS"]
["En miles de guaranies"]
[]
["La composición de la cuenta es la siguiente:"]
[]
["Cuentas ","2020-09-30","2019-12-31"]
["Casa de Bolsa Puente ME",14099002460,13354381956]
["CDA Bancop ",33499200000,30921600000]
["Casa de Bolsa CADIEM",13886000000,0]
["Puente - Fondos Mutuos ME",27072599086,0]
["Regional casa de Bolsa S.A",6979000000,0]
["CDA Banco Basa S.A ",13958000000,0]
["Pershing LLC- Exterior",41874000000,0]
["Casa de Bolsa Cadiem Fondos Mutuos ME",19192250000,0]
["Total",{"$f":"SUM(B9:B16)","v":170560051546},{"$f":"SUM($C$9:C16)","v":44275981956}]

{"sheet":"Nota 5","index":10,"n_rows":38,"n_cols":9,"rows_kept":38,"cut":false,"hidden":false,"merged":[[2,0,2,2],[3,0,3,1],[6,2,6,3],[31,2,31,3]]}
[{"$f":"[1]Indice!C1","v":"NICOLAS GONZALEZ ODDONE S.A.E.C.A"},null,"BG"]
[]
["NOTA 5 - CUENTAS POR COBRAR COMERCIALES"]
["En miles de guaranies"]
[]
["Las cuentas a cobrar comerciales a corto plazo se integran como sigue:"]
[]
[null,null,"2020-09-30","2019-12-31",null,"Composición de la cartera de créditos por ventas","2020-09-30"]
["Deudores por ventas locales","Moneda Local Guaraníes",167439027428,156506238929,null,"                  Situación","Monto","                     Previsiones"]
["Deudores por ventas locales","Moneda Extranjera Dólares",2855968224,2543712471,null,null,"( en G.)","(en G.)","% Prev s/ Cartera"]
["Deudores - Entidad relacionada","Moneda Local Guaraníes",36963243902,37855832285,null,"A. Total Cartera no vencida",301908753262,{"$f":"11759452750","v":11759452750},{"$f":"H11/G11%","v":3.8950353783863325}]
["Deudores - Entidad relacionada","Moneda Extranjera Dólares",5653758,3221644,null,"Normal",{"$f":"4803634782+220451535","v":5024086317},4662065826,{"$f":"H12/G12%","v":92.794301925605225}]
["Cheques adelantados recibidos de clientes","Moneda Local Guaraníes",92291949322,76930324224,null,"En Gestión de Cobro",11721276168,11721276168,{"$f":"H13/G13%","v":100}]
["Cheques rechazados","Moneda Local Guaraníes",1057343695,920157236,null,"En Gestión de Cobro Judicial",23008234983,23008234983,{"$f":"H14/G14%","v":100}]
["Cupones Tj.credito ","Moneda Local Guaraníes",35071421,27895347,null,"B. Total Cartera Vencida",{"$f":"SUM(G12:G14)","v":39753597468}]
["Deudores-Otros ingresos exterior ","Moneda Extranjera Dólares",127310918,587203181.01999998]
["Otros","Moneda Local Guaraníes",1168256015,0]
["Menos Previsiones ",null,-11759452750,-12343862623,null,"Total de la cartera de créditos al 31/03/2020",{"$f":"+G11+G15","v":341662350730}]
["Total",null,{"$f":"SUM(C9:C18)","v":290184371933},{"$f":"SUM(D9:D18)","v":263030722694.02002},null,"(-) Total Previsiones al 31/03/2020",{"$f":"+H11+H12+H13+H14","v":51151029727}]
[]
["Las cuentas a cobrar comerciales a largo plazo se integran como sigue:",null,null,null,null,"Total Neto de la cartera de créditos al 30/09/2020",{"$f":"+G18-G19","v":290511321003}]
[]
[null,null,"2020-09-30","2019-12-31"]
["Deudores por ventas locales ","Moneda Local Guaraníes",4803634782,7169145314,null,"Observaciones"]
["Deudores en gestión judicial ","Moneda Local Guaraníes",34729511151,33575209533,null,"Criterio de Clasificacion utilizados"]
["Deudores-Otros ingresos exterior","Moneda Extranjera Dólares",220451535,283640229,null,"Normal","de 30 a 60 dias de atraso",null," "]
["Menos Previsiones",null,-39391576977,-38681218392,null,"En Gestion de cobro","de 61 a 150 dias de atraso"]
["Total",null,{"$f":"SUM(C24:C27)","v":362020491},{"$f":"SUM(D24:D27)","v":2346776684},null,"En Gestión de Cobro Judicial","          Mas de 151 días de atraso"]
[]
[null,null,null,null,null,"CRITERIO PARA PREVISONES"]
[null,null,null,null,null,"1- Clientes que registran atrasos y estan por ser demandados."]
[null,null,null,null,null,"2- Clientes que tienen cuentas con otros proveedores y no estan pudiendo pagar."]
[null,null,null,null,null,"3- Clientes con Cheques devueltos."]
[null,null,null,null,null,"4- Clientes que presentan atrasos normales."]
[null,null,null,null,null,"5- Clientes sobregirados de acuerdo al limite de creditos establecido por el "]
[null,null,null,null,null,"comité correspondiente."]
[null,null,null,null,null,"6- Clientes que refinancian sus cuentas."]
[null,null,null,null,null,"7- Estimación de la alta gerencia sobre decaimiento de las cobranzas "]

{"sheet":"Nota 6","index":11,"n_rows":72,"n_cols":7,"rows_kept":72,"cut":false,"hidden":false,"merged":[]}
[{"$f":"[1]Indice!C1","v":"NICOLAS GONZALEZ ODDONE S.A.E.C.A"},null,"BG"]
[]
["NOTA 6 - OTROS CRÉDITOS"]
["En miles de guaranies"]
[]
["La composición de la cuenta es la siguiente:"]
[]
["Cuentas ","30/09/2020","2019-12-31",null,"Cuentas ","30/09/2020","2019-12-31"]
["Corrientes - Actividad Comercial  ",null,null,null,"No corrientes Actividad Comercial "]
["Anticipo de sueldos y comisiones ",66741178,5195476,null,"Otros Créditos ",0,2019685489]
["Anticipo de remuneraciones Direct. y Gerentes ",1877923,0,null,"Total Otros Créditos ",0,{"$f":"SUM(G10)","v":2019685489}]
["Anticipo para gastos de despachos",5682064,0]
["Anticipo para gastos varios ",91148593,37478200]
["Anticipo para compras activo fijo ",143342508,84129005]
["Anticipos para préstamos a directores",0,0]
["Anticipo para instalación de mercaderías ",290503403,253723580]
["Préstamos al personal ",258106279,286484184]
["Préstamos a terceros ",1155383625,902983]
["Deudores por alquileres a cobrar",142017000,58538500]
["Garantías de alquiler",31652381,32452381]
["Intereses s/ Inversiones PF a cobrar",599648016,174021998]
["Seguros a cobrar",259584,23162936]
["Préstamos al personal ME ",0,16841900]
["Deudores por alquileres a cobrar ME",73768030,0]
["Garantías de alquiler ME",170730750,157345850]
["Gastos realizados por cta. De terceros ",128111718,128111718]
["Préstamos a directores",0,0]
["Intereses a vencer ",682189396,460978820]
["Previsiones para incobrables ",0,-902983]
["Impuesto al valor agregado ",4443859,59226943]
["Anticipo Impuesto a la Renta ",0,1864910140]
["Retenciones Impuesto a la Renta ",49521766,0]
["Retenciones de IVA ",0,0]
["Alquileres Pagados por Adelantado ",9520660,5818184]
["Alquileres Pagados por Adelantado ME",424768181,548508986]
["Otros gastos pagados por adelantado ",897524245,4556449534]
["Anticipo para Inversiones Financieras ME",0,136916464]
["Derechos aduaneros a aplicar ",1878111,0]
["Intereses pagados a recuperar ME. INV.FINANC",31123710,0]
["Total",{"$f":"SUM($B$10:B39)","v":5259942980},{"$f":"SUM($C$10:C39)","v":8890294799}]
[]
[]
["Corrientes - Actividad Ganadera"]
["Anticipo al personal Act.Ganadera ",28227277,24474886]
["Anticipos a Contratistas Act. Ganadera ",251613284,205949921]
["Anticipos p/ viáticos a la estancia Act. Ganadera ",3127768,4043426]
["Anticipos para gastos varios Act. Ganadera ",3326458,26895474]
["Anticipo Iragro ",0,118638707]
["Combustibles a utilizar",136864000,0]
["Total",{"$f":"SUM(B44:B49)","v":423158787},{"$f":"SUM(C44:C49)","v":380002414}]
["Total general Otros créditos Act. Comercial y Ganadera ",{"$f":"+B40+B50","v":5683101767},{"$f":"+C40+C50","v":9270297213}]
[]
[]
[]
["NOTA 6 - OTROS ACTIVOS "]
["En miles de guaranies"]
[]
["La composición de la cuenta es la siguiente:"]
["Cuentas ","30/09/2020","2019-12-31"]
["Corrientes"]
["Impuesto Inmobiliario ",80554436,0]
["Tasas Especiales",12273806,0]
["Patente Municipal",131812827,0]
["Impuestos y Tasas s/ Inversiones Inmob.",49224124,0]
["Impuestos y Tasas Prop. Rural",61947431,0]
["Total",{"$f":"SUM(B61:B65)","v":335812624},{"$f":"SUM(C61:C65)","v":0}]
[]
[]
["Cuentas ","30/09/2020","2019-12-31"]
["No Corrientes"]
["Derecho Aduanero a Regularizar",0,1311136198]
["Total",{"$f":"SUM(B71:B71)","v":0},{"$f":"SUM(C71:C71)","v":1311136198}]

{"sheet":"Nota 7","index":12,"n_rows":35,"n_cols":3,"rows_kept":35,"cut":false,"hidden":false,"merged":[[5,0,5,6]]}
[{"$f":"[1]Indice!C1","v":"NICOLAS GONZALEZ ODDONE S.A.E.C.A"},null,"BG"]
[]
["NOTA 7 – INVENTARIOS"]
["En miles de guaranies"]
[]
["Los bienes de cambio están compuestos de la siguiente manera:"]
[]
["Cuentas ","30/09/2020","2019-12-31"]
["Corrientes - Actividad Comercial  "]
["Mercaderías Gravadas ",97220903620,97714621050]
["Mercaderías S/Dto. 6406/05",33301326988,73955756842]
["Mercaderías con Obsolescencia",{"$f":"14979781695+9908904+3932385299","v":18922075898},{"$f":"14120737168+9908904+6959684141","v":21090330213}]
["Fondo de Obsolescencia ",{"$f":"-5257505632-9908904-1296874571","v":-6564289107},{"$f":"-9595214150-9908904-4384479077","v":-13989602131}]
["Repuestos Gravados ",5556406097,1251241029]
["Repuestos S/Dto. 6406/05",0,0]
["Repuestos con Obsolescencia",{"$f":"1952033521+34575662","v":1986609183},{"$f":"5517654836+42269678","v":5559924514}]
["Fondo de Obsolescencia ",{"$f":"-1119081452-34190193","v":-1153271645},{"$f":"-1946324323-41838330","v":-1988162653}]
["Importaciones en curso ",153080966747,131479746126]
["Anticipo a Proveedores del Exterior",5782864374,7517309142]
["Total ",{"$f":"SUM(B10:B19)","v":308133592155},{"$f":"SUM(C10:C19)","v":322591164132}]
[]
["Corrientes - Actividad Ganadera "]
[]
["Hacienda Vacuna ",11594997745,22025480989]
["Total ",{"$f":"SUM(B24)","v":11594997745},{"$f":"SUM(C24)","v":22025480989}]
["Total general Inventarios Corrientes ",{"$f":"+B20+B25","v":319728589900},{"$f":"+C20+C25","v":344616645121}]
[]
[]
[]
["No corrientes - Actividad Comercial"]
[]
["Repuesto Grav. C/Obsolescencia ",{"$f":"2548714287+57770488","v":2606484775},{"$f":"1607344951+42022693","v":1649367644}]
["Fondo de Obsolescencia. Repuesto Grav. ",{"$f":"-980322264-57609854","v":-1037932118},{"$f":"-368487813-37535000","v":-406022813}]
["Total",{"$f":"SUM(B32:B33)","v":1568552657},{"$f":"SUM(C32:C33)","v":1243344831}]
["Total general Inventarios no corrientes ",{"$f":"SUM(B34)","v":1568552657},{"$f":"SUM(C34)","v":1243344831}]

{"sheet":"Nota 8","index":13,"n_rows":21,"n_cols":13,"rows_kept":21,"cut":false,"hidden":false,"merged":[[3,0,3,6]]}
[{"$f":"[3]Indice!C1","v":"NICOLAS GONZALEZ ODDONE S.A.E.C.A"},null,"BG"]
[]
[]
["Nota 8 - INVERSIONES EN ASOCIADAS"]
["En miles de guaraníes"]
[]
["Las inversiones en sociedades donde no se ejerce control se describen a continuación:"]
[]
[null,"2020-09-30","2019-12-31"]
["Total Inversión",{"$f":"+J21","v":32213537431},32213537431]
[]
["a) Datos sobre la sociedad:",null,null,null,null,null,null,"a) Datos sobre la inversión:"]
[null,null,null,{"$f":"IFERROR(IF([3]Indice!B6=\"\",\"2XX2\",YEAR([3]Indice!B6)),\"2XX2\")","v":2020},"2020-09-30","2019-12-31"]
["Nombre de Sociedad","RUC","Cantidad de acciones","Total Patrimonio neto","Total del resultado",null,null,"Cantidad de acciones","Participación sobre los votos (%)","Total Inversión (miles de Gs)","Participación sobre el Patrimonio Neto (%)","Total valuación patrimonial proporcional","Resultado sobre inversiones"]
["Todo Franquicia S.A","80056073-6",15000,6081385663,-1314356910,-4242824559,null,14984,"1 voto por accion",3914711856,{"$f":"+J15/D15","v":0.64372037442348939},{"$f":"K15*D15","v":3914711856.0000005},{"$f":"K15*E15","v":-846078322.23130059}]
["Confort para el Hogar - CPH S.A","80083931-5",27499,26290558198,7338855223,9725422881,null,27490,"1 voto por accion",28298825575,{"$f":"+J16/D16","v":1.0763873996845292},{"$f":"K16*D16","v":28298825575.000004},{"$f":"K16*E16","v":7899451290.1461964}]
[null,null,null,null,null,null,null,null,null,null,{"$f":"J17*C17","v":0},0]
[null,null,null,null,null,null,null,null,null,null,0,0]
[null,null,null,null,null,null,null,null,null,null,0,0]
[null,null,null,null,null,null,null,null,null,null,0,0]
["Total ",null,null,null,{"$f":"SUM(E15:E20)","v":6024498313},{"$f":"SUM(F15:F20)","v":5482598322},null,null,null,{"$f":"SUM(J15:J20)","v":32213537431},null,{"$f":"SUM(L15:L20)","v":32213537431.000004}]

{"sheet":"Nota 9","index":14,"n_rows":55,"n_cols":13,"rows_kept":55,"cut":false,"hidden":false,"merged":[[13,0,13,12],[15,1,15,5],[15,6,15,11],[59,0,59,12]]}
[{"$f":"[1]Indice!C1","v":"NICOLAS GONZALEZ ODDONE S.A.E.C.A"},null,null,null,null,null,null,null,null,null,null,"BG"]
[]
[]
[]
["Obs.:"]
["Incluir aclaraciones en los siguientes casos:"]
["1.      Cuando los bienes de uso tienen alguna restricción sobre su utilización, como por ejemplo cuando están garantizando obligaciones. En su caso también hacer referencia a la nota correspondiente."]
["2.      Cuando exista alguna previsión por desvalorización (“deterioro”), detallando la evolución de la misma en el transcurso del año."]
["3.      Si se están capitalizando intereses al costo de bienes de uso. En su caso deberá aclararse la tasa utilizada para la capitalización."]
["Ver adicionalmente Norma de Información Financiera N° 11 Propiedades, planta y equipo"]
[]
["NICOLAS GONZALEZ ODDONE SAECA ",null,"BG"]
[]
["NOTA 9 - PROPIEDADES, PLANTA Y EQUIPO - NETO"]
["En miles de guaraníes"]
[null,"V     A     L     O    R     E     S        D   E         O     R    I     G     E     N ",null,null,null,null," D     E     P     R     E     C     I    A     C     I   O     N     E     S             "]
[null,"AL Inicio del periodo","Adquisiciones+ Transf. Del periodo","Bajas del periodo","Revalúo del año","Valor  al cierre del periodo","Depreciación acumulada  al inicio del año","Altas y Transf. Del periodo","Bajas de  del periodo","Revalúo depreciación acumulada del año","Depreciación acumulada  al final del periodo","Valor neto resultante","Valor neto resultante"]
[null,null,null,null,null,null,null,null,null,null,null,"2020-09-30","2020-12-31"]
["Actividad Comercial "]
["Muebles, Útiles y enseres ",9262569137,{"$f":"590909+527273+14072727+16031818+1054545+1140000+1418182+909091+2090909+1000000+1718182+974380+655993+2800579+892641+2503606+1000979+623111+1681818+4000000+1281818+2700000+2624000+3936000+1236364+2454545+6676334+4378434+1439636+2189217+1447969+6499382+527273+916426+17963+28125+227273+42170+34545+300000+83308+46211+237573+4500000+14336364+1162392997+4585382401+1512727+386235705+881439+3818182+1909091+481435+4363636+4175141+1975890+1054545+1000000+1118914+1118914+1118914","v":6272387604},597510689,null,{"$f":"+B20+C20-D20","v":14937446052},5228162937,755600629,{"$f":"D20","v":597510689},null,{"$f":"+G20+H20-I20","v":5386252877},{"$f":"+F20-K20","v":9551193175},4034406200]
["Máquinas de Oficinas ",4022068777,{"$f":"3590091+3590091+11245488+3590091+48847730+109644642+2873870+4637920+3657528+3657528+5568456+11136978+3624990+1653120+6081488+5794916+2468400+3555486+3714291+3714291+4994777+5830687+7573624+1590287+6236357+1980551+3338625+3360525+6340229+22763889+3389163+6896081+5405692+6769094+6896081+8366143+3499650+6810370+6129092+100577435+52513180+144484376","v":658393303},373919501,null,{"$f":"+B21+C21-D21","v":4306542579},2368118220,616046477,{"$f":"D21","v":373919501},null,{"$f":"+G21+H21-I21","v":2610245196},{"$f":"+F21-K21","v":1696297383},1653950557]
["Maquinarias, Herramientas y Equipos",3372245247,{"$f":"1426694+557793+675818+1926136+913636+1323636+11477994+3961850+2710783","v":24974340},6512136,null,3390707451,1647214031,358150215,{"$f":"D22","v":6512136},null,1998852110,1391855341,1725031216]
["Edificios y Construcciones ",102415170888,{"$f":"23967273+8690909+962646538","v":995304720},0,null,103410475608,20139366810,1608451511,null,null,21747818321,81662657287,82275804078]
["Transportes Terrestres ",5956822857,117979533,2303370849,null,3771431541,3991876581,393407418,{"$f":"D24","v":2303370849},null,2081913150,1689518391,1964946276]
["Instalaciones ",15585632831,{"$f":"7272727+10079300+7636364+1200000+1767150+1636250+5254545+5181818+818182+8074174+2618000+21068944+2945250+46707476+11090909+23836340+2909091+4084842+2500000+61913636+68235763","v":296830761},1134080955,null,14748382637,11071003633,1229496159,{"$f":"D25","v":1134080955},null,11166418837,{"$f":"+F25-K25","v":3581963800},4514629198]
["Construcciones en curso",920648457,{"$f":"1088990+40909091","v":41998081},962646538,null,0,0,0,0,null,0,{"$f":"+F26-K26","v":0},920648457]
["Construcciones en previo Ajeno ",1826371556,0,0,null,1826371556,1578038255,91879369,null,null,1669917624,{"$f":"+F27-K27","v":156453932},248333301]
["Aviones",3746716084,0,0,null,3746716084,1772788173,417929490,0,null,2190717663,{"$f":"+F28-K28","v":1555998421},1973927911]
["Sub Totales",{"$f":"SUM(B20:B28)","v":147108245834},{"$f":"SUM(C20:C28)","v":8407868342},{"$f":"SUM(D20:D28)","v":5378040668},null,{"$f":"SUM(F20:F28)","v":150138073508},{"$f":"SUM(G20:G28)","v":47796568640},{"$f":"SUM(H20:H28)","v":5470961268},{"$f":"SUM(I20:I28)","v":4415394130},null,{"$f":"SUM(K20:K28)","v":48852135778},{"$f":"SUM($L$20:L28)","v":101285937730},{"$f":"SUM($M$20:M28)","v":99311677194}]
[]
["Actividad Ganadera"]
["Construcciones ",{"$f":"935290137+841881023+974781158+262460243+42091183","v":3056503744},{"$f":"135318182","v":135318182},{"$f":"735198135+200092002","v":935290137},null,{"$f":"+B32+C32-D32","v":2256531789},440365160,32242097,0,null,472607257,{"$f":"+F32-K32","v":1783924532},2616138584]
["Instalaciones ",769397698,{"$f":"25454545+3636364+20062000+2000000+64000000+2122727","v":117275636},{"$f":"2122727+3636364","v":5759091},null,{"$f":"+B33+C33-D33","v":880914243},625347762,21863402,0,null,647211164,{"$f":"+F33-K33","v":233703079},144049936]
["Mejoras",{"$f":"5192087558+2947869159+1213582871+9632162012+59942704+321600302+1655384976+38483202+49053841+718259673+647100743","v":22475527041},{"$f":"94234918+53709800+98299000+27314000+108909233+26860364+21686364+53692727+46666000+24954545+8000000+22200000+128218182+21695455+59145455+27763636+11545455+10909091+735198135+200092002+21181709+15636364+17868091+235807000+68162000+152128000+14663045+72245000+73073250+9159091+10299600+29356364+11545455+20781818+25400000+1271000","v":2559672149},11545455,null,{"$f":"+B34+C34-D34","v":25023653735},10052983396,977238950,0,null,{"$f":"G34+H34-I34","v":11030222346},{"$f":"+F34-K34","v":13993431389},12422543645]
["Muebles y Equipos",{"$f":"171806720+11422637+5550985","v":188780342},{"$f":"785336+849135+2879271+2189217+1894676+9127295+12181818+1542769+662961+1413423+604545+3636364","v":37766810},0,null,{"$f":"+B35+C35-D35","v":226547152},153393252,22038838,0,null,{"$f":"G35+H35-I35","v":175432090},{"$f":"+F35-K35","v":51115062},35387090]
["Maquinarias e Implementos ",{"$f":"2318557984+167018593+79247788+89970847+72357801","v":2727153013},0,0,null,2727153013,1585704238,200758827,0,null,1786463065,940689948,1141448775]
["Equipos y Herramientas ",{"$f":"13983376+50712782+960338087","v":1025034245},{"$f":"1881818+77272727+2900000+416392+2964000+2431818+6900000+400000+786364+9300000+1336364+2292727+1786364+3100000+1217045","v":114985619},0,null,1140019864,695780516,97732328,0,null,793512844,346507020,329253729]
["Transportes Terrestres ",{"$f":"441513744+75267674+171910540+2356112","v":691048070},{"$f":"2295143+915343+8336364+8345485","v":19892335},0,null,710940405,232204289,68307162,0,null,300511451,410428954,458843811]
["Equipos de Comunicación",84987043,{"$f":"10063636+2590909+3274091+2122727","v":18051363},0,null,103038406,73312469,3749143,0,null,77061612,25976794,11674574]
["Sub Totales",{"$f":"SUM(B32:B39)","v":31018431196},{"$f":"SUM(C32:C39)","v":3002962094},{"$f":"SUM(D32:D39)","v":952594683},null,{"$f":"SUM(F32:F39)","v":33068798607},{"$f":"SUM(G32:G39)","v":13859091082},{"$f":"SUM(H32:H39)","v":1423930747},{"$f":"SUM(I32:I39)","v":0},null,{"$f":"SUM(K32:K39)","v":15283021829},{"$f":"SUM($L$32:L39)","v":17785776778},{"$f":"SUM($M$32:M39)","v":17159340144}]
[]
["NO SUJETOS A DEPRECIACION"]
[]
["Actividad Comercial "]
["Inmuebles-Terrenos ",23122305987,0,0,null,23122305987,0,0,0,null,0,23122305987,23122305987]
[null,{"$f":"SUM(B45)","v":23122305987},{"$f":"SUM(C45)","v":0},{"$f":"SUM(D45)","v":0},null,{"$f":"SUM(F45)","v":23122305987},{"$f":"SUM(G45)","v":0},{"$f":"SUM(H45)","v":0},{"$f":"SUM(I45)","v":0},null,{"$f":"SUM(K45)","v":0},{"$f":"SUM(L45)","v":23122305987},{"$f":"SUM(M45)","v":23122305987}]
["Actividad Ganadera"]
["Inmuebles Rurales",155232969990,0,0,null,155232969990,0,0,0,null,0,155232969990,155232969990]
[null,{"$f":"SUM(B48)","v":155232969990},0,0,0,155232969990,0,0,0,0,0,{"$f":"SUM(L48)","v":155232969990},{"$f":"SUM(M48)","v":155232969990}]
[]
["Hacienda Permanente",{"$f":"17919565480+71000000+9105790000+1018500000","v":28114855480},{"$f":"12511988883+820285714+23333333+83945455+274057130+4727273+105000000+5250000+9523810+93332267+508492353+16666667+26666667+15000+2250000+24000+3636364+57142857+3809428","v":14550147201},{"$f":"920272214+1147930800+868111570+32637500+770519858","v":3739471942},null,38925530739,928679029,0,0,null,{"$f":"G51+H51-I51","v":928679029},37996851710,27186176421]
["Pasturas",16457592232,{"$f":"63636364+145527273+45454545+121683636+272177415+52727273+129924500+21668455+391185455","v":1243984916},0,null,17701577148,9093280632,450155443,0,null,{"$f":"G52+H52-I52","v":9543436075},8158141073,7364311600]
[null,{"$f":"SUM(B51:B52)","v":44572447712},{"$f":"SUM(C51:C52)","v":15794132117},{"$f":"SUM(D51:D52)","v":3739471942},null,{"$f":"SUM(F51:F52)","v":56627107887},{"$f":"SUM(G51:G52)","v":10021959661},{"$f":"SUM(H51:H52)","v":450155443},{"$f":"SUM(I51:I52)","v":0},null,{"$f":"SUM(K51:K52)","v":10472115104},{"$f":"SUM(L51:L52)","v":46154992783},{"$f":"SUM(M51:M52)","v":34550488021}]
["Sub Totales",{"$f":"+B46+B49+B53","v":222927723689},{"$f":"+C46+C49+C53","v":15794132117},{"$f":"+D46+D49+D53","v":3739471942},null,{"$f":"+F46+F49+F53","v":234982383864},{"$f":"+G46+G49+G53","v":10021959661},{"$f":"+H46+H49+H53","v":450155443},{"$f":"I46+I49+I53","v":0},null,{"$f":"K46+K49+K53","v":10472115104},{"$f":"L46+L49+L53","v":224510268760},{"$f":"+M46+M49+M53","v":212905763998}]
["Total General ",{"$f":"+B29+B40+B54","v":401054400719},{"$f":"+C29+C40+C54","v":27204962553},{"$f":"+D29+D40+D54","v":10070107293},null,{"$f":"+F29+F40+F54","v":418189255979},{"$f":"+G29+G40+G54","v":71677619383},{"$f":"+H29+H40+H54","v":7345047458},{"$f":"+I29+I40+I54","v":4415394130},null,{"$f":"+K29+K40+K54","v":74607272711},{"$f":"+L29+L40+L54","v":343581983268},{"$f":"+M29+M40+M54","v":329376781336}]

{"sheet":"Nota 10","index":15,"n_rows":29,"n_cols":3,"rows_kept":29,"cut":false,"hidden":false,"merged":[[2,4,2,9],[2,274,2,279],[2,280,2,285],[2,214,2,219],[2,220,2,225],[2,226,2,231],[2,232,2,237],[2,238,2,243],[2,244,2,249],[19,0,19,12],[2,178,2,183],[2,184,2,189],[2,190,2,195],[2,196,2,201],[2,202,2,207],[2,208,2,213],[2,142,2,147],[2,148,2,153],[2,154,2,159],[2,160,2,165],[2,166,2,171],[2,172,2,177],[2,106,2,111],[2,112,2,117],[2,118,2,123],[2,124,2,129],[2,130,2,135],[2,136,2,141],[2,70,2,75],[2,76,2,81],[2,82,2,87],[2,88,2,93],[2,94,2,99],[2,10,2,15],[2,16,2,21],[2,22,2,27],[2,28,2,33],[2,394,2,399],[2,400,2,405],[2,406,2,411],[2,412,2,417],[2,418,2,423],[2,250,2,255],[2,256,2,261],[2,262,2,267],[2,268,2,273],[2,100,2,105],[2,34,2,39],[2,40,2,45],[2,46,2,51],[2,52,2,57],[2,58,2,63],[2,64,2,69],[2,424,2,429],[2,358,2,363],[2,364,2,369],[2,370,2,375],[2,376,2,381],[2,382,2,387],[2,388,2,393],[2,322,2,327],[2,328,2,333],[2,334,2,339],[2,340,2,345],[2,346,2,351],[2,352,2,357],[2,286,2,291],[2,292,2,297],[2,298,2,303],[2,304,2,309],[2,310,2,315],[2,316,2,321],[2,502,2,507],[2,508,2,513],[2,514,2,519],[2,520,2,525],[2,526,2,531],[2,532,2,537],[2,466,2,471],[2,472,2,477],[2,478,2,483],[2,484,2,489],[2,490,2,495],[2,496,2,501],[2,430,2,435],[2,436,2,441],[2,442,2,447],[2,448,2,453],[2,454,2,459],[2,460,2,465],[2,610,2,615],[2,616,2,621],[2,622,2,627],[2,628,2,633],[2,634,2,639],[2,640,2,645],[2,574,2,579],[2,580,2,585],[2,586,2,591],[2,592,2,597],[2,598,2,603],[2,604,2,609],[2,538,2,543],[2,544,2,549],[2,550,2,555],[2,556,2,561],[2,562,2,567],[2,568,2,573],[2,718,2,723],[2,724,2,729],[2,730,2,735],[2,736,2,741],[2,742,2,747],[2,748,2,753],[2,682,2,687],[2,688,2,693],[2,694,2,699],[2,700,2,705],[2,706,2,711],[2,712,2,717],[2,646,2,651],[2,652,2,657],[2,658,2,663],[2,664,2,669],[2,670,2,675],[2,676,2,681],[2,826,2,831],[2,832,2,837],[2,838,2,843],[2,844,2,849],[2,850,2,855],[2,856,2,861],[2,790,2,795],[2,796,2,801],[2,802,2,807],[2,808,2,813],[2,814,2,819],[2,820,2,825],[2,754,2,759],[2,760,2,765],[2,766,2,771],[2,772,2,777],[2,778,2,783],[2,784,2,789],[2,934,2,939],[2,940,2,945],[2,946,2,951],[2,952,2,957],[2,958,2,963],[2,964,2,969],[2,898,2,903],[2,904,2,909],[2,910,2,915],[2,916,2,921],[2,922,2,927],[2,928,2,933],[2,862,2,867],[2,868,2,873],[2,874,2,879],[2,880,2,885],[2,886,2,891],[2,892,2,897],[2,1042,2,1047],[2,1048,2,1053],[2,1054,2,1059],[2,1060,2,1065],[2,1066,2,1071],[2,1072,2,1077],[2,1006,2,1011],[2,1012,2,1017],[2,1018,2,1023],[2,1024,2,1029],[2,1030,2,1035],[2,1036,2,1041],[2,970,2,975],[2,976,2,981],[2,982,2,987],[2,988,2,993],[2,994,2,999],[2,1000,2,1005],[2,1150,2,1155],[2,1156,2,1161],[2,1162,2,1167],[2,1168,2,1173],[2,1174,2,1179],[2,1180,2,1185],[2,1114,2,1119],[2,1120,2,1125],[2,1126,2,1131],[2,1132,2,1137],[2,1138,2,1143],[2,1144,2,1149],[2,1078,2,1083],[2,1084,2,1089],[2,1090,2,1095],[2,1096,2,1101],[2,1102,2,1107],[2,1108,2,1113],[2,1258,2,1263],[2,1264,2,1269],[2,1270,2,1275],[2,1276,2,1281],[2,1282,2,1287],[2,1288,2,1293],[2,1222,2,1227],[2,1228,2,1233],[2,1234,2,1239],[2,1240,2,1245],[2,1246,2,1251],[2,1252,2,1257],[2,1186,2,1191],[2,1192,2,1197],[2,1198,2,1203],[2,1204,2,1209],[2,1210,2,1215],[2,1216,2,1221],[2,1366,2,1371],[2,1372,2,1377],[2,1378,2,1383],[2,1384,2,1389],[2,1390,2,1395],[2,1396,2,1401],[2,1330,2,1335],[2,1336,2,1341],[2,1342,2,1347],[2,1348,2,1353],[2,1354,2,1359],[2,1360,2,1365],[2,1294,2,1299],[2,1300,2,1305],[2,1306,2,1311],[2,1312,2,1317],[2,1318,2,1323],[2,1324,2,1329],[2,1474,2,1479],[2,1480,2,1485],[2,1486,2,1491],[2,1492,2,1497],[2,1498,2,1503],[2,1504,2,1509],[2,1438,2,1443],[2,1444,2,1449],[2,1450,2,1455],[2,1456,2,1461],[2,1462,2,1467],[2,1468,2,1473],[2,1402,2,1407],[2,1408,2,1413],[2,1414,2,1419],[2,1420,2,1425],[2,1426,2,1431],[2,1432,2,1437],[2,1582,2,1587],[2,1588,2,1593],[2,1594,2,1599],[2,1600,2,1605],[2,1606,2,1611],[2,1612,2,1617],[2,1546,2,1551],[2,1552,2,1557],[2,1558,2,1563],[2,1564,2,1569],[2,1570,2,1575],[2,1576,2,1581],[2,1510,2,1515],[2,1516,2,1521],[2,1522,2,1527],[2,1528,2,1533],[2,1534,2,1539],[2,1540,2,1545],[2,1690,2,1695],[2,1696,2,1701],[2,1702,2,1707],[2,1708,2,1713],[2,1714,2,1719],[2,1720,2,1725],[2,1654,2,1659],[2,1660,2,1665],[2,1666,2,1671],[2,1672,2,1677],[2,1678,2,1683],[2,1684,2,1689],[2,1618,2,1623],[2,1624,2,1629],[2,1630,2,1635],[2,1636,2,1641],[2,1642,2,1647],[2,1648,2,1653],[2,1798,2,1803],[2,1804,2,1809],[2,1810,2,1815],[2,1816,2,1821],[2,1822,2,1827],[2,1828,2,1833],[2,1762,2,1767],[2,1768,2,1773],[2,1774,2,1779],[2,1780,2,1785],[2,1786,2,1791],[2,1792,2,1797],[2,1726,2,1731],[2,1732,2,1737],[2,1738,2,1743],[2,1744,2,1749],[2,1750,2,1755],[2,1756,2,1761],[2,1906,2,1911],[2,1912,2,1917],[2,1918,2,1923],[2,1924,2,1929],[2,1930,2,1935],[2,1936,2,1941],[2,1870,2,1875],[2,1876,2,1881],[2,1882,2,1887],[2,1888,2,1893],[2,1894,2,1899],[2,1900,2,1905],[2,1834,2,1839],[2,1840,2,1845],[2,1846,2,1851],[2,1852,2,1857],[2,1858,2,1863],[2,1864,2,1869],[2,2014,2,2019],[2,2020,2,2025],[2,2026,2,2031],[2,2032,2,2037],[2,2038,2,2043],[2,2044,2,2049],[2,1978,2,1983],[2,1984,2,1989],[2,1990,2,1995],[2,1996,2,2001],[2,2002,2,2007],[2,2008,2,2013],[2,1942,2,1947],[2,1948,2,1953],[2,1954,2,1959],[2,1960,2,1965],[2,1966,2,1971],[2,1972,2,1977],[2,2122,2,2127],[2,2128,2,2133],[2,2134,2,2139],[2,2140,2,2145],[2,2146,2,2151],[2,2152,2,2157],[2,2086,2,2091],[2,2092,2,2097],[2,2098,2,2103],[2,2104,2,2109],[2,2110,2,2115],[2,2116,2,2121],[2,2050,2,2055],[2,2056,2,2061],[2,2062,2,2067],[2,2068,2,2073],[2,2074,2,2079],[2,2080,2,2085],[2,2230,2,2235],[2,2236,2,2241],[2,2242,2,2247],[2,2248,2,2253],[2,2254,2,2259],[2,2260,2,2265],[2,2194,2,2199],[2,2200,2,2205],[2,2206,2,2211],[2,2212,2,2217],[2,2218,2,2223],[2,2224,2,2229],[2,2158,2,2163],[2,2164,2,2169],[2,2170,2,2175],[2,2176,2,2181],[2,2182,2,2187],[2,2188,2,2193],[2,2338,2,2343],[2,2344,2,2349],[2,2350,2,2355],[2,2356,2,2361],[2,2362,2,2367],[2,2368,2,2373],[2,2302,2,2307],[2,2308,2,2313],[2,2314,2,2319],[2,2320,2,2325],[2,2326,2,2331],[2,2332,2,2337],[2,2266,2,2271],[2,2272,2,2277],[2,2278,2,2283],[2,2284,2,2289],[2,2290,2,2295],[2,2296,2,2301],[2,2446,2,2451],[2,2452,2,2457],[2,2458,2,2463],[2,2464,2,2469],[2,2470,2,2475],[2,2476,2,2481],[2,2410,2,2415],[2,2416,2,2421],[2,2422,2,2427],[2,2428,2,2433],[2,2434,2,2439],[2,2440,2,2445],[2,2374,2,2379],[2,2380,2,2385],[2,2386,2,2391],[2,2392,2,2397],[2,2398,2,2403],[2,2404,2,2409],[2,2554,2,2559],[2,2560,2,2565],[2,2566,2,2571],[2,2572,2,2577],[2,2578,2,2583],[2,2584,2,2589],[2,2518,2,2523],[2,2524,2,2529],[2,2530,2,2535],[2,2536,2,2541],[2,2542,2,2547],[2,2548,2,2553],[2,2482,2,2487],[2,2488,2,2493],[2,2494,2,2499],[2,2500,2,2505],[2,2506,2,2511],[2,2512,2,2517],[2,2662,2,2667],[2,2668,2,2673],[2,2674,2,2679],[2,2680,2,2685],[2,2686,2,2691],[2,2692,2,2697],[2,2626,2,2631],[2,2632,2,2637],[2,2638,2,2643],[2,2644,2,2649],[2,2650,2,2655],[2,2656,2,2661],[2,2590,2,2595],[2,2596,2,2601],[2,2602,2,2607],[2,2608,2,2613],[2,2614,2,2619],[2,2620,2,2625],[2,2770,2,2775],[2,2776,2,2781],[2,2782,2,2787],[2,2788,2,2793],[2,2794,2,2799],[2,2800,2,2805],[2,2734,2,2739],[2,2740,2,2745],[2,2746,2,2751],[2,2752,2,2757],[2,2758,2,2763],[2,2764,2,2769],[2,2698,2,2703],[2,2704,2,2709],[2,2710,2,2715],[2,2716,2,2721],[2,2722,2,2727],[2,2728,2,2733],[2,2878,2,2883],[2,2884,2,2889],[2,2890,2,2895],[2,2896,2,2901],[2,2902,2,2907],[2,2908,2,2913],[2,2842,2,2847],[2,2848,2,2853],[2,2854,2,2859],[2,2860,2,2865],[2,2866,2,2871],[2,2872,2,2877],[2,2806,2,2811],[2,2812,2,2817],[2,2818,2,2823],[2,2824,2,2829],[2,2830,2,2835],[2,2836,2,2841],[2,2986,2,2991],[2,2992,2,2997],[2,2998,2,3003],[2,3004,2,3009],[2,3010,2,3015],[2,3016,2,3021],[2,2950,2,2955],[2,2956,2,2961],[2,2962,2,2967],[2,2968,2,2973],[2,2974,2,2979],[2,2980,2,2985],[2,2914,2,2919],[2,2920,2,2925],[2,2926,2,2931],[2,2932,2,2937],[2,2938,2,2943],[2,2944,2,2949],[2,3094,2,3099],[2,3100,2,3105],[2,3106,2,3111],[2,3112,2,3117],[2,3118,2,3123],[2,3124,2,3129],[2,3058,2,3063],[2,3064,2,3069],[2,3070,2,3075],[2,3076,2,3081],[2,3082,2,3087],[2,3088,2,3093],[2,3022,2,3027],[2,3028,2,3033],[2,3034,2,3039],[2,3040,2,3045],[2,3046,2,3051],[2,3052,2,3057],[2,3202,2,3207],[2,3208,2,3213],[2,3214,2,3219],[2,3220,2,3225],[2,3226,2,3231],[2,3232,2,3237],[2,3166,2,3171],[2,3172,2,3177],[2,3178,2,3183],[2,3184,2,3189],[2,3190,2,3195],[2,3196,2,3201],[2,3130,2,3135],[2,3136,2,3141],[2,3142,2,3147],[2,3148,2,3153],[2,3154,2,3159],[2,3160,2,3165],[2,3310,2,3315],[2,3316,2,3321],[2,3322,2,3327],[2,3328,2,3333],[2,3334,2,3339],[2,3340,2,3345],[2,3274,2,3279],[2,3280,2,3285],[2,3286,2,3291],[2,3292,2,3297],[2,3298,2,3303],[2,3304,2,3309],[2,3238,2,3243],[2,3244,2,3249],[2,3250,2,3255],[2,3256,2,3261],[2,3262,2,3267],[2,3268,2,3273],[2,3418,2,3423],[2,3424,2,3429],[2,3430,2,3435],[2,3436,2,3441],[2,3442,2,3447],[2,3448,2,3453],[2,3382,2,3387],[2,3388,2,3393],[2,3394,2,3399],[2,3400,2,3405],[2,3406,2,3411],[2,3412,2,3417],[2,3346,2,3351],[2,3352,2,3357],[2,3358,2,3363],[2,3364,2,3369],[2,3370,2,3375],[2,3376,2,3381],[2,3526,2,3531],[2,3532,2,3537],[2,3538,2,3543],[2,3544,2,3549],[2,3550,2,3555],[2,3556,2,3561],[2,3490,2,3495],[2,3496,2,3501],[2,3502,2,3507],[2,3508,2,3513],[2,3514,2,3519],[2,3520,2,3525],[2,3454,2,3459],[2,3460,2,3465],[2,3466,2,3471],[2,3472,2,3477],[2,3478,2,3483],[2,3484,2,3489],[2,3634,2,3639],[2,3640,2,3645],[2,3646,2,3651],[2,3652,2,3657],[2,3658,2,3663],[2,3664,2,3669],[2,3598,2,3603],[2,3604,2,3609],[2,3610,2,3615],[2,3616,2,3621],[2,3622,2,3627],[2,3628,2,3633],[2,3562,2,3567],[2,3568,2,3573],[2,3574,2,3579],[2,3580,2,3585],[2,3586,2,3591],[2,3592,2,3597],[2,3742,2,3747],[2,3748,2,3753],[2,3754,2,3759],[2,3760,2,3765],[2,3766,2,3771],[2,3772,2,3777],[2,3706,2,3711],[2,3712,2,3717],[2,3718,2,3723],[2,3724,2,3729],[2,3730,2,3735],[2,3736,2,3741],[2,3670,2,3675],[2,3676,2,3681],[2,3682,2,3687],[2,3688,2,3693],[2,3694,2,3699],[2,3700,2,3705],[2,3850,2,3855],[2,3856,2,3861],[2,3862,2,3867],[2,3868,2,3873],[2,3874,2,3879],[2,3880,2,3885],[2,3814,2,3819],[2,3820,2,3825],[2,3826,2,3831],[2,3832,2,3837],[2,3838,2,3843],[2,3844,2,3849],[2,3778,2,3783],[2,3784,2,3789],[2,3790,2,3795],[2,3796,2,3801],[2,3802,2,3807],[2,3808,2,3813],[2,3958,2,3963],[2,3964,2,3969],[2,3970,2,3975],[2,3976,2,3981],[2,3982,2,3987],[2,3988,2,3993],[2,3922,2,3927],[2,3928,2,3933],[2,3934,2,3939],[2,3940,2,3945],[2,3946,2,3951],[2,3952,2,3957],[2,3886,2,3891],[2,3892,2,3897],[2,3898,2,3903],[2,3904,2,3909],[2,3910,2,3915],[2,3916,2,3921],[2,4066,2,4071],[2,4072,2,4077],[2,4078,2,4083],[2,4084,2,4089],[2,4090,2,4095],[2,4096,2,4101],[2,4030,2,4035],[2,4036,2,4041],[2,4042,2,4047],[2,4048,2,4053],[2,4054,2,4059],[2,4060,2,4065],[2,3994,2,3999],[2,4000,2,4005],[2,4006,2,4011],[2,4012,2,4017],[2,4018,2,4023],[2,4024,2,4029],[2,4174,2,4179],[2,4180,2,4185],[2,4186,2,4191],[2,4192,2,4197],[2,4198,2,4203],[2,4204,2,4209],[2,4138,2,4143],[2,4144,2,4149],[2,4150,2,4155],[2,4156,2,4161],[2,4162,2,4167],[2,4168,2,4173],[2,4102,2,4107],[2,4108,2,4113],[2,4114,2,4119],[2,4120,2,4125],[2,4126,2,4131],[2,4132,2,4137],[2,4282,2,4287],[2,4288,2,4293],[2,4294,2,4299],[2,4300,2,4305],[2,4306,2,4311],[2,4312,2,4317],[2,4246,2,4251],[2,4252,2,4257],[2,4258,2,4263],[2,4264,2,4269],[2,4270,2,4275],[2,4276,2,4281],[2,4210,2,4215],[2,4216,2,4221],[2,4222,2,4227],[2,4228,2,4233],[2,4234,2,4239],[2,4240,2,4245],[2,4390,2,4395],[2,4396,2,4401],[2,4402,2,4407],[2,4408,2,4413],[2,4414,2,4419],[2,4420,2,4425],[2,4354,2,4359],[2,4360,2,4365],[2,4366,2,4371],[2,4372,2,4377],[2,4378,2,4383],[2,4384,2,4389],[2,4318,2,4323],[2,4324,2,4329],[2,4330,2,4335],[2,4336,2,4341],[2,4342,2,4347],[2,4348,2,4353],[2,4498,2,4503],[2,4504,2,4509],[2,4510,2,4515],[2,4516,2,4521],[2,4522,2,4527],[2,4528,2,4533],[2,4462,2,4467],[2,4468,2,4473],[2,4474,2,4479],[2,4480,2,4485],[2,4486,2,4491],[2,4492,2,4497],[2,4426,2,4431],[2,4432,2,4437],[2,4438,2,4443],[2,4444,2,4449],[2,4450,2,4455],[2,4456,2,4461],[2,4606,2,4611],[2,4612,2,4617],[2,4618,2,4623],[2,4624,2,4629],[2,4630,2,4635],[2,4636,2,4641],[2,4570,2,4575],[2,4576,2,4581],[2,4582,2,4587],[2,4588,2,4593],[2,4594,2,4599],[2,4600,2,4605],[2,4534,2,4539],[2,4540,2,4545],[2,4546,2,4551],[2,4552,2,4557],[2,4558,2,4563],[2,4564,2,4569],[2,4714,2,4719],[2,4720,2,4725],[2,4726,2,4731],[2,4732,2,4737],[2,4738,2,4743],[2,4744,2,4749],[2,4678,2,4683],[2,4684,2,4689],[2,4690,2,4695],[2,4696,2,4701],[2,4702,2,4707],[2,4708,2,4713],[2,4642,2,4647],[2,4648,2,4653],[2,4654,2,4659],[2,4660,2,4665],[2,4666,2,4671],[2,4672,2,4677],[2,4822,2,4827],[2,4828,2,4833],[2,4834,2,4839],[2,4840,2,4845],[2,4846,2,4851],[2,4852,2,4857],[2,4786,2,4791],[2,4792,2,4797],[2,4798,2,4803],[2,4804,2,4809],[2,4810,2,4815],[2,4816,2,4821],[2,4750,2,4755],[2,4756,2,4761],[2,4762,2,4767],[2,4768,2,4773],[2,4774,2,4779],[2,4780,2,4785],[2,4930,2,4935],[2,4936,2,4941],[2,4942,2,4947],[2,4948,2,4953],[2,4954,2,4959],[2,4960,2,4965],[2,4894,2,4899],[2,4900,2,4905],[2,4906,2,4911],[2,4912,2,4917],[2,4918,2,4923],[2,4924,2,4929],[2,4858,2,4863],[2,4864,2,4869],[2,4870,2,4875],[2,4876,2,4881],[2,4882,2,4887],[2,4888,2,4893],[2,5038,2,5043],[2,5044,2,5049],[2,5050,2,5055],[2,5056,2,5061],[2,5062,2,5067],[2,5068,2,5073],[2,5002,2,5007],[2,5008,2,5013],[2,5014,2,5019],[2,5020,2,5025],[2,5026,2,5031],[2,5032,2,5037],[2,4966,2,4971],[2,4972,2,4977],[2,4978,2,4983],[2,4984,2,4989],[2,4990,2,4995],[2,4996,2,5001],[2,5146,2,5151],[2,5152,2,5157],[2,5158,2,5163],[2,5164,2,5169],[2,5170,2,5175],[2,5176,2,5181],[2,5110,2,5115],[2,5116,2,5121],[2,5122,2,5127],[2,5128,2,5133],[2,5134,2,5139],[2,5140,2,5145],[2,5074,2,5079],[2,5080,2,5085],[2,5086,2,5091],[2,5092,2,5097],[2,5098,2,5103],[2,5104,2,5109],[2,5254,2,5259],[2,5260,2,5265],[2,5266,2,5271],[2,5272,2,5277],[2,5278,2,5283],[2,5284,2,5289],[2,5218,2,5223],[2,5224,2,5229],[2,5230,2,5235],[2,5236,2,5241],[2,5242,2,5247],[2,5248,2,5253],[2,5182,2,5187],[2,5188,2,5193],[2,5194,2,5199],[2,5200,2,5205],[2,5206,2,5211],[2,5212,2,5217],[2,5362,2,5367],[2,5368,2,5373],[2,5374,2,5379],[2,5380,2,5385],[2,5386,2,5391],[2,5392,2,5397],[2,5326,2,5331],[2,5332,2,5337],[2,5338,2,5343],[2,5344,2,5349],[2,5350,2,5355],[2,5356,2,5361],[2,5290,2,5295],[2,5296,2,5301],[2,5302,2,5307],[2,5308,2,5313],[2,5314,2,5319],[2,5320,2,5325],[2,5470,2,5475],[2,5476,2,5481],[2,5482,2,5487],[2,5488,2,5493],[2,5494,2,5499],[2,5500,2,5505],[2,5434,2,5439],[2,5440,2,5445],[2,5446,2,5451],[2,5452,2,5457],[2,5458,2,5463],[2,5464,2,5469],[2,5398,2,5403],[2,5404,2,5409],[2,5410,2,5415],[2,5416,2,5421],[2,5422,2,5427],[2,5428,2,5433],[2,5578,2,5583],[2,5584,2,5589],[2,5590,2,5595],[2,5596,2,5601],[2,5602,2,5607],[2,5608,2,5613],[2,5542,2,5547],[2,5548,2,5553],[2,5554,2,5559],[2,5560,2,5565],[2,5566,2,5571],[2,5572,2,5577],[2,5506,2,5511],[2,5512,2,5517],[2,5518,2,5523],[2,5524,2,5529],[2,5530,2,5535],[2,5536,2,5541],[2,5686,2,5691],[2,5692,2,5697],[2,5698,2,5703],[2,5704,2,5709],[2,5710,2,5715],[2,5716,2,5721],[2,5650,2,5655],[2,5656,2,5661],[2,5662,2,5667],[2,5668,2,5673],[2,5674,2,5679],[2,5680,2,5685],[2,5614,2,5619],[2,5620,2,5625],[2,5626,2,5631],[2,5632,2,5637],[2,5638,2,5643],[2,5644,2,5649],[2,5794,2,5799],[2,5800,2,5805],[2,5806,2,5811],[2,5812,2,5817],[2,5818,2,5823],[2,5824,2,5829],[2,5758,2,5763],[2,5764,2,5769],[2,5770,2,5775],[2,5776,2,5781],[2,5782,2,5787],[2,5788,2,5793],[2,5722,2,5727],[2,5728,2,5733],[2,5734,2,5739],[2,5740,2,5745],[2,5746,2,5751],[2,5752,2,5757],[2,5902,2,5907],[2,5908,2,5913],[2,5914,2,5919],[2,5920,2,5925],[2,5926,2,5931],[2,5932,2,5937],[2,5866,2,5871],[2,5872,2,5877],[2,5878,2,5883],[2,5884,2,5889],[2,5890,2,5895],[2,5896,2,5901],[2,5830,2,5835],[2,5836,2,5841],[2,5842,2,5847],[2,5848,2,5853],[2,5854,2,5859],[2,5860,2,5865],[2,6010,2,6015],[2,6016,2,6021],[2,6022,2,6027],[2,6028,2,6033],[2,6034,2,6039],[2,6040,2,6045],[2,5974,2,5979],[2,5980,2,5985],[2,5986,2,5991],[2,5992,2,5997]],"merged_total":2731,"flags":["merged_cut"]}
[{"$f":"[1]Indice!C1","v":"NICOLAS GONZALEZ ODDONE S.A.E.C.A"},null,"BG"]
[]
["NOTA 10 – ACTIVOS DISPONIBLES PARA LA VENTA"]
["En miles de guaraníes"]
["NO APLICA"]
[null,"2020-06-30","2019-12-31"]
["Propiedad, planta y equipo"]
["(Detallar bienes de uso)"]
["Total",0,0]
[]
["Activos intangibles"]
["(Detallar activos intangibles)"]
["Total",0,0]
[]
["Inversiones"]
["(Detallar Inversiones"]
["Total",0,0]
[]
[]
["NOTA 10 - INVERSIONES INMOBILIARIAS"]
["En miles de guaraníes"]
["Inmuebles y edificios que están destinados a la obtención de Renta."]
[]
["Cuentas ","30/09/2020","2019-12-31"]
["Inversiones – Edificios",20069079097,19566351824]
["Inversiones – Terrenos",26719462956,26572471989]
["Obras en Curso de Realizacion",4522898732,2036153354]
["Depreciación Acumulada – Edificios",-8566662680,-8273042403]
["Total ",{"$f":"SUM(B25:B28)","v":42744778105},{"$f":"SUM(C25:C28)","v":39901934764}]

{"sheet":"cred","index":16,"n_rows":14,"n_cols":3,"rows_kept":14,"cut":false,"hidden":true,"merged":[[3,0,3,2],[4,0,4,1]]}
[{"$f":"Indice!C1","v":"NICOLAS GONZALEZ ODDONE S.A.E.C.A"},null,"BG"]
[]
[]
["NOTA 10 - CREDITOS POR VENTAS "]
["En miles de guaranies"]
[]
[]
[]
[]
["Cuentas ","2020-03-31","2019-12-31"]
["Casa de Bolsa Puente ME",13354381956,10266827892]
["CDA Bancop",30921600000,31459200000]
["Puente - Fondos Mutuos ME",0,3560595316]
["Total",{"$f":"SUM($B$11:B13)","v":44275981956},{"$f":"SUM($C$11:C13)","v":45286623208}]

{"sheet":"Nota 11","index":17,"n_rows":32,"n_cols":3,"rows_kept":32,"cut":false,"hidden":false,"merged":[[2,0,2,3]]}
[{"$f":"[1]Indice!C1","v":"NICOLAS GONZALEZ ODDONE S.A.E.C.A"},null,"BG"]
[]
["NOTA 11 – ACTIVOS INTANGIBLES"]
["En miles de guaranies"]
[]
["Las cuentas Activos intengibles se componen como sigue:"]
[]
["Cuentas ","2020-09-30","2019-12-31"]
["Actividad Comercial"]
["Marcas ",{"$f":"54104002-54104002","v":0},0]
["Gastos de Organización",{"$f":"43068550-43068550","v":0},0]
["Gastos de Organización",43068550,43068550]
["Amortización acum. Gastos de Organiz.",-43068550,-43068550]
["Licencias de Informática",3958659725,3308490249]
["Amortización acum. Licenc. de Informática",-2378618849,-1824948895]
["Programas de Informática",3679416087,2762930637]
["Amortización acum. Programas de Inform.",-2408330963,-1782791356]
["Licencias para Teléfonos ",345380986,345380986]
["Amortización acum. Lic. para teléfonos ",-242532776,-178159805]
["Programas de Informática en Línea S.A",342316500,342316500]
["Amortización acum. Program. de inf. en línea",-342316500,-334152417]
["Derechos Aduaneros a regularizar ",0,1311136198]
["Total",{"$f":"SUM(B10:B22)","v":2953974210},{"$f":"SUM(C10:C22)","v":3950202097}]
[]
["Actividad Ganadera "]
["Marca NGO ",{"$f":"599465-599465","v":0},0]
["Marca NGO ",599465,599465]
["Amortización acum. Marcas y señales",-599465,-599465]
["Licencias de Informática Act. Ganadera ",14269091,14269091]
["Amortización acum. Lic. De Informática Act. Ganad.",-13716818,-13302614]
["Total",{"$f":"SUM(B26:B30)","v":552273},{"$f":"SUM(C26:C30)","v":966477}]
["Total general",{"$f":"+B23+B31","v":2954526483},{"$f":"+C23+C31","v":3951168574}]

{"sheet":"Nota 12","index":18,"n_rows":11,"n_cols":5,"rows_kept":11,"cut":false,"hidden":false,"merged":[[3,1,3,2]]}
[{"$f":"Indice!C1","v":"NICOLAS GONZALEZ ODDONE S.A.E.C.A"},null,null,null,"BG"]
[]
["NOTA 12 – GOODWILL"]
["En miles de guaranies"]
["NO APLICA"]
[]
["Goodwill","2020-09-30","2019-12-31"]
[]
[]
[]
["Total general",{"$f":"SUM(B8:B10)","v":0},{"$f":"SUM(C8:C10)","v":0}]

{"sheet":"Nota 13","index":19,"n_rows":39,"n_cols":3,"rows_kept":39,"cut":false,"hidden":false,"merged":[]}
[{"$f":"[1]Indice!C1","v":"NICOLAS GONZALEZ ODDONE S.A.E.C.A"},null,"BG"]
[]
["NOTA 13 – CUENTAS POR PAGAR COMERCIALES "]
["En miles de guaranies"]
[]
["Las cuentas por pagar comerciales se componen como sigue:"]
[]
["Cuentas ","2020-09-30","2019-12-31"]
["Actividad Comercial "]
["Proveedores del Exterior "]
["Brasil Internacional Exportadora LTDA.",0,6262710]
["Whirlpool S.A ",4675401300,5227507902]
["Rational International AG",492081668,742647603]
["Metalúrgica Trapp S.A",548410585,0]
["Whirlpool Chile LTDA.",7407023398,8941522566]
["Groupe Seb Chile Com. LTD",3556701921,0]
["Whirlpool Corporation",20071642,190263055]
["Vitamix Corporation",134691220,0]
["Groupe Seb Chile Com. LTD",0,6441716910]
["Sony Uruguay Branch de Sony Latin ",0,1202350605]
["Metalúrgica Siemsen LTDA.",0,53558182]
["Sony Uruguay Branch de Sony Latin ",1624021650,0]
["Seb do Brasil ",936138966,14004126656]
["José Alladio e Hijos S.A ",382008112,242801154]
["Grupe Seb Colombia ",374693218,813715663]
["Midea Electric Trading (Singapore)",0,43693602]
["Rayovac Argentina S.R.L",648042900,22624000]
["Cem  S.A ",104570400,320465729]
["Ind. e com. de Chopeiras Bibeirao Preto",0,41136960]
["Total",{"$f":"SUM(B11:B29)","v":20903856980},{"$f":"SUM(C11:C29)","v":38294393297}]
[]
["Proveedores Locales "]
["Bancard S.A",17093206,16519711]
["Total ",{"$f":"SUM(B33)","v":17093206},{"$f":"SUM(C33)","v":16519711}]
[]
["Acreedores Varios "]
["Cheques emitidos al Cobro ",0,383640000]
["Total ",{"$f":"SUM(B37)","v":0},{"$f":"SUM(C37)","v":383640000}]
["Total general ",{"$f":"+B30+B34+B38","v":20920950186},{"$f":"+C30+C34+C38","v":38694553008}]

{"sheet":"Nota 14","index":20,"n_rows":26,"n_cols":12,"rows_kept":26,"cut":false,"hidden":false,"merged":[]}
[{"$f":"[1]Indice!C1","v":"NICOLAS GONZALEZ ODDONE S.A.E.C.A"},null,"BG",null,null,null,null,null,null,null,null,"BG"]
[]
["NOTA 14 – DEUDAS BANCARIAS - PRESTAMOS A CORTO PLAZO"]
["En miles de guaranies"]
[]
["Las cuentas Deudas Bancarias se componen como sigue:"]
[]
["Préstamos de Entidades Locales "]
["Por Cartas de Crédito "]
[null,null,null,"2020-09-30",null,null,null,null,null,"2019-12-31"]
["Cuentas ","Vencimiento","Símbolo de Moneda","Moneda"," ","Tipo de Garantía",null,"Vencimiento","Símbolo de Moneda","Moneda","Importe (miles de Gs)","Tipo de Garantía"]
["BBVA Banco ","S/tipo de Negociación","USD",{"$f":"IFERROR(VLOOKUP(C12,'[1]Base de Monedas'!A:B,2,0),\"\")","v":"Dólar estadounidense"},62951128951,"A sola firma ",null,"S/tipo de Negociación","USD",{"$f":"IFERROR(VLOOKUP(I12,'[1]Base de Monedas'!A:B,2,0),\"\")","v":"Dólar estadounidense"},14479624765,"A sola firma "]
["Banco Regional S.A.E.C.A ","S/tipo de Negociación","USD",{"$f":"IFERROR(VLOOKUP(C13,'[1]Base de Monedas'!A:B,2,0),\"\")","v":"Dólar estadounidense"},88783273692,"A sola Firma ",null,"S/tipo de Negociación","USD",{"$f":"IFERROR(VLOOKUP(I13,'[1]Base de Monedas'!A:B,2,0),\"\")","v":"Dólar estadounidense"},51111239849,"A sola firma "]
["Banco GNB","S/tipo de Negociación","USD",{"$f":"IFERROR(VLOOKUP(C14,'[1]Base de Monedas'!A:B,2,0),\"\")","v":"Dólar estadounidense"},0,"A sola firma ",null,"S/tipo de Negociación","USD",{"$f":"IFERROR(VLOOKUP(I14,'[1]Base de Monedas'!A:B,2,0),\"\")","v":"Dólar estadounidense"},13851957436,"A sola firma "]
["Total ",null,null,{"$f":"IFERROR(VLOOKUP(C15,'[1]Base de Monedas'!A:B,2,0),\"\")","v":""},{"$f":"SUM(E12:E14)","v":151734402643},null,null,null,null,{"$f":"IFERROR(VLOOKUP(I15,'[1]Base de Monedas'!A:B,2,0),\"\")","v":""},{"$f":"SUM(K12:K14)","v":79442822050}]
[null,null,null,{"$f":"IFERROR(VLOOKUP(C16,'[1]Base de Monedas'!A:B,2,0),\"\")","v":""},null,null,null,null,null,{"$f":"IFERROR(VLOOKUP(I16,'[1]Base de Monedas'!A:B,2,0),\"\")","v":""}]
["Por Préstamos ",null,null,{"$f":"IFERROR(VLOOKUP(C17,'[1]Base de Monedas'!A:B,2,0),\"\")","v":""},null,null,null,null,null,{"$f":"IFERROR(VLOOKUP(I17,'[1]Base de Monedas'!A:B,2,0),\"\")","v":""}]
["BBVA Banco - Préstamos","2020-11-29","PYG","Guarani",53000000000,"A sola firma ",null,"2020-04-28","PYG",{"$f":"IFERROR(VLOOKUP(I18,'[1]Base de Monedas'!G:H,2,0),\"\")","v":""},42000000000,"A sola firma "]
["Banco Basa - Préstamos ","2020-11-24","PYG","Guarani",13300000000,"A sola Firma ",null,null,null,null,0]
["Total",null,null,null,{"$f":"SUM(E18:E19)","v":66300000000},null,null,null,null,{"$f":"IFERROR(VLOOKUP(I20,'[1]Base de Monedas'!G:H,2,0),\"\")","v":""},{"$f":"SUM(K18)","v":42000000000}]
[]
["Intereses préstamos entidades financieras a pagar"]
["Intereses s/ préstamos bancarios a pagar",null,"PYG","Guarani",1844136986,null,null,"-","PYG","Guarani",787068493,"-"]
["(-) Intereses s/ préstamos bancarios a Vencer ",null,"PYG","Guarani",-590712328,null,null,"-","PYG","Guarani",-773950684,"-"]
["Total",null,null,null,{"$f":"SUM(E23:E24)","v":1253424658},null,null,null,null,null,{"$f":"SUM(K23:K24)","v":13117809}]
["Total general deudas Bancarias ",null,null,{"$f":"IFERROR(VLOOKUP(C26,'[1]Base de Monedas'!A:B,2,0),\"\")","v":""},{"$f":"+E15+E20+E25","v":219287827301},null,null,null,null,null,{"$f":"+K15+K20+K25","v":121455939859}]

{"sheet":"Nota 15","index":21,"n_rows":13,"n_cols":3,"rows_kept":13,"cut":false,"hidden":false,"merged":[[4,1,4,2],[3,0,3,1]]}
[{"$f":"Indice!C1","v":"NICOLAS GONZALEZ ODDONE S.A.E.C.A"},null,"BG"]
[]
["NOTA 15 – PORCION CORRIENTE DE LA DEUDA A LARGO PLAZO"]
["En miles de guaranies"]
["NO APLICA"]
["Porción corriente de la deuda a largo plazo","2020-09-30","2019-12-31"]
["Cuentas por pagar comerciales"]
["Préstamos bancarios"]
["Bonos bursátiles"]
["Intereses bancarios a pagar"]
["Intereses bursatiles a pagar"]
[]
["Total general",{"$f":"SUM($B$7:B12)","v":0},{"$f":"SUM($C$7:C12)","v":0}]

{"sheet":"Nota 16","index":22,"n_rows":20,"n_cols":3,"rows_kept":20,"cut":false,"hidden":false,"merged":[[6,1,6,2],[3,0,3,1]]}
[{"$f":"Indice!C1","v":"NICOLAS GONZALEZ ODDONE S.A.E.C.A"},null,"BG"]
[]
["NOTA 16 – REMUNERACIONES Y CARGAS SOCIALES A PAGAR"]
["En miles de guaranies"]
[]
["Las cuentas cargas sociales se componen como sigue:"]
[]
["Cuentas ","2020-09-30","2019-12-31"]
["Actividad Comercial"]
["Seguro social I.P.S ",518270006,522184621]
["Sueldos y comisiones a Pagar ",163249196,65183217]
["Aguinaldos a Pagar",916529183,0]
["Gratificaciones a Pagar ",0,1443753317]
["Remuneracion Directorio y Gtes a pagar",5324000,0]
["Total",{"$f":"SUM($B$10:B14)","v":1603372385},{"$f":"SUM($C$10:C14)","v":2031121155}]
[]
["Actividad Ganadera "]
["Seguro Social I.P.S a pagar Act. Ganadera ",34007266,23467928]
["Total ",{"$f":"SUM(B18)","v":34007266},{"$f":"SUM(C18)","v":23467928}]
["Total general",{"$f":"+B15+B19","v":1637379651},{"$f":"+C15+C19","v":2054589083}]

{"sheet":"Nota 17","index":23,"n_rows":15,"n_cols":3,"rows_kept":15,"cut":false,"hidden":false,"merged":[[6,1,6,2],[3,0,3,1]]}
[{"$f":"Indice!C1","v":"NICOLAS GONZALEZ ODDONE S.A.E.C.A"},null,"BG"]
[]
["NOTA 17 –  IMPUESTOS A PAGAR"]
["En miles de guaranies"]
[]
["Las cuentas Impuestos a pagar se componen como sigue:"]
[]
["cuentas ","2020-09-30","2019-12-31"]
["Impuesto al Valor Agregado ",1489834082,1258509840]
["Retenciones de Impuestos ",2977042,19448130]
["Impuesto a la renta a pagar",2646424801,0]
["Retencion de Impuesto Prov.Locales ",177287889,230034736]
["IDU a pagar ",0,0]
["IVA aduana a pagar ",542719949,0]
["Total Impuestos a pagar",{"$f":"SUM(B9:B14)","v":4859243763},{"$f":"SUM(C9:C14)","v":1507992706}]

{"sheet":"Nota 18","index":24,"n_rows":48,"n_cols":3,"rows_kept":48,"cut":false,"hidden":false,"merged":[[2,0,2,3]]}
[{"$f":"Indice!C1","v":"NICOLAS GONZALEZ ODDONE S.A.E.C.A"},null,"BG"]
[]
["NOTA 18 -  PROVISIONES"]
["En miles de guaranies"]
[]
["Provisiones Moneda Local "]
["Cuentas ","2020-09-30","2019-12-31"]
["Actividad Comercial"]
["Publicidad a Pagar ",3568886993,5932990175]
["Cuentas a pagar",3282095326,3440249561]
["Fletes a pagar",64995866,507982316]
["Seguros a Pagar ",725545136,142031260]
["Despachantes - Ctas. a Pagar ",106692090,284111600]
["Remuneración síndico a pagar ",0,14889234]
["Honorarios Profesionales a Pagar",160395900,110925760]
["Cuentas a pagar - Tarjetas",17596401,34171369]
["Cuentas a Pagar - Vales ",94060000,228978950]
["Cuentas a Pagar Instaladores ",529666570,894887184]
["Seguros a Vencer ",-586652526,-194533541]
["Cuentas a Vencer ",-16703276,-26851091]
["Viáticos a Reembolsar",1485000,890133]
["Total",{"$f":"SUM(B9:B21)","v":7948063480},{"$f":"SUM(C9:C21)","v":11370722910}]
[]
["Provisiones Moneda Extranjera"]
["Publicidad a Pagar M.E",57576630,215509760]
["Cuentas a pagar M.E",3197590808,1358242834]
["Fletes a pagar M.E",4677479846,4652368886]
["Seguros a pagar M.E",432647797,121250355]
["Honorarios Profesionales M.E a pagar",8982150,2488640]
["Intereses M.E a devengar ",683264634,462553103]
["Seguros M.E a vencer ",-19671517,-757970]
["Cuentas ME  vencer ",-924774,0]
["Total",{"$f":"SUM($B$25:B32)","v":9036945574},{"$f":"SUM($C$25:C32)","v":6811655608}]
["Total General Provisiones Act. Comercial ",{"$f":"+B22+B33","v":16985009054},{"$f":"+C22+C33","v":18182378518}]
[]
[]
[]
["Actividad Ganadera "]
["Provisiones Moneda Local "]
["Seguros a pagar Act. Ganadera",18280000,2154000]
["Cuentas a pagar Act. Ganadera ",1132321016,119573677]
["Seguros a Vencer Act. Ganadera ",-15875581,-1493852]
["Total",{"$f":"SUM($B$40:B42)","v":1134725435},{"$f":"SUM($C$40:C42)","v":120233825}]
[]
["Provisiones Moneda Extranjera"]
["Cuentas a pagar M.E Act. Ganadera ",305338299,153834150]
["Total",{"$f":"SUM($B$46:B46)","v":305338299},{"$f":"SUM($C$46:C46)","v":153834150}]
["Total General Provisiones Act. Ganadera ",{"$f":"+B43+B47","v":1440063734},{"$f":"+C43+C47","v":274067975}]

{"sheet":"Nota 19","index":25,"n_rows":24,"n_cols":3,"rows_kept":24,"cut":false,"hidden":false,"merged":[[3,0,3,1]]}
[{"$f":"Indice!C1","v":"NICOLAS GONZALEZ ODDONE S.A.E.C.A"},null,"BG"]
[]
["NOTA 19 – OTROS PASIVOS CORRIENTES "]
[]
["Otros Pasivos corrientes Moneda Local "]
["cuentas ","2020-09-30","2019-12-31"]
["Anticipos de Clientes ",22194579,4510913453]
["Garantías de Alquiler ",110599000,104149000]
["Señas ",4336678,4336678]
["Anticipos Varios ",492838803,520575006]
["Comisiones S/Vtas. A pagar",80150395,69465892]
["Dividendos a Pagar ",0,0]
["Total ",{"$f":"SUM(B7:B12)","v":710119455},{"$f":"SUM(C7:C12)","v":5209440029}]
[]
["Otros Pasivos Corrientes Moneda Extranjera"]
["Anticipos de clientes M.E",451468150,1584567331]
["Garantías de Alquiler M.E",42988500,39753600]
["Total ",{"$f":"SUM(B16:B17)","v":494456650},{"$f":"SUM(C16:C17)","v":1624320931}]
[]
[]
["Ingresos No Devengados "]
["Ingresos no devengados",1688055052,3440129837]
["Total ",{"$f":"SUM(B22)","v":1688055052},{"$f":"SUM(C22)","v":3440129837}]
["Total general Otros Pasivos Corrientes ",{"$f":"+B13+B18+B23","v":2892631157},{"$f":"+C13+C18+C23","v":10273890797}]

{"sheet":"Nota 20","index":26,"n_rows":13,"n_cols":3,"rows_kept":13,"cut":false,"hidden":false,"merged":[[2,0,2,3]]}
[{"$f":"Indice!C1","v":"NICOLAS GONZALEZ ODDONE S.A.E.C.A"},null,"BG"]
[]
["NOTA 20 – CAPITAL INTEGRADO"]
[]
["Cuentas ","2020-09-30","2019-12-31"]
["Capital ",{"$f":"+B7+B8+B9+B10","v":643227002000},{"$f":"+C7+C8+C9+C10","v":643227002000}]
["Capital Suscripto ",800000000000,800000000000]
["Capital a Integrar",-164958100000,-164958100000]
["Acciones en tesorería ",-144200000,-144200000]
["Premio de Emisión ",8329302000,8329302000]
["Cantidad de Acciones ",6348977,6348977]
["Valor Nominal de Acciones",100000,100000]
["Total",{"$f":"SUM(B7:B10)","v":643227002000},{"$f":"SUM(C7:C10)","v":643227002000}]

{"sheet":" Nota 21","index":27,"n_rows":38,"n_cols":3,"rows_kept":38,"cut":false,"hidden":false,"merged":[[2,0,2,5],[3,0,3,1]]}
[{"$f":"Indice!C1","v":"NICOLAS GONZALEZ ODDONE S.A.E.C.A"},null,"BG"]
[]
["NOTA 21 – RESERVAS"]
["En miles de guaranies"]
[null,"2020-09-30","2019-12-31"]
[]
["a.1 Reserva de revalúo Ley 125/91 ",{"$f":"57008661721+33978554091+472930672+107394557","v":91567541041},{"$f":"57008661721+33978554091+472930672+107394557","v":91567541041}]
["a.2 Reserva de revalúo Técnico ",87405000939,87405000939]
["Total",{"$f":"SUM(B7:B8)","v":178972541980},{"$f":"SUM(C7:C8)","v":178972541980}]
[]
[]
[]
["b.1 Reserva legal",49691949474,45971644656]
["b.2 Reserva legal CPH",506745718,506745718]
["Total",{"$f":"SUM(B13:B14)","v":50198695192},{"$f":"SUM(C13:C14)","v":46478390374}]
[]
[]
["c Reservas estatutarias"]
[]
[]
[]
["d Reservas facultativas",{"$f":"+SUM($B$23:B28)","v":0},{"$f":"+SUM($C$23:C28)","v":0}]
["d.1. (nuevas cuentas a incluir)"]
["d.2. (nuevas cuentas a incluir)"]
[]
[]
[]
[]
[]
["c. Reserva para Capitalización ",80120680209,34528344662]
["Total",{"$f":"SUM(B30)","v":80120680209},{"$f":"SUM(C30)","v":34528344662}]
[]
[]
[]
[]
["Correspondiente a las Acciones en Tesoreria"]
["* Prima de compra de Acciones",-47385000,-47385000]
["Total general Reservas ",{"$f":"B9+B15+B31+B37","v":309244532381},{"$f":"+C9+C15+C31+C37","v":259931892016}]

{"sheet":"Nota 22","index":28,"n_rows":10,"n_cols":3,"rows_kept":10,"cut":false,"hidden":false,"merged":[[4,1,4,2],[3,0,3,1]]}
[{"$f":"Indice!C1","v":"NICOLAS GONZALEZ ODDONE S.A.E.C.A"},null,"BG"]
[]
["NOTA 21 –  DIFERENCIA TRANSITORIA POR CONVERSION"]
["En miles de guaranies"]
["NO APLICA"]
[null,"2020-09-30","2019-12-31"]
["Diferencia transitoria por conversión"]
[]
[]
[null,"-","-"]

{"sheet":"Nota 23","index":29,"n_rows":9,"n_cols":3,"rows_kept":9,"cut":false,"hidden":false,"merged":[[4,1,4,2],[3,0,3,1]]}
[{"$f":"Indice!C1","v":"NICOLAS GONZALEZ ODDONE S.A.E.C.A"},null,"BG"]
[]
["NOTA 23 –  RESULTADOS ACUMULADOS"]
["En miles de guaranies"]
[]
["Cuenta","2020-09-30","2019-12-31"]
["Resultado de ejercicios anteriores",0,0]
["Resultado del ejercicio ",67413551673,74406096363]
["Totales",{"$f":"SUM($B$7:B8)","v":67413551673},{"$f":"SUM($C$7:C8)","v":74406096363}]

{"sheet":"Nota 24","index":30,"n_rows":10,"n_cols":3,"rows_kept":10,"cut":false,"hidden":false,"merged":[[4,1,4,2],[3,0,3,1]]}
[{"$f":"Indice!C1","v":"NICOLAS GONZALEZ ODDONE S.A.E.C.A"},null,"BG"]
[]
["NOTA 24 –  INTERES MINORITARIO"]
["En miles de guaranies"]
["NO APLICA"]
[null,"2020-09-30","2019-12-31"]
["Interes Minoritario"]
[]
[]
[null,"-","-"]

{"sheet":"Nota 25","index":31,"n_rows":19,"n_cols":3,"rows_kept":19,"cut":false,"hidden":false,"merged":[[6,1,6,2],[3,0,3,1]]}
[{"$f":"Indice!C1","v":"NICOLAS GONZALEZ ODDONE S.A.E.C.A"},null,"ER"]
[]
["NOTA 25 –  VENTAS"]
["En miles de guaranies"]
[]
["Las Ventas netas al 30 de setiembre de 2020 y 2019 son las siguientes:"]
[]
["Cuentas ","2020-09-30","2019-09-30"]
["Ventas Actividad Comercial "]
["ventas al contado de Mercaderías ",{"$f":"16403071108+422288860048","v":438691931156},{"$f":"16597312597+406149375098","v":422746687695}]
["Venta de Repuestos ",4010042494,4635195970]
["Ventas Servicio Técnico",1495229208,1321251850]
["Total Ventas Actividad Comercial ",{"$f":"SUM(B10:B12)","v":444197202858},{"$f":"SUM(C10:C12)","v":428703135515}]
[]
[]
["Ventas Actividad Ganadera "]
["Ventas Activ. Ganadera ",2238200982,7397614694]
["Ventas Activ. Ganadera capitalización",870739223,0]
["Total Ventas Actividad  Ganadera",{"$f":"SUM(B17:B18)","v":3108940205},{"$f":"SUM(C17)","v":7397614694}]

{"sheet":"Nota 26","index":32,"n_rows":18,"n_cols":3,"rows_kept":18,"cut":false,"hidden":false,"merged":[]}
[{"$f":"Indice!C1","v":"NICOLAS GONZALEZ ODDONE S.A.E.C.A"},null,"ER"]
[]
["NOTA 26 - COSTO DE VENTAS"]
["Miles de guaraníes"]
[]
["Costo de ventas","2020-09-30","2019-09-30"]
["Comercial "]
["Existencia inicial del inventario",323834508963,337291591520]
["+ Compra de bienes y servicios",299389678730,236376570532]
["+ Costo de producción"]
["- Existencia final de inventario",-309702144812,-273395038490]
["Ganadera "]
["Existencia inicial del inventario",22025480989,21936412500]
["+ Compra de bienes y servicios",null,0]
["+ Costo de producción"]
["- Existencia final de inventario",-11594997745,-23212962500]
["Tranferencia por reclasificacion de ganado/VM",-7321543039,5384800798]
["Total costo de ventas ",{"$f":"SUM(B8:B17)","v":316630983086},{"$f":"SUM(C8:C17)","v":304381374360}]

{"sheet":"Nota 27","index":33,"n_rows":35,"n_cols":7,"rows_kept":35,"cut":false,"hidden":false,"merged":[[4,0,4,7],[7,0,8,0]]}
[{"$f":"Indice!C1","v":"NICOLAS GONZALEZ ODDONE S.A.E.C.A"},null,"ER"]
[]
["NOTA 27 - GASTOS"]
["Miles de guaraníes"]
[]
["El rubro está compuesto de la siguiente forma: "]
[]
["Cuentas ",null,"2020-09-30",null,null,"2019-09-30"]
[null,"Gastos de Ventas","Gastos Administrativos","Total","Gastos de Ventas","Gastos Administrativos","Total"]
["Movilidad y viáticos",{"$f":"409681186+22329731+19601906+14988235+491128+27531998+5661000","v":500285184},{"$f":"8020641+2658273","v":10678914},{"$f":"+C10+B10","v":510964098},{"$f":"508304142+470182+356375+40751488+4947075+36828169","v":591657431},{"$f":"14865678","v":14865678},{"$f":"+F10+E10","v":606523109}]
["Combustibles y lubricantes ",{"$f":"51758962+32590284+60947710+103006347+1203837","v":249507140},{"$f":"64470365+20382800+572244+7756781+286418","v":93468608},{"$f":"+B11+C11","v":342975748},{"$f":"31625568+126890647+1454382","v":159970597},{"$f":"66873149+3020089+3553250+585000","v":74031488},{"$f":"+F11+E11","v":234002085}]
["Gastos de alquiler",{"$f":"162945021+956235243+28433796+13310000+117000000","v":1277924060},{"$f":"181245000+13752069","v":194997069},{"$f":"+C12+B12","v":1472921129},{"$f":"238509840+3025326696+156277331+22196000","v":3442309867},{"$f":"167475000+11636368","v":179111368},{"$f":"+F12+E12","v":3621421235}]
["Computación y redes",null,null,0,null,null,{"$f":"+F13+E13","v":0}]
["Gastos por servicios",null,null,0,null,null,0]
["Honorarios profesionales y asesoramiento",{"$f":"37535395+662641365+99804815+12736364","v":812717939},{"$f":"5806566048+33065456+2562500+62178483","v":5904372487},6717090426,{"$f":"115156824+5381284+91315000+56367382","v":268220490},{"$f":"4028152470+1462536+67943712+14837500+127971325","v":4240367543},4508588033]
["Impuestos y tasas",{"$f":"3419300","v":3419300},{"$f":"1125768076-440745766","v":685022310},688441610,5746936,{"$f":"1343007461-675717813","v":667289648},673036584]
["Gastos de reparación y mantenimiento",{"$f":"31874385+265117347+119420163+39945566+24940819","v":481298280},{"$f":"270101310+637966210+185109140","v":1093176660},1574474940,{"$f":"51471905+343182+523922661+27719502+39607021+90370910","v":733435181},{"$f":"503899340","v":503899340},1237334521]
["Seguros pagados",{"$f":"909091+141303796+16809927+1120797","v":160143611},{"$f":"40968821+30045914+898380+27588654+53885273","v":153387042},313530653,{"$f":"13016022+116672327+3016260+16517577","v":149222186},{"$f":"29126895+22725566+611955+24527421+49596319","v":126588156},275810342]
["Otros gastos de operación",null,null,0,null,null,0]
["Remuneraciones de administradores, directores, síndicos y consejo de vigilancia",null,{"$f":"693330000+38115000+44667702","v":776112702},776112702,0,{"$f":"686070000+38115000+40607001","v":764792001},764792001]
["Sueldos y Jornales",{"$f":"2327335118+3810161+2782391494+41286457+31900000+541926158+116776000+3682092088+1199858+64995000+1259006851+44458889+11128000+326137650+24785720","v":11259229444},{"$f":"2487576658+245123360+81135754+87990000+230352+324011685+1019066634+518452344+448725963","v":5212312750},16471542194,{"$f":"2338258444+637486+2732751234+57312650+174674005+53136580+25370085+578916795+180555923+2835106951+96908+51480000+1259383707+53507028+338819074+34604888","v":10714611758},{"$f":"2270174511+298285239+58124428+88305000+125191+178607616+663665829+100470000+336120589+1582347+142546873+27955000+93076924+57320000","v":4316359547},15030971305]
["Contribuciones Sociales",{"$f":"124692818+145700000+900559572+33769733+283179537+872549+283052+1600000+108949687+1973556+35815231+72813045+297449675+668626206+72911922+243092561+31543114+54678044+283416198+8442434+92041495+9942797+13157034+61713835+1754272+20535531","v":3569513898},{"$f":"46633806+66908334+483017350+22366968+166085834+60000000+2458000+5250000+54733744+17072966+168145997+54421484+85544636+986778+31229362+74039781+986778+24793387","v":1364675205},4934189103,{"$f":"57317388+74230710+878126646+29989282+384580357+1000000+20168833+9776667+129264006+657852+61271680+89635860+147263577+506881083+66104988+168103786+26016197+78615805+303608359+12827892+103170875+1000000+39297783+22464195+71805704+3717050+33436283","v":3320332858},{"$f":"69668657+19367613+448077429+18701656+156120360+8458704+6750000+31979690+10228720+22827000+128396865+36758902+6287634+12982098+58639409+422512+22061697+613333+8050000+29562260+2120588+12807827+20855493+1666667","v":1133405114},4453737972]
["Gastos del personal y capacitación",{"$f":"3656622+161429991+1872727+20681818+449515575+300000+391333+35779400+34093044+9753361+11173500+296053926+25279855+3552960+4620000+82915650+126649642+6840944+5543000+1150000+32970000+1995663+160000","v":1316379011},{"$f":"184244090+5451565+10329315+400000+727975+10566000+2600000+15930000+618596+25890000+159035+8500905+2103000+26745000+997783+809091+3015000+5050000+12735000+175480+3510000+13108497+2450000","v":336116332},{"$f":"+C23+B23","v":1652495343},{"$f":"43366921+240270600+111894818+155719556+2656444+31995000+26027859+1146555+39725702+8014570+274303000+18642856+9733636+11500000+48139484+141005584+4955338+22095750+181818+66255893+43635000+318180","v":1301584564},{"$f":"167341027+17001350+529330+18044909+815943+9690000+1424567+9381791+16080000+2293461+2833635+6460000+15858075+2505466+22254317+14673637+6500000+422845+15645000+763376+468000+465000+4256181+500000+2000000","v":338207910},1639792474]
["Comisiones a Vendedores ",1413745439,0,{"$f":"+C24+B24","v":1413745439},1399929103,0,1399929103]
["Honorarios por servicios técnicos",{"$f":"10570909+293824974","v":304395883},0,{"$f":"+C25+B25","v":304395883},{"$f":"25222723+29395953","v":54618676},0,54618676]
["Gastos de Publicidad y Propaganda",12236065663,0,12236065663,16448924732,0,16448924732]
["Intereses, multas y recargos impositivos",0,{"$f":"440745766+529444","v":441275210},441275210,0,{"$f":"675717813+1641290","v":677359103},677359103]
["Intereses a bancos e instituciones financieras",null,null,0,null,null,0]
["Depreciación bienes de uso",0,{"$f":"755600629+616046477+358150215+1608451511+393407418+1229496159+91879369+417929490","v":5470961268},5470961268,0,{"$f":"626663664+547632451+348217799+1503493977+500876985+1495922538+231792100+529292631","v":5783892145},5783892145]
["Amortización activos intangibles",0,{"$f":"3760161+32337385+553669954+625539607+64372971+8164083","v":1287844161},1287844161,0,{"$f":"424862130+468444442+47036093+49618719","v":989961384},989961384]
["Previsiones",null,null,0,null,null,0]
["Gastos de Distribución",4352208402,0,4352208402,4012359282,0,4012359282]
["Costos de Servicios prestados"]
["Otros",{"$f":"330084604606-310749910142+14417823441+13325784958+3297407832-331669701+3032427479-2440463038-B10-B11-B12-B15-B17-B18-B21-B22-B23-B25-B26-B32-B24-B16","v":12699172181},{"$f":"21678240157+2596390749+456549317+891506276+581568762-C10-C11-C12-C15-C16-C17-C18-C20-C21-C22-C23-C27-C29-C30","v":3179854543},{"$f":"+C34+B34","v":15879026724},{"$f":"317950623876-297341612122+19728464202+14274864098+3200292064-241317681+3634312556-2690193759-E10-E11-E12-E15-E16-E17-E18-E21-E22-E23-E24-E25-E26-E27-E29-E30-E32","v":15912509573},{"$f":"21125117627+340476497+1459492416+860464425+248138272+177924478-F10-F11-F12-F15-F16-F17-F18-F20-F21-F22-F23-F27-F29-F30","v":4401483290},{"$f":"+F34+E34","v":20313992863}]
["Total",{"$f":"+SUM($B$10:B34)","v":50636005435},{"$f":"+SUM($C$10:C34)","v":26204255261},{"$f":"+SUM($D$10:D34)","v":76840260696},{"$f":"SUM(E10:E34)","v":58515433234},{"$f":"+SUM($F$10:F34)","v":24211613715},{"$f":"+SUM($G$10:H34)","v":82727046949}]

{"sheet":"Nota 28","index":34,"n_rows":74,"n_cols":7,"rows_kept":74,"cut":false,"hidden":false,"merged":[[7,1,7,2],[46,0,46,4],[2,0,2,6]]}
[{"$f":"Indice!C1","v":"NICOLAS GONZALEZ ODDONE S.A.E.C.A"},null,"ER"]
[]
["Nota 28 - Otros Ingresos y gastos operativos"]
["Miles de guaraníes"]
[]
["El rubro está compuesto de la siguiente forma: "]
[]
["Otros Ingresos ",null,null,null,"Otros gastos"]
["Cuentas ","2020-09-30","2019-09-30",null,"Cuentas ","2020-09-30","2019-09-30"]
["Actividad Comercial ",null,null,null,"Actividad Ganadera"]
["Créditos Recuperados ",844772682,277963947,null,"Gastos Administrativos ",-563193376,-588849479]
["Reembolso de Seguros Gr.",83121344,223170958,null,"Gastos de Explotación",-3995786934,-3626839033]
["Ingresos por comisiones",651901,0,null,"Depreciación Bienes de uso ",{"$f":"-1423930747-450155443","v":-1874086190},{"$f":"-1414742286-619209020","v":-2033951306}]
["Ingresos Varios GR.",98130230,6787280,null,"Amortización Licencias Informática",-414204,-414205]
["Otros ingresos Varios GR.",85122143,28378005,null,"Gastos de Ventas ",-33750400,-141878272]
["Diferencias de Inventarios",152596776,60938229,null,"Gastos de Ventas Capitalización",-348582194,-1495553709]
["Ingresos por servicios de Logística ",916771818,632759865,null,"Diferencias de Cambios Act. Ganad.",-28224537,-13290834]
["Ingresos varios de logística ",25507347,24004271,null,"Total",{"$f":"SUM(F11:F17)","v":-6844037835},{"$f":"SUM(G11:G17)","v":-7900776838}]
["Ingresos varios de T.I",17509799,0]
["Fletes cobrados ",12509357,37850862]
["Desafectación de Mercad. y Rep c/Obsol.",{"$f":"3267689301+3847207127+182029347+2792563","v":7299718338},{"$f":"730938924+35300518+173646704+1004748","v":940890894}]
["Otros ingresos Varios de ventas ",86291136,139429589]
["Ingresos varios GR.de ventas ",819746232,855564574]
["Publicidad cobrada",986102920,940713048]
["Aporte publicitario del Exterior ",829450716,691342570]
["Ingresos varios de Marketing",40634650,4500000]
["Otros Ingresos varios GR-repuestos ",24110014,1825498]
["Servicio de Delivery - Repuestos",1698668,7359029]
["Servicio de Delivery - ST",141007834,167408390]
["Ingresos por servicios varios ST ",102761784,0]
["Otros ingresos varios ST ",17668193,624350207]
["Otros ingresos varios Gr ST ",1582500,0]
["Ingresos por acuerdos comerciales ",443438021,0]
["Ingresos extraordinarios -devoluc.der.Aduan.",128974090,0]
["Ingresos varios Avion ",32734372,0]
["Total Otros Ingresos Act. Comerc.",{"$f":"SUM(B11:B35)","v":13192612865},{"$f":"SUM(C11:C35)","v":5665237216}]
[]
["Actividad Ganadera"]
["Resultados vta. Activo fijo act. ganadera",0,19090909]
["Ingresos Varios ",14065443,10393580]
["Diferencias de Cambios ",1738355,5325363]
["Valor Neto de Realización ",1143174233,6725825568]
["Total Otros Ingresos Act.Ganad.",{"$f":"SUM($B$40:B42)","v":1158978031},{"$f":"SUM($C$39:C42)","v":6760635420}]
["Total General Otros Ingresos ",{"$f":"+B36+B43","v":14351590896},{"$f":"C36+C43","v":12425872636}]
[]
[]
["Nota 28.1 - Otros Ingresos y gastos no operativos"]
[null,null,"ER"]
[]
["El rubro está compuesto de la siguiente forma: "]
[]
["Cuentas ","2020-09-30","2019-09-30"]
["Alquileres ganados ",1276982368,1143585441]
["Otros ingresos de Inversiones Inmob.",23003640,26507955]
["Ipuesto Inmobiliario ",-73626456,-86424820]
["Impuesto Inmobiliario no ded.",-7320056,-663802]
["Patentes y tasas municipales",-123722761,-90439778]
["Impuestos, patentes y tasas munic. No ded.",-7670500,-10982646]
["Depreciaciones Edificios de Invers.",-293620277,-356503830]
["Mant. y reparación de edificios de Invers. ",-868181,-39181819]
["Seguros de Edificios de invers.",-4314986,-3858728]
["Gastos varios de Invers.",-169344996,-216884723]
["Gastos varios de Invers. Gnd",-22357206,-15452270]
["Servicios de seguridad. ",-143981813,-50779997]
["Malos créditos de Invers. Inmob.",0,-86825000]
["Pérdida en vta. Bienes de uso ",0,-30118543]
["Pérdida por Siniestros ",0,-443712]
["Total",{"$f":"SUM($B$53:B65)","v":453158776},{"$f":"SUM($C$53:C67)","v":181533728}]
[]
[]
["Cuentas ","2020-09-30","2019-09-30"]
["Resultado de ejercicios anteriores ",-514464,-16362216]
["Total",{"$f":"+B72","v":-514464},{"$f":"+C72","v":-16362216}]
["Total General Otros Resultados no operativos ",{"$f":"+B68+B73","v":452644312},{"$f":"+C68+C72","v":165171512}]

{"sheet":"Nota 29","index":35,"n_rows":31,"n_cols":7,"rows_kept":31,"cut":false,"hidden":false,"merged":[]}
[{"$f":"Indice!C1","v":"NICOLAS GONZALEZ ODDONE S.A.E.C.A"},null,"ER"]
[]
["NOTA 29 - INGRESOS Y GASTOS FINANCIEROS NETOS"]
["Miles de guaraníes"]
[]
["El rubro está compuesto de la siguiente forma: "]
[]
["Ingresos Financieros Netos ",null,null,null,"Gastos Financieros netos"]
["Cuentas ","2020-09-30","2019-09-30",null,"Cuentas ","2020-09-30","2019-09-30"]
["Intereses Cajas de ahorro",199658915,199868640,null,"Intereses y com. Bancarios ",-10344457,-19871456]
["Diferencias de Cambios GR. Financ.",21237549682,19715653181,null,"Intereses y com.S/Prest.Bancarios ",-1265515567,-2214877083]
["Intereses p/ Refinanciaciones Grav.",3087974999,2249158537,null,"Interes y com. Banc. No deduc.",0,-376200]
["Intereses Cobrados ",85312677,0,null,"Diferencias de cambios GR.Gtos. Financ.",-11468976965,-15136779520]
["Intereses p/ Vta. A credito Grav.",344774073,0,null,"Diferencias de cambios Gtos. Financ.",-996030,0]
["Total ingresos financieros",{"$f":"SUM($B10:B14)","v":24955270346},{"$f":"SUM(C10:C14)","v":22164680358},null,"Total gastos financieros",{"$f":"SUM(F10:F14)","v":-12745833019},{"$f":"SUM(G10:G14)","v":-17371904259}]
[]
[null,null,null,null,null,{"$f":"1275860024+11469972995","v":12745833019},{"$f":"2235124739+15136779520","v":17371904259}]
[]
[]
[]
["NOTA 29.1 - INGRESOS Y GASTOS  DE INVERSIONES FINANCIERAS"]
[null,null,"ER"]
["El rubro está compuesto de la siguiente forma: "]
[]
["Ingresos de Inversión Financiera",null,null,null,"Gastos de Inversión Financiera"]
["Cuentas ","2020-09-30","2019-09-30",null,"Cuentas ","2020-09-30","2019-09-30"]
["Intereses por Inversiones financieras ",1863181585,1329102812,null,"Intereses y com. Por invers. Financieras",-560800,0]
["Total Ingresos de Inv. Financ.",{"$f":"SUM(B27)","v":1863181585},{"$f":"SUM(C27)","v":1329102812},null,"Pérdidas por valuacion ",-170066289,0]
[null,null,null,null,"Intereses y com.p/Invers. Financ. EX",-18576250,0]
[null,null,null,null,"Intereses y com. Pag. p/Invers.en bonos ",0,-70992581]
[null,null,null,null,"Total Gatos de Inv. Financiera",{"$f":"SUM(F27:F30)","v":-189203339},{"$f":"SUM(G27:G30)","v":-70992581}]

{"sheet":"Nota 30","index":36,"n_rows":14,"n_cols":3,"rows_kept":14,"cut":false,"hidden":false,"merged":[]}
[{"$f":"Indice!C1","v":"NICOLAS GONZALEZ ODDONE S.A.E.C.A"},null,"ER"]
[]
["Nota 30 - Resultado de inversiones en asociadas"]
["Miles de guaraníes"]
[]
[]
["Resultado de inversiones en asociadas"]
["(Detallar cuenta)","2020-09-30","2019-09-30"]
[]
[]
[]
["Total"]
[null,{"$f":"-C13","v":0},0]
["El resultado de las inversiones en las empresas asociadas, son reconocidas al cierre de año, aplicando el VPP. "]

{"sheet":"Nota 31","index":37,"n_rows":15,"n_cols":3,"rows_kept":15,"cut":false,"hidden":false,"merged":[[3,0,3,1],[4,1,4,2]]}
[{"$f":"Indice!C1","v":"NICOLAS GONZALEZ ODDONE S.A.E.C.A"},null,"ER"]
[]
["Nota 31 - Resultado participación minoritaria"]
["Miles de guaraníes"]
["NO APLICA"]
[]
["Resultado participación minoritaria","2020-09-30","2019-09-30"]
["(Detallar cuenta)"]
[]
[]
[]
[]
[]
[]
["Total",0,0]

{"sheet":"Nota 32","index":38,"n_rows":9,"n_cols":3,"rows_kept":9,"cut":false,"hidden":false,"merged":[[4,1,4,2]]}
[{"$f":"Indice!C1","v":"NICOLAS GONZALEZ ODDONE S.A.E.C.A"},null,"ER"]
[]
["Nota 32 - IMPUESTO A LA RENTA"]
["En miles de guaraníes"]
[]
["Cuentas ","2020-09-30","2019-09-30"]
["Impuesto a la renta ",8264960554,6098483608]
["Impuesto a la renta adic. p/ distrib. Utilid.",0,971108807]
["Total",{"$f":"SUM($B7:B8)","v":8264960554},{"$f":"SUM($C7:C8)","v":7069592415}]

{"sheet":"Nota 33","index":39,"n_rows":14,"n_cols":3,"rows_kept":14,"cut":false,"hidden":false,"merged":[[3,0,3,1]]}
[{"$f":"Indice!C1","v":"NICOLAS GONZALEZ ODDONE S.A.E.C.A"},null,"ER"]
[]
["Nota 33 - Resultado extraordinario neto de impuesto a la renta"]
["En miles de guaraníes"]
["NO APLICA"]
[null,"2020-09-30","2019-09-30"]
["Conceptos"]
["(Detallar)"]
[]
[]
[]
[]
[]
["Total",{"$f":"SUM($B7:B13)","v":0},{"$f":"SUM($C7:C13)","v":0}]

{"sheet":"Nota 34","index":40,"n_rows":11,"n_cols":3,"rows_kept":11,"cut":false,"hidden":false,"merged":[[3,0,3,1]]}
[{"$f":"Indice!C1","v":"NICOLAS GONZALEZ ODDONE S.A.E.C.A"},null,"ER"]
[]
["Nota 34 - Resultado sobre actividades discontinuadas neto de impuesto a la renta"]
["En miles de guaraníes"]
["NO APLICA"]
["Resultado sobre actividades discontinuadas neto de impuesto a la renta","2020-09-30","2019-09-30"]
[]
["(nueva cuenta a incluir)"]
["Subtotal"]
["- Impuesto a la renta"]
["Total",{"$f":"SUM($B7:B10)","v":0},{"$f":"SUM($C7:C10)","v":0}]

{"sheet":"Nota 35","index":41,"n_rows":13,"n_cols":5,"rows_kept":13,"cut":false,"hidden":false,"merged":[[12,0,12,6],[13,0,13,6]]}
[{"$f":"Indice!C1","v":"NICOLAS GONZALEZ ODDONE S.A.E.C.A"},null,"ER",null,"ER"]
[]
["NOTA 35- UTILIDAD (PÉRDIDA) NETA DEL AÑO Y POR ACCION ORDINARIA"]
[]
["Cuentas","2020-09-30","2019-09-30"]
["Cantidad de Acciones Ordinarias Nominativas Clase A",{"$f":"3792182","v":3792182},1791010]
["Cantidad de Acciones Ordinarias Nominativas Clase B",1355574,640224]
["Cantidad de Acciones Preferidas Nominativas Clase C ",1201220,567324]
["Total Acciones ",{"$f":"SUM(B6:B8)","v":6348976},{"$f":"SUM(C6:C8)","v":2998558}]
["Utilidad Neta",{"$f":"ER!C36","v":67413551673},{"$f":"ER!D36","v":52663890125}]
["Utilidad Neta por Acción Ordinaria",{"$f":"IFERROR(B10/B9,0)","v":10618.019610248959},{"$f":"IFERROR(C10/C9,0)","v":17563.072024953326}]
[]
["La Sociedad calcula la utilidad neta por acción sobre la base de la utilidad  del año y el total de acciones ordinarias integradas con valor nominal de G. 100.000 cada una.Las acciones ordinarias nominativas clase A tienen derecho a 5 votos, las acciones ordinarias  nominativas clase B tienen derecho a 4 votos, en tanto que las acciones preferidas nominativas clase C tienen derecho a Rest. de 1 voto."]

{"sheet":"Nota 36","index":42,"n_rows":15,"n_cols":5,"rows_kept":15,"cut":false,"hidden":false,"merged":[[4,0,4,8],[2,0,2,4]]}
[{"$f":"Indice!C1","v":"NICOLAS GONZALEZ ODDONE S.A.E.C.A"},null,null,"Indice"]
[]
["NOTA 36 - ACTIVOS GRAVADOS"]
["NO APLICA"]
["Los siguientes bienes de propiedad de la Sociedad han sido hipotecados y prendados en garantía de obligaciones financieras."]
[]
[{"$f":"IFERROR(\"Al \"&DAY(Indice!B3)&\" de \"&VLOOKUP(MONTH(Indice!B3),Indice!S:T,2,0)&\" de \"&YEAR(Indice!B3-365),\"Al dia... de mes… de año 2XX1…\")","v":"Al dia... de mes… de año 2XX1…"}]
["Tipo de Activo","Datos  del activo gravado","Tipo de garantía","Importe (indicar   moneda)","A favor de"]
[]
[]
[]
[]
[]
[{"$f":"IFERROR(\"Al \"&DAY(Indice!B3)&\" de \"&VLOOKUP(MONTH(Indice!B3),Indice!S:T,2,0)&\" de \"&YEAR(Indice!B3-1),\"Al dia... de mes… de año 2XX2…\")","v":"Al dia... de mes… de año 2XX2…"}]
["Tipo de Activo","Datos  del activo gravado","Tipo de garantía","Importe (indicar   moneda)","A favor de"]

{"sheet":"Nota 37","index":43,"n_rows":16,"n_cols":4,"rows_kept":16,"cut":false,"hidden":false,"merged":[[15,0,15,7],[5,0,5,8],[6,0,6,8],[11,0,12,7]]}
[{"$f":"Indice!C1","v":"NICOLAS GONZALEZ ODDONE S.A.E.C.A"},null,null,"Indice"]
[]
["NOTA 37 - CONTINGENCIAS Y COMPROMISOS "]
[]
["NO APLICA"]
["(Esta nota debería incluir un breve detalle de contratos con terceros, vigente a la fecha de cierre del ejercicio, cuyo incumplimiento o cláusula específica podrían generar obligaciones contingentes para el cliente). "]
[{"$f":"IFERROR(\"Los principales contratos suscriptos por la Sociedad, vigentes al  \"&DAY(Indice!B3)&\" de \"&VLOOKUP(MONTH(Indice!B3),Indice!S:T,2,0)&\" de \"&YEAR(Indice!B3-1)&\" son:\",\"Los principales contratos suscriptos por la Sociedad, vigentes al … de …  20X2 son:\")","v":"Los principales contratos suscriptos por la Sociedad, vigentes al … de …  20X2 son:"}]
["a)"]
["b)"]
[]
[]
[{"$f":"IFERROR(\"Al  \"&DAY(Indice!B3)&\" de \"&VLOOKUP(MONTH(Indice!B3),Indice!S:T,2,0)&\" de \"&YEAR(Indice!B3-1)&\" no existen situaciones contingentes, ni reclamos que pudieran resultar en la generación de obligaciones para la Sociedad adicionales a las que se presentan en estos estados financieros.\",\"Al … de …………... 20X2 no existen situaciones contingentes, ni reclamos que pudieran resultar en la generación de obligaciones para la Sociedad adicionales a las que se presentan en estos estados financieros.\")","v":"Al … de …………... 20X2 no existen situaciones contingentes, ni reclamos que pudieran resultar en la generación de obligaciones para la Sociedad adicionales a las que se presentan en estos estados financieros."}]
[]
[]
[]
["Obs.: Esta información debe estar ajustada  a lo requerido por la Norma de Información Financiera N° 5 Contingencias y sucesos que ocurren después de la fecha del balance. "]

{"sheet":"Nota 38","index":44,"n_rows":26,"n_cols":4,"rows_kept":26,"cut":false,"hidden":false,"merged":[[2,0,2,6],[6,0,6,6],[7,0,7,6],[9,0,9,6]]}
[{"$f":"Indice!C1","v":"NICOLAS GONZALEZ ODDONE S.A.E.C.A"},null,null,"Índice"]
[]
["NOTA 38 - IMPUESTO DIFERIDO"]
["En miles de guaraníes"]
[]
["NO APLICA"]
["Al … de …........... 20X2 la Sociedad constituyó una provisión para impuesto a la renta de Guaraníes  …... (Al … de …...............20X1:  Guaraníes  …....) / (La Sociedad no ha constituido provisión para impuesto a la renta, debido a que a esa fecha la misma generó renta imponible que fue compensada con quebrantos impositivos acumulados a esa fecha). "]
["La Sociedad contabiliza el impuesto a la renta por el método de lo diferido, método del pasivo. El mencionado método establece la determinación de activos o pasivos impositivos diferidos netos basados en las diferencias temporales y temporarias, con cargo a la línea Impuesto a la renta del Estado de resultados."]
[]
["El siguiente cuadro detalla las diferencias temporales a la tasa del impuesto a los efectos de determinación del impuesto diferido:"]
[]
[null,"2020-09-30","2019-09-30"]
["Activos y pasivos impositivos diferidos: "]
["Caja y Bancos"]
["Inversiones"]
["Previsión para deudores incobrables"]
["Bienes de uso"]
["Activos intangibles"]
["Previsión del pasivo"]
["Deudas comerciales y bancarias"]
["Bienes de cambio"]
["Sub - total  "]
["Previsión para impuestos diferidos netos "]
["Total activo/pasivo impositivo diferido neto antes de quebrantos"]
["Quebranto impositivo"]
["Total"]

{"sheet":"Nota 39","index":45,"n_rows":5,"n_cols":3,"rows_kept":5,"cut":false,"hidden":false,"merged":[[4,0,4,8],[7,0,7,8]]}
[{"$f":"Indice!C1","v":"NICOLAS GONZALEZ ODDONE S.A.E.C.A"},null,"Indice"]
[]
[]
["NOTA 39 - HECHOS POSTERIORES"]
["Se ha propagado en Paraguay y en el mundo el virus denominado coronavirus COVID-19 que ha sido calificado como una pandemia por la organización mundial de la salud el 11 de marzo de 2020, impactando significativamente en el tercer trimestre de 2020, entre otros, las condiciones económicas, los negocios y a los consumidores."]

{"sheet":"Nota 40","index":46,"n_rows":80,"n_cols":3,"rows_kept":80,"cut":false,"hidden":false,"merged":[[88,0,88,5]]}
[{"$f":"Indice!C1","v":"NICOLAS GONZALEZ ODDONE S.A.E.C.A"},null,"Indice"]
[]
["NOTA 40 - SALDOS Y TRANSACCIONES CON PARTES RELACIONADAS"]
["Miles de guaraníes"]
[]
["Activo","2020-09-30","2019-09-30"]
["Cuentas a Cobrar"]
["Agropecuaria cuatro vientos S.A adeuda a NGO, al 30/09/2020",0,0]
["por compras de mercaderías la suma de Gs. ",0]
[]
["Todo Franquicia S.A adeuda a NGO, al 30/09/2020 , por "]
["compras de mercaderías la suma de Gs. ",25860505551,16414426640]
[]
["Confort para el Hogar adeuda NGO, al 30/09/2020 por "]
["compras de mercaderias y préstamos  la suma de Gs. ",11107292108,16825937774]
[]
["Estirpe Guaraní S.A adeuda a NGO, al 30/09/2020 por "]
["compras de mercaderías la suma de Gs. ",37314265,457190489]
[]
["Monday S.A Inmobiliaria adeuda a NGO, al 30/09/2020 por "]
["compras de mercaderías la suma de Gs. ",17352834,0]
[]
["Agropecuaria cuatro vientos adeuda a NGO al 30/06/2020 por "]
["compras de mercaderías, repuestos  y servicio técnico "]
["la suma de Gs ",0]
[]
["M. Montserrat González"]
["* Productos ",1937977,0]
[]
["Mauro Esteban González "]
["* Productos ",131002,0]
[]
["Sara Comercial Villamorra S.A "]
["* Productos ",3164411965,0]
[]
["Nicolas V. González"]
["* Productos ",17008835,613575]
[]
["Gisela González de Fúster",784353,0]
["* Productos "]
[]
["Beatriz Eugenia González de Bosio ",4305110,0]
["* Producto "]
[]
["Juan José Bosio González",5642171]
["*Producto "]
[]
["Inversiones Mobiliarias Permanentes "]
["NGO SAECA, es socio Fundador de la sociedad "]
["TODO FRANQUICIA S.A, el capital social de la firma, "]
["por asamblea extraordinaria en abril de 2011, aumentó"]
["a la suma de cincuenta millones de guaranés. Por lo tanto "]
["la participación de NGO SAECA (99%), en dicha sociendad. "]
["La integracón a la fecha asciende a Gs. 17.477.000.000",{"$f":"14978000000+2499000000-13562288144","v":3914711856},{"$f":"14978000000+2499000000-8201568617","v":9275431383}]
[]
["NGO SAECA, es socio fundador de lasociedad CONFORT "]
["PARA EL HOGAR - CPH S.A, el capital social de la firma "]
["según escritura de constitución de fecha 04 de marzo de "]
["2014 es de cincuenta millomes de guaraníes. Por tanto la"]
["participación de NGO SAECA (99%) en dicha sociedad, es "]
["cuarenta y nueve mil quinientos millones de guaraníes "]
["(49500000)."]
["La integración actual asciende a Gs. 45.006.000.000",{"$f":"27490000000+17516000000-16707174425","v":28298825575},{"$f":"19768000000+25238000000-26798512965","v":18207487035}]
[]
["Ingresos"]
["Ingresos por alquiler de uno de sus inmuebles de "]
["inversión a la empresa Compañía Internacional de "]
["comercio S.R.L (CIDECOM SRL Propiedad de los accionistas "]
["mayoritarios de la sociedad)",16500000,49250000]
[]
["Ingresos por alquiler de uno de sus inmuebles de inversion "]
["a la empresa Todo Franquicia S.A ",181814547,90000000]
[]
["Ingresos por alquiler de uno de sus inmubles a la empresa "]
["Estirpe Guaraní ",15275627,23223813]
[]
["Egresos"]
["Todo Franquicia S.A "]
["Gastos de publicidad ",27530682,57545452]
["Total activo",{"$f":"SUM(B7:B79)","v":72671344458},{"$f":"SUM(C7:C79)","v":61401106161}]

{"sheet":"Base de Monedas","index":47,"n_rows":3,"n_cols":3,"rows_kept":3,"cut":false,"hidden":false,"merged":[]}
["PYG","Guaraní","Índice"]
["USD","Dólar estadounidense"]
["EUR","Euro"]