{"text_format":"1","workbook":"xlsx","n_sheets":47,"sheets":["Caratula","Indice","BG","EVPN","ER","EFE","Nota1","Nota 2","Nota 3","Nota 4","Nota 5","Nota 6","Nota 7","Nota 8","Nota 9","Nota 10","cred","Nota 11","Nota 12","Nota 13","Nota 14","Nota 15","Nota 16","Nota 17","Nota 18","Nota 19","Nota 20"," Nota 21","Nota 22","Nota 23","Nota 24","Nota 25","Nota 26","Nota 27","Nota 28","Nota 29","Nota 30","Nota 31","Nota 32","Nota 33","Nota 34","Nota 35","Nota 36","Nota 37","Nota 38","Nota 39","Nota 40"],"not_rendered":{"charts":0,"images":3,"macros":1,"external_links":3,"defined_names":4,"comments":1,"pivot_tables":0},"unopened":[],"bounds":{"document_bytes":16777216,"sheet_cells":100000,"rows_first":2000,"rows_last":500,"rows_between":2000,"halvings":0,"cell_chars":16384,"cell_head_chars":4096},"cells_cut":0,"cells_raw":0,"read":"whole","date_system":"1900"}

{"sheet":"Caratula","index":0,"n_rows":25,"n_cols":2,"rows_kept":25,"cut":false,"hidden":false,"merged":[]}
[]
[]
[]
[]
[null," E S T  A  D  O  S      C  O  N  T  A  B  L  E  S              "]
[]
[]
[]
[]
[null,"DENOMINACION:   NICOLAS GONZALEZ ODDONE S.A.E.C.A."]
[]
[]
[null,"DOMICÍLIO LEGAL: DOMINICANA ESQUINA VIA FERREA"]
[]
[]
[null,"ACTIVIDAD PRINCIPAL:  IMPORTACIONES"]
[]
[]
[null,"INSCRIPCION EN EL REGISTRO PUBLICO DE COMERCIO Nº 106 DEL 03/06/64 Y Nº 186 DEL 11/04/96 DE LOS ESTATUTOS SOCIALES Y SUS MODIFICACIONES. -"]
[]
[]
[null,"INSCRIPCION EN LA COMISION NACIONAL DE VALORES: N.º 058 RESOL. Nº 270/96"]
[]
[]
[null,"FECHA DE VENCIMIENTO DEL ESTATUTO SOCIAL:  AÑO 2094"]

{"sheet":"Indice","index":1,"n_rows":59,"n_cols":4,"rows_kept":59,"cut":false,"hidden":false,"merged":[]}
[null,null,"NICOLAS GONZALEZ ODDONE S.A.E.C.A"]
[]
[null,"                                 ESTADOS CONTABLES AL 31/03/2020","ESTADOS CONTABLES AL 30/09/2021"]
[]
[]
[null,null,"INDICE","REF."]
[null,"Informacion General"]
[null,null,"Descripción de la naturaleza y del negocio de la Sociedad","Nota 1"]
[null,null,"Resumen de las principales políticas contables","Nota 2"]
[null,"Balance General",null,"BG"]
[null,null,"Efectivo y equivalente de efectivo","Nota 3"]
[null,null,"Inversiones temporales","Nota 4"]
[null,null,"Cuentas por cobrar comerciales","Nota 5"]
[null,null,"Otros créditos","Nota 6"]
[null,null,"Inventarios","Nota 7"]
[null,null,"Inversión en asociadas","Nota 8"]
[null,null,"Propiedades, planta y equipo","Nota 9"]
[null,null,"Activos disponibles para la venta","Nota 10"]
[null,null,"Activos intangibles","Nota 11"]
[null,null,"Goodwill","Nota 12"]
[null,null,"Otros Activos","Nota 41"]
[null,null,"Cuentas por pagar proveedores","Nota 13"]
[null,null,"Préstamos a corto plazo","Nota 14"]
[null,null,"Porción corriente de la deuda a largo plazo","Nota 15"]
[null,null,"Remuneraciones y cargas sociales a pagar","Nota 16"]
[null,null,"Impuestos a pagar","Nota 17"]
[null,null,"Provisiones","Nota 18"]
[null,null,"Otros pasivos corrientes","Nota 19"]
[null,null,"Capital integrado","Nota 20"]
[null,null,"Reserva de revalúo","Nota 21"]
[null,null,"Reserva legal","Nota 21"]
[null,null,"Reservas estatutarias","Nota 21"]
[null,null,"Reservas facultativas","Nota 21"]
[null,null,"Diferencia transitoria por conversión","Nota 22"]
[null,null,"Resultados acumulados","Nota 23"]
[null,null,"Interés minoritario","Nota 24"]
[null,"Estado de Resultados ",null,"ER"]
[null,null,"Ventas","Nota 25"]
[null,null,"Costo de ventas","Nota 26"]
[null,null,"Gastos de ventas","Nota 27"]
[null,null,"Gastos administrativos","Nota 27"]
[null,null,"Otros ingresos y gastos operativos/ No Operativos ","Nota 28"]
[null,null,"Ingresos financieros - neto/ Inversiones ","Nota 29"]
[null,null,"Gastos financieros - neto","Nota 29"]
[null,null,"Resultado de inversiones en asociadas","Nota 30"]
[null,null,"Resultado participación minoritaria","Nota 31"]
[null,null,"Impuesto a la renta","Nota 32"]
[null,null,"Resultado extraordinario neto de impuesto a la renta","Nota 33"]
[null,null,"Resultado sobre actividades discontinuadas neto de impuesto a la renta","Nota 34"]
[null,null,"Utilidad/(Pérdida) neta del año","Nota 35"]
[null,null,"Utilidad neta por acción ordinaria","Nota 35"]
[null,"Estado de Evolución del Patrimonio Neto",null,"EVPN"]
[null,"Estado de Flujos de Efectivo",null,"EFE"]
[null,"Otras Notas de los Estados Financieros"]
[null,null,"Activos gravados","Nota 36"]
[null,null,"Contingencias y compromisos","Nota 37"]
[null,null,"Impuesto diferido","Nota 38"]
[null,null,"Hechos posteriores","Nota 39"]
[null,null,"Saldos y transacciones con partes relacionadas","Nota 40"]

{"sheet":"BG","index":2,"n_rows":62,"n_cols":6,"rows_kept":62,"cut":false,"hidden":false,"merged":[[5,2,5,8],[72,4,72,5],[73,0,73,2],[7,0,7,2],[30,0,30,2],[47,0,47,2],[46,0,46,2],[58,0,58,2],[71,4,71,5],[29,0,29,2],[59,0,59,2],[38,1,38,2],[43,1,43,2],[48,1,48,2],[67,4,67,5],[66,4,66,5],[23,1,23,2],[55,1,55,2],[27,1,27,2],[34,1,34,2],[49,1,49,2],[57,1,57,2],[51,1,51,2],[52,1,52,2],[53,1,53,2],[50,1,50,2],[54,1,54,2],[56,1,56,2],[14,1,14,2],[42,1,42,2],[9,1,9,2],[10,1,10,2],[11,1,11,2],[12,1,12,2],[25,1,25,2],[33,1,33,2],[35,1,35,2],[36,1,36,2],[37,1,37,2],[22,1,22,2],[24,1,24,2],[18,1,18,2],[20,1,20,2],[21,1,21,2]]}
[null,null,{"$f":"Indice!C1","v":"NICOLAS GONZALEZ ODDONE S.A.E.C.A"},"Indice"]
[]
[null,null,"BALANCE GENERAL AL 30 DE SEPTIEMBRE DE 2021 COMPARATIVO CON CIFRAS AL 31 DE DICIEMBRE DE 2020"]
[]
[null,null,null,"Nota","2021-09-30","2020-12-31"]
[null,null,"En miles de guaraníes"]
[]
["ACTIVOS"]
["Activos Corrientes "]
[null,"Efectivo y equivalente de efectivo",null,3,{"$f":"'Nota 3'!C20","v":120353754427},{"$f":"'Nota 3'!D20","v":64916787921}]
[null,"Inversiones Temporales",null,4,{"$f":"'Nota 4'!B20","v":89352189048},{"$f":"'Nota 4'!C20","v":172377481600}]
[null,"Cuentas por Cobrar Comerciales",null,5,{"$f":"'Nota 5'!C19","v":254177362752},{"$f":"'Nota 5'!D19","v":284449211487}]
[null,"Otros Créditos",null,6,{"$f":"'Nota 6'!B54","v":13344088651},{"$f":"'Nota 6'!C54","v":11394632809}]
[null,"Inventarios ","Inventarios ",7,{"$f":"'Nota 7'!B27","v":474071062741},{"$f":"+'Nota 7'!C27","v":364536038453}]
[null,"Otros Activos Corrientes  ",null,6,{"$f":"'Nota 6'!B88","v":363372588},{"$f":"'Nota 6'!C88","v":0}]
[null,"TOTAL ACTIVO CORRIENTES ",null,null,{"$f":"SUM(E10:E15)","v":951661830207},{"$f":"SUM(F10:F15)","v":897674152270}]
[]
["Activos no corrientes "]
[null,"Otros créditos ",null,6,0,0]
[null,null,"Cuentas por Cobrar Comerciales",5,{"$f":"'Nota 5'!C49","v":23528027566},{"$f":"'Nota 5'!D49","v":752588703}]
[null,"Inversiones en Asociadas",null,8,{"$f":"'Nota 8'!B10","v":47024924776},{"$f":"'Nota 8'!C10","v":44713924776}]
[null,"Propiedad, planta y equipo ",null,9,{"$f":"'Nota 9'!L50","v":344901934211},{"$f":"'Nota 9'!M50","v":349540560532}]
[null,"Inventarios ",null,7,{"$f":"'Nota 7'!B36","v":2677490769},{"$f":"'Nota 7'!C35","v":1727462596}]
[null,"Inversiones Financieras",null,6,{"$f":"'Nota 6'!F22","v":2176797420},{"$f":"'Nota 6'!G22","v":4849836142}]
[null,"Activos Intangibles ",null,11,{"$f":"'Nota 11'!B31","v":5762024436},{"$f":"'Nota 11'!C31","v":5453082128}]
[null,"Goodwill ",null,12,{"$f":"'[1]Nota 12'!B11","v":0},{"$f":"'[1]Nota 12'!C11","v":0}]
[null,"Inversiones Inmobiliarias ","Activos Disponibles para la Venta ",10,{"$f":"'Nota 10'!B69","v":47669119495.398407},{"$f":"'Nota 10'!C69","v":45436745044.067459}]
[null,"Total activos no corrientes",null,null,{"$f":"SUM(E19:E27)","v":473740318673.39844},{"$f":"SUM(F19:F27)","v":452474199921.06744}]
[]
["TOTAL ACTIVOS ",null,null,null,{"$f":"+E16+E28","v":1425402148880.3984},{"$f":"+F16+F28","v":1350148352191.0674}]
["PASIVOS Y PATRIMONIO NETO"]
[]
["Pasivo Corrientes ",null,null,null,-1]
[null,"Cuentas a Pagar - Comerciales ",null,13,{"$f":"'Nota 13'!B40","v":23380738267},{"$f":"+'Nota 13'!C40","v":30125022040}]
[null,"Prestamos a corto plazo",null,14,{"$f":"'Nota 14'!E27","v":269964465086},{"$f":"'Nota 14'!K27","v":223685364647}]
[null,"Remuneraciones y cargas sociales a pagar",null,16,{"$f":"'Nota 16'!B21","v":1620982357},{"$f":"'Nota 16'!C21","v":2839970060}]
[null,"Impuestos a Pagar",null,17,{"$f":"'Nota 17'!B15","v":2255410058},{"$f":"'Nota 17'!C15","v":3302748105}]
[null,"Provisiones ",null,18,{"$f":"'Nota 18'!B36+'Nota 18'!B50","v":22925379652},{"$f":"'Nota 18'!C51","v":26942603877}]
[null,"Otros pasivos corrientes",null,19,{"$f":"'Nota 19'!B26","v":3122569262},{"$f":"+'Nota 19'!C26","v":3291887592}]
[null,"Total Pasivos Corrientes",null,null,{"$f":"SUM(E34:E39)","v":323269544682},{"$f":"SUM(F34:F39)-1","v":290187596320}]
[]
["Pasivos no corrientes"]
[null,"Préstamos a largo plazo ",null,null,0,0]
[null,"Otros pasivos  no corrientes",null,19,{"$f":"'Nota 19'!B32","v":2184057621},{"$f":"'Nota 19'!C33","v":4885020675}]
[null,"Total pasivos no corrientes",null,null,{"$f":"E44","v":2184057621},{"$f":"SUM(F43:F44)","v":4885020675}]
[]
["TOTAL PASIVOS",null,null,null,{"$f":"+E40+E45","v":325453602303},{"$f":"+F40+F45","v":295072616995}]
["PATRIMONIO NETO"]
[null,"Capital integrado",null,20,{"$f":"'Nota 20'!B15","v":643227002000},{"$f":"'[1]Nota 20'!C6","v":643227002000}]
[null,"Reserva de revalúo",null,21,{"$f":"' Nota 21'!B9","v":178972541980},{"$f":"'[1] Nota 21'!C9","v":178972541980}]
[null,"Reserva legal",null,21,{"$f":"' Nota 21'!B15","v":55328905234},{"$f":"' Nota 21'!C15","v":50198695192}]
[null,"Reservas de Capitalización",null,21,{"$f":"+' Nota 21'!B30+' Nota 21'!B37","v":148305088750},{"$f":"+' Nota 21'!C30+' Nota 21'!C37","v":80073295209}]
[null,"Reservas facultatitvas",null,21,0,0]
[null,"Diferencia transitoria por conversión",null,22,0,0]
[null,"Resultados acumulados",null,23,{"$f":"+'Nota 23'!B6","v":0},{"$f":"+'Nota 23'!C6","v":0}]
[null,"Resultados del ejercicio",null,23,{"$f":"+'Nota 23'!B13","v":74115008613},{"$f":"+'Nota 23'!C13","v":102604200814}]
[null,"Subtotal",null,null,{"$f":"SUM(E49:E56)","v":1099948546577},{"$f":"SUM(F49:F56)","v":1055075735195}]
[null,"Interés minoritario",null,24,0,{"$f":"'[1]Nota 24'!C7","v":0}]
["TOTAL PATRIMONIO NETO ",null,null,null,{"$f":"E57","v":1099948546577},{"$f":"F57+1","v":1055075735196}]
["TOTAL PASIVO Y PATRIMONIO NETO",null,null,null,{"$f":"+E47+E59","v":1425402148880},{"$f":"F47+F59","v":1350148352191}]
[]
["Las notas que se acompañan forman parte integrante de estos estados."]

{"sheet":"EVPN","index":3,"n_rows":40,"n_cols":25,"rows_kept":40,"cut":false,"hidden":false,"merged":[[0,0,0,4],[10,22,11,22],[10,24,11,24],[10,2,11,2],[10,0,11,0],[5,0,5,19],[6,0,6,19],[9,2,9,6],[9,14,9,21],[10,4,11,4],[10,6,11,6],[10,8,11,8],[10,10,11,10],[10,14,11,14],[10,16,11,16],[10,19,11,19],[10,21,11,21]]}
[{"$f":"Indice!C1","v":"NICOLAS GONZALEZ ODDONE S.A.E.C.A"},null,null,null,null,null,null,null,"Indice"]
[]
[]
[null,null,null,null,null,null,"ESTADO DE EVOLUCIÓN DEL PATRIMONIO NETO"]
[null,null,null,null,null,null,"                AL 30 DE SEPTIEMBRE DE 2021"]
["Comparativo con igual periodo del año anterior"]
["(En miles de guaraníes)"]
[]
[]
[null,null,"Aporte de los propietarios",null,null,null,null,null,null,null,null,null,null,null,"Ganancias reservadas"]
[null,null,"Capital suscripto e integrado",null,"Acciones en Tesoreria",null,"Primas de emisión",null,"Reserva de revalúo",null,"Reserva de revalúo técnico",null,"Prima de Recompra ",null,"Reserva legal",null,"Reserva P/ Capitalizacion",null,null,"Resultados acumulados",null,"Resultado del Ejercicio","Interes Minoritario",null,"Total"]
[null,null,null,null,null,null,null,null,null,null,null,null,"de Acciones ",null,null,null,null,null,null,"Total",null,"Total"]
[]
["Saldo al 31 de Diciembre 2019",null,635041900000,null,-144200000,null,8329302000,null,91567541041,null,87405000939,null,-47385000,null,46478390374,null,34528344662,null,null,0,null,74406096363,0,null,{"$f":"+C14+E14+G14+I14+K14+O14+Q14+T14+W14+V14+M14","v":977564990379}]
["Cambio en política contable"]
["Saldo reestructurado",null,{"$f":"+C14","v":635041900000},null,{"$f":"+E14","v":-144200000},null,{"$f":"+G14","v":8329302000},null,{"$f":"+I14","v":91567541041},null,{"$f":"+K14","v":87405000939},null,{"$f":"+M14","v":-47385000},null,{"$f":"+O14","v":46478390374},null,{"$f":"+Q14","v":34528344662},null,null,{"$f":"+T14","v":0},null,{"$f":"+V14","v":74406096363},{"$f":"+W14","v":0},null,{"$f":"+C16+E16+G16+I16+K16+O16+Q16+T16+W16+V16+M16","v":977564990379}]
["Distribución de dividendos s/Acta de Asamblea General Ordinaria N°92 de fecha 30/06/2020",null,0,null,0,null,0,null,0,null,0,null,0,null,3720304818,0,45592335547,null,null,{"$f":"-O17-Q17","v":-49312640365},null,0,null,null,{"$f":"SUM(C17:V17)","v":0}]
["Dividendos pagados",null,0,null,0,null,0,null,0,null,0,null,0,null,0,null,0,null,null,-25093455998,null,0,null,null,{"$f":"SUM(C18:V18)","v":-25093455998}]
["Transferencia a Resultados Acumulados",null,0,null,0,null,0,null,0,null,0,null,0,null,0,null,0,null,null,74406096363,null,{"$f":"-T19","v":-74406096363},null,null,{"$f":"SUM(C19:V19)","v":0}]
["Integración del capital social",null,0,null,0,null,0,null,0,null,0,null,0,null,0,null,{"$f":"-C20","v":0},null,null,0,null,0,null,null,0]
["Reducción del capital social s/Acta de Asamblea General Ordinaria N°… de fecha……..",null,0,null,0,null,0,null,0,null,0,null,0,null,0,0,0,null,null,0,null,0,null,null,0]
["Revalúo de activos fijos",null,0,null,0,null,0,null,0,null,0,null,0,null,0,null,0,null,null,0,null,0,null,null,0]
["Reserva Revaluo/Lega  - CPH/TF ",null,null,null,null,null,null,null,0,null,null,null,null,null,0]
["Revalúo técnico",null,0,null,0,null,0,null,0,null,0,null,0,null,0,null,0,null,null,0,null,0,null,null,0]
["Resultado del año",null,0,null,0,null,0,null,0,null,0,null,0,null,0,null,0,null,null,0,null,67413551673,null,null,67413551673]
[]
["Saldo al 30/09/2020",null,{"$f":"SUM(C16:C25)","v":635041900000},null,{"$f":"SUM(E16:E25)","v":-144200000},null,{"$f":"SUM(G16:G25)","v":8329302000},{"$f":"SUM(H14:H26)","v":0},{"$f":"SUM(I16:I25)","v":91567541041},null,{"$f":"SUM(K16:K25)","v":87405000939},null,{"$f":"SUM(M16:M25)","v":-47385000},null,{"$f":"SUM(O16:O25)","v":50198695192},null,{"$f":"SUM(Q16:Q25)","v":80120680209},null,null,{"$f":"SUM(T16:T25)","v":0},null,{"$f":"SUM(V16:V25)","v":67413551673},{"$f":"W16+W17+W20+W21+W22+W24+W25","v":0},null,{"$f":"SUM(Y16:Y25)","v":1019885086054}]
[]
["Saldo al 31 de Diciembre de 2020",null,635041900000,null,-144200000,null,8329302000,{"$f":"SUM(H16:H28)","v":0},91567541041,null,87405000939,null,{"$f":"+M27","v":-47385000},null,50198695192,null,80120680209,null,null,0,null,102604200814,{"$f":"W19+W20+W22+W24+W25+W26+W27","v":0},null,{"$f":"+C29+E29+G29+I29+K29+O29+Q29+T29+W29+V29+M29","v":1055075735195}]
["Transferencia a Resultados Acumulados",null,0,null,0,null,0,null,0,null,0,null,0,null,0,null,0,null,null,102604200814,null,{"$f":"-T30","v":-102604200814},null,null,{"$f":"+T30+V30","v":0}]
["Distribución de dividendos s/Acta de Asamblea General Ordinaria N° 93 de fecha 16/04/2021",null,0,null,0,null,0,null,0,null,0,null,0,null,5130210041,null,68231793541,null,null,{"$f":"-O31-Q31","v":-73362003582},null,0,null,null,0]
["Dividendos pagados",null,0,null,0,null,0,null,0,null,0,null,0,null,0,null,0,null,null,-29242197232,null,0,null,null,{"$f":"+T32","v":-29242197232}]
["Revalúo de activos fijos",null,0,null,0,null,0,null,0,null,0,null,0,null,0,null,0,null,null,0,null,0,null,null,{"$f":"+T33","v":0}]
["Desafectación de la reserva de revalúo técnico",null,0,null,0,null,0,null,0,null,0,null,0,null,0,null,0,null,null,0,null,0,null,null,0]
[]
["Resultado del año",null,0,0,0,null,0,null,0,null,0,null,0,null,0,null,0,null,null,0,null,74115008613,null,null,{"$f":"+V36","v":74115008613}]
[]
["Saldo al 30/09/2021",null,{"$f":"C29+C31+C33+C34+C36","v":635041900000},{"$f":"SUM(D27:D36)","v":0},{"$f":"E29+E31+E33+E34+E36","v":-144200000},null,{"$f":"G29+G31+G33+G34+G36","v":8329302000},null,{"$f":"I29+I31+I33+I34+I36","v":91567541041},null,{"$f":"K29+K31+K33+K34+K36","v":87405000939},null,{"$f":"M29+M31+M33+M34+M36","v":-47385000},null,{"$f":"O29+O31+O33+O34+O36","v":55328905233},null,{"$f":"Q29+Q31+Q33+Q34+Q36","v":148352473750},null,null,{"$f":"SUM(T29:T34)","v":0},null,{"$f":"SUM(V29:V36)","v":74115008613},{"$f":"W27+W31+W33+W34+W36","v":0},null,{"$f":"SUM(Y29:Y37)","v":1099948546576}]
[]
["Las notas que se acompañan forman parte integrante de estos estados."]

{"sheet":"ER","index":4,"n_rows":41,"n_cols":4,"rows_kept":41,"cut":false,"hidden":false,"merged":[[2,0,2,6],[3,0,3,6],[52,2,52,3],[46,2,46,3],[4,0,4,6]]}
[{"$f":"Indice!C1","v":"NICOLAS GONZALEZ ODDONE S.A.E.C.A"},"Indice"]
[]
["ESTADO DE RESULTADOS"]
["AL 30 DE SEPTIEMBRE DE 2021 COMPARATIVO CON CIFRAS AL 30 DE SEPTIEMBRE DE 2020"]
["(En miles de guaraníes)"]
[]
[null,"Nota","2021-09-30","2020-09-30"]
["Ventas Actividad Comercial ",25,{"$f":"'Nota 25'!B13","v":527426518403},{"$f":"'Nota 25'!C13","v":444197202858}]
["Ventas Actividad Ganadera ",25,{"$f":"'Nota 25'!B20","v":17209062176},{"$f":"'Nota 25'!C20","v":3108940205}]
["Costo de ventas",26,{"$f":"-'Nota 26'!B18","v":-399906650081},{"$f":"-'Nota 26'!C18","v":-316630983086}]
["Utilidad bruta",null,{"$f":"SUM(C8:C10)","v":144728930498},{"$f":"SUM(D8:D10)","v":130675159977}]
[]
["Gastos de ventas",27,{"$f":"-'Nota 27'!B34","v":-60084028855},{"$f":"-'Nota 27'!E34","v":-50636005435}]
["Gastos administrativos ",27,{"$f":"+-'Nota 27'!C34","v":-24822164186},{"$f":"-'Nota 27'!F34","v":-26204255261}]
["Otros ingresos operativos ",28,{"$f":"'Nota 28'!B46","v":25937323162},{"$f":"'Nota 28'!C46","v":14351590896}]
["Otros  gastos operativos ",28,{"$f":"'Nota 28'!F19","v":-9454058649},{"$f":"'Nota 28'!G19","v":-6844037835}]
["Resultado operativo",null,{"$f":"SUM(C13:C16)","v":-68422928528},{"$f":"SUM(D13:D16)","v":-69332707635}]
[]
["Ingresos financieros - neto",29,{"$f":"'Nota 29'!B15","v":46566407515},{"$f":"'Nota 29'!C15","v":24955270346}]
["Gastos financieros -  neto",29,{"$f":"'Nota 29'!F14","v":-41563291195},{"$f":"'Nota 29'!G14","v":-12745833019}]
["Subtotal",null,{"$f":"SUM(C19:C20)","v":5003116320},{"$f":"SUM(D19:D20)","v":12209437327}]
[]
["Resultado de inversiones en asociadas",30,{"$f":"+'Nota 30'!B10","v":0},{"$f":"+'Nota 30'!C10","v":0}]
["Resultados no Operativos ","28.1",{"$f":"+'Nota 28'!B78","v":1573927257},{"$f":"'Nota 28'!C78","v":452644312}]
["Ingresos de Inversiones Financieras",29.1,{"$f":"+'Nota 29'!B31","v":12441191461},{"$f":"+'Nota 29'!C31","v":1863181585}]
["Egresos de Inversiones Financieras",29.1,{"$f":"'Nota 29'!F31","v":-13392454084},{"$f":"'Nota 29'!G31","v":-189203339}]
[]
["Resultados ordinarios antes de impuesto a la renta",null,{"$f":"+C11+C17+C21+C24+C25+C26+C23","v":81931782924},{"$f":"+D11+D17+D21+D24+D25+D26+D23","v":75678512227}]
[]
["Resultado ordinario antes del impuesto a la renta"]
["Impuesto a la renta",32,{"$f":"-'Nota 32'!B9","v":-7816774311},{"$f":"-'Nota 32'!C9","v":-8264960554}]
[]
["Resultado neto de actividades ordinarias",null,{"$f":"+C28+C31","v":74115008613},{"$f":"+D28+D31","v":67413551673}]
["Resultado extraordinario neto de impuesto a la renta",33,0,0]
["Resultado sobre actividades discontinuadas neto de impuesto a la renta",34,{"$f":"'Nota 34'!B10","v":0},{"$f":"'Nota 34'!C10","v":0}]
[null,null,null,0]
["Utilidad/(Pérdida) neta del año ",null,{"$f":"C33+C34+C35","v":74115008613},{"$f":"D33+D34+D35","v":67413551673}]
["Utilidad neta por acción ordinaria",35,{"$f":"C37/'Nota 35'!B9","v":11673.537372483373},{"$f":"D37/'Nota 35'!C9","v":10618.019610248959}]
[]
[]
["Las notas que se acompañan forman parte integrante de estos estados."]

{"sheet":"EFE","index":5,"n_rows":45,"n_cols":3,"rows_kept":45,"cut":false,"hidden":false,"merged":[[10,0,10,2],[2,0,2,2],[4,0,4,2],[5,0,5,2],[6,0,6,2],[7,0,7,2]]}
[{"$f":"Indice!C1","v":"NICOLAS GONZALEZ ODDONE S.A.E.C.A"}]
[]
[]
[]
["ESTADO DE FLUJOS DE EFECTIVO"]
["Por los periodos comprendidos entre el 01 de enero al 30 de Setiembre de 2021"]
["Comparativo con igual periodo del año anterior"]
[]
[]
[null,"2021-09-30","2020-09-30"]
["En miles de guaraníes"]
[]
["FLUJO DE EFECTIVO DE ACTIVIDADES OPERATIVAS"]
["Cobranzas efectuadas a clientes",567915299723,418292915379]
["Pagos efectuados a proveedores y empleados",-490456673941,-257971154585]
["Efectivo generado por las operaciones ",-35827839413,-23198896932]
["Intereses pagados",0,0]
["Otros ingresos y (egresos) - neto",-10502312611,-9798323094]
["Pagos de impuesto a la renta",-11867544497,-6330933473]
["Flujo neto de efectivo de actividades operativas",{"$f":"SUM(B14:B19)","v":19260929261},{"$f":"SUM(C14:C19)","v":120993607295}]
[]
["FLUJO DE EFECTIVO DE ACTIVIDADES DE INVERSIÓN "]
["Adquisicion de bienes de uso ",-5930508595,-24745926511]
["Venta de bienes de uso ",1145719203,0]
["Intereses cobrados sobre inversiones",3649714200,1343301480]
["Inversiones mobiliarias Permanentes ",-2311000000,0]
["Aquisición de inversiones",83025292552,-126284069590]
["Inversiones mobiliarias Permanentes ",0,0]
[]
["Flujo neto de efectivo de actividades de inversión",{"$f":"SUM(B23:B29)","v":79579217360},{"$f":"SUM(C23:C29)","v":-149686694621}]
[]
[]
["FLUJO DE EFECTIVO DE ACTIVIDADES DE FINANCIACIÓN"]
["(Disminución) Incremento de préstamos",-10547535620,25540306849]
["Aportes de capital recibidos",0,0]
["Dividendos pagados",-28223329637,-25093455998]
["Intereses Pagados sobre préstamos ",-2411375340,-1265515657]
["Flujo neto de efectivo de actividades de financiamiento",{"$f":"SUM(B34:B37)","v":-41182240597},{"$f":"SUM(C34:C37)","v":-818664806}]
[]
["Disminución o incremento neto de efectivo ",{"$f":"+B38+B30+B20","v":57657906024},{"$f":"+C20+C30+C38","v":-29511752132}]
["Efecto estimado de la diferencia de cambio sobre el saldo de efectivo ",-2220939519,9741090595]
["Efectivo al principio del año ",64916787922,97761526232]
["Efectivo al final del periodo",{"$f":"SUM(B40:B42)","v":120353754427},{"$f":"SUM(C40:C42)","v":77990864695}]
[]
["Las notas que se acompañan forman parte integrante de estos estados."]

{"sheet":"Nota1","index":6,"n_rows":65,"n_cols":2,"rows_kept":65,"cut":false,"hidden":false,"merged":[[0,10,0,12]]}
[null,"NOTAS A LOS ESTADOS FINANCIEROS POR EL PERIODO FINALIZADO EL 30 DE SEPTIEMBRE DE 2021"]
[null,"Balance General:  Correspondiente al periódo finalizado el 30 de Septiembre de 2021, presentado en forma comparativa con el ejercicio finalizado el 31 de diciembre de 2020"]
[null,"Estado de Resultados: Correspondiente al periódo finalizado el 30 de septiembre de 2021, presentado en forma comparativa con el periódo finalizado el 30 de septiembre de 2020."]
[]
[]
[null,"NOTA 1 – DESCRIPCIÓN DE LA NATURALEZA Y DEL NEGOCIO DE LA COMPAÑÍA"]
[]
[null,"Denominación: NICOLAS GONZALEZ ODDONE S.A.E.C.A"]
[]
[null,"La sociedad fue constituida por escritura de fecha 25 de marzo de 1964, autorizada por el Escribano Público Gervasio Recalde, habiéndose aprobado los mencionados estatutos y reconocida la personería jurídica de la sociedad por decretodel poder ejecutivo de la nacion Nº 4.180 de fecha 16 de abril de 1964, e inscriptos en el registro público de comercio por mandato del señor Juez de primera instancia en lo comercial del segundoturno, Dr. Arnaldo Rojas Rojas Sánchez, bajo el Nº 106 y en la página26 y sgtes., según providencia de fecha 03 de junio del mismo año."]
[null,"Los Estatutos originales sufrieron las siguientes modificaciones:"]
[null,"1º) Por Escritura N°º 77 de fecha 5 de abril de 1976, aprobadas las modificaciones y aumento de capital social a G. 100.000.000 (guaranies cien millones) por Decreto N° 23039 del 31 de mayo de 1976, e inscriptas en el registro publico de comercio, bajo el N°. 442 y en la pagina 202 en fecha 22 de junio del mismo año;                 "]
[null,"2°)  Por Escritura del 7 de mayo de 1979, aprobadas las modificaciones y aumento de capital social a G. 300.000.000 (guaranies trescientos millones) por decreto N° 8.425 del 20 de julio de 1979, e inscriptas bajo el N° 999 y en la pagina 145 y sgtes., según providencia del mismo año;   "]
[null,"3°) Por escritura N° 120 del 30 de abril de 1986, aprobadas las modificaciones y aumento de capital social a G 800.000.000 (guaranies ochocientos millones) por decreto N°. 18459 del 17 de noviembre de 1986, inscripta en el registro publico de comercio, bajo el N°. 1106 y en la pagina 32 vlto., en fecha 3 de diciembre del mismo año"]
[null,"4°) por escritura N°. 219 del 6 de noviembre de 1989, aprobada la modificación por aumento de capital a G 3.000.000.000 (guaranies tres mil millones) y adecuacion al codigo civil, escritura en donde constan los estatutos actualizados de la sociedad, que fueron inscriptos en el registro publico de comercio, bajo el N°. 1423 y al folio 6856 y sgtes., seccion contratos, serie “b”, según providencia del 23 de noviembre de 1989;  "]
[null,"5°) Por escritura N° 84 del 7 de mayo de 1991, con el aumento del capital a G 5.000.000.000 (guaranies cinco mil millones), inscripta en el registro publico de comercio, según providencia del 22 de mayo de 1991, anotado bajo el N°. 110, folio 520 y sgtes., serie “a”, seccion contratos.,"]
[null,"6°) Por escritura N°. 107 de fecha 28 de diciembre de 1995, pasada ante el escribano Raul A Casabianca, fueron modificados los estatutos sociales para adecuarlos a la ley del mercado de valores y en consecuencia la transformación de la firma en “SOCIEDAD EMISORA DE CAPITAL ABIERTO” y acogerse a los beneficios de la  Ley N°. 548/95 y aumento de capital social a la suma de G 30.000.000.000 (treinta mil millones de guaranies); tomándose razon en la dirección general de los registros publicos, registro de personas jurídicas y asociaciones,  según A I. N° 309 de fecha 1 de abril de 1996, anotado bajo el n° 197 folio 2558 y sgtes., serie “a” de fecha dos de abril de 1996 y registro publico de comercio, anotado bajo el n° 186, serie “a” folio 2730 y sgtes., seccion contratos, en fecha 11 de abril de 1996 y escritura complementaria N° 109 de fecha 29 de diciembre de 1995,  bajo el n° 198 folio 2580 y sgtes., serie “a” de fecha 2 de abril de 1996 y registro publico de comercio anotado bajo el N° 187 serie “a” folio 2751 y sgtes. seccion contratos, en fecha 11 de abril de 1996;  "]
[null,"7°) Escritura N° 21 de fecha 8 de mayo del año 1996, fue protocolizado el Acta N° 49 de fecha 12 de abril del año 1996 de Asamblea General Extraordinaria, aumento de capital a la suma de G 50.000.000.000 (guaranies cincuenta mil millones) inscripto en la Dirección General de los Registros Publicos, Registro de Personas Jurídicas y Asociaciones, según A. I. N° 705 de fecha 4 de julio de 1996, anotado bajo el n° 365 serie “A” al folio 4756 y sgtes. en fecha 5 de julio de 1996 y registro publico de comercio anotado bajo el N° 716 serie “d” al folio 6104 y sgtes. seccion contratos en fecha 9 de julio de 1996;   "]
[null,"8°)  Escritura N° 23 de fecha 10 de marzo del año 1999, fue protocolizado el Acta N° 54 de fecha 22 de febrero del año 1999 de Asamblea General Extraordinaria de modificación de los arts.1° y 6°  del contrato de constitución social, según providencia de fecha 19 de mayo de 1999, A. I. N° 797, anotado bajo el N° 491 serie “a” al folio 3966 y sgtes. seccion contratos y registro de personas jurídicas y asociaciones bajo el N° 102 serie “C” al folio 1357 y sgtes. en fecha 25 de mayo de 1999."]
[null,"9°) Escritura N°  78 de fecha  31 de diciembre de 2001, fue protocolizado el Acta N°. 57 de Asamblea General Extraordinaria de fecha 7 de diciembre de 2001 de emisión de titulos de deudas, emisión de acciones, aumento de capital a la suma de G 70.000.000.000  (guaranies setenta mil millones) y prorroga de duración, inscripto en la dirección general de los registros publicos, registro publico de comercio, A. I.  N° 347 providencia de fecha 19 de marzo de 2002, bajo el N° 149 serie “B” folios 1016 y sgtes. en fecha 22 de marzo de 2002 seccion contratos y registro de personas jurídicas y asociaciones bajo el n° 82 serie “G”  folios 947 y sgtes en fecha 1 de abril de 2002; "]
[null,"10°) Escritura N° 5 de fecha 2 de mayo de 2003, fue protocolizado el Acta N°. 61 de fecha 31 de marzo de 2003 de Asamblea General Extraordinaria referente a la  emisión de acciones y aumento de capital a la suma de G 100.000.000.000 (guaranies cien mil millones) modificándose los articulos 5º y 33º del contrato social, inscripta en la direccion general de los registros publicos, registro de personas jurídicas y asociaciones, según A. I. N° 1218 de fecha 17 de julio de 2003, bajo el N° 426, folio 5780, serie “F” y en el registro de contratos del registro publico de comercio bajo el N° 587, serie “b”, folios 7162 y sgtes. en fecha 30 de julio de 2003."]
[null,"11º) Escritura Nº  17 de fecha 8 de mayo de 2006, fue protocolizado el Acta N°. 66 de fecha 7 de abril de 2006 de Asamblea General Extraordinaria, referante a la emisión de acciones y aumento de capital social a la suma de G 150.000.000.000.-(guaranies ciento cincuenta mil millones) modificándose los articulos 5º y 33º de los estatutos sociales, inscripta en la dirección general de los registros publicos, registro publico de comercio, según A. I. N° 1216 de fecha 10 de julio de 2006, bajo el nº 847  serie e, folios 8330 y sgtes. de la seccion contratos y en la seccion personas jurídicas y asociaciones bajo el nº 547, serie “b”, folios 5844 y sgtes. en fecha 25 de julio de 2006.  "]
[null,"12º) Escritura Nº 8 de fecha 5 de mayo de 2008, fueron protocolizadas las actas, Nº  68 de fecha 14 de abril de 2008 de Asamblea Extraordinaria, referente al aumento del capital social a la suma de doscientos mil millones de guaranies ( G. 200.000.000.000 ), por la que se modifican los articulos 5º y 33º de los estatutos sociales y  la Nº 69 de Asamblea General Ordinaria, por la que se emiten acciones, inscripta en la direccion general de los registros  publicos, registro publico de comercio, dictamen nº 1985, según providencia de fecha 3 de junio de 2008, bajo el nº 194, serie “c”, folio 1818 de la seccion contratos y en la seccion personas juridicas y asociaciones bajo el  nº 589 y al folio 6814, el 6 de junio de 2008; "]
[null,"13º) Escritura Nº 7 de fecha 16 de abril de 2010, fue protocolizada el Acta Nº 72 de fecha 31 de marzo de 2010 de Asamblea General Extraordinaria, referente a la emision de acciones y aumento del capital social a la suma de doscientos cincuenta mil millones de guaranies (G250.000.000.000), modificandose los articulos 5º y 33º del estatuto social, inscripta en  la Direccion General de los Registros Publicos, Registro Publico de Comercio, dictamen Nº 1772 de fecha 3 de mayo de 2010, bajo el Nº 192, serie “g”, folio 2021, de la seccion contratos, el 10 de mayo de 2010 y en la seccion  personas juridicas y asociaciones bajo el nº 99 y al folio 988, serie “e” , el 10 de mayo de 2010;  "]
[null,"14º) Escritura Nº 12 de fecha 3 de junio de 2013, fue protocolizada el Acta Nº 79 de fecha  24 de mayo de 2013 de Asamblea General Extraordinaria, referente a la emision de  acciones y  aumento del capital social a la suma de doscientos setenta mil millones de guaranies (G 270.000.000.000.), modificandose los articulos 5º y 33º del estatuto social, inscripta en  la direccion general de los registros publicos, registro publico de comercio, bajo el Nº 140, serie “h”, folio 1479 y sgtes., de la seccion contratos, el 18 de junio de 2013 y en la seccion personas juridicas y asociaciones bajo el nº 538 y al folio 6508, serie “d” , el 18 de junio de 2013;                             "]
[null,"15º) Escritura Nº 3 de fecha 12 de mayo de 2016, fue protocolizada el Acta Nº 84 de fecha 11 de abril de 2016 de Asamblea General Extraordinaria, referente al  aumento del capital social a la suma de trescientos mil millones de guaranies (G 300.000.000.000.), modificandose los articulos 5º y 33º del estatuto social, inscripta en  la direccion general de los registros publicos, seccion personas juridicas y asociaciones matricula juridica Nº 5293 y en la seccion comercio matricula comercial Nº 5585 de fecha 7 de julio de 2016."]
[null,"16°)  Escritura Nº 13 de fecha 22 de octubre de 2018, fue protocolizada el Acta Nº 88 de fecha 05 de octubre de 2018 de Asamblea Extraordinaria, referente al  aumento del capital social a la suma de ochocientos mil millones de guaranies (G 800.000.000.000.), modificandose los articulos 5º y 33º del estatuto social, inscripta en  la direccion general de los registros publicos, seccion personas juridicas y asociaciones matricula juridica Nº 5293 de fecha 20 de marzo de 2019 y en la seccion comercio, matricula comercial Nº 5585 de fecha 16 julio de 2019;                      "]
[null,"17°) Escritura Nº 1, fecha 21 de enero 2020, fue protocolizada el Acta Nº 91 de fecha 11 de diciembre de 2019 de Asamblea Extraordinaria, Desmaterialización de acciones, modificandose los articulos 4°, 5º, 6°, 7° y 23º del estatuto social, inscripta en  la direccion general de los registros publicos, seccion personas juridicas y asociaciones matricula juridica Nº 5293 de fecha 26 de febrero de 2020 y en la seccion comercio, matricula comercial Nº 5585 de fecha 26 de febrero de 2020. "]
[]
[null,"La Sociedad tiene por objeto:"]
[]
[null,"a)         Importar y exportar toda clase de mercaderías, por cuenta propia o de terceros y/o asociada a terceros: comprar y vender bienes muebles o inmuebles y constituir derechos reales sobre ellos."]
[]
[null,"b)         Ejercer representaciones, comisiones, mandatos o consignaciones."]
[]
[null,"c)         Elaborar o industrializar todo género de productos o materias primas nacionales o extranjeras."]
[]
[null,"d)        Dar o tomar participación en cualquier sociedad, dentro o fuera del país que se realice con los objetos que se han indicado."]
[]
[null,"e)         Promover la radicación de capitales, empresas e industrias en la República del Paraguay."]
[]
[null,"f)          Explotar empresas de transportes y practicar, en fin, todo acto de comercio lícito."]
[]
[null,"En el año 1996 la Comisión  Nacional de Valores por medio de la Resolución N° 270/96 autoriza la inscripción definitiva de la Compañía como Sociedad Emisora de Capital Abierto. "]
[]
[]
[null,"A la fecha el Capital Integrado asciende a Gs. 635.041.900.000"]
[null,"Ejercicio Fiscal "]
[]
[null,"Conforme a los Estatutos Sociales y para adecuarse a los requerimientos de la Ley 125/91 y sus reglamentaciones el cierre del ejercicio económico y fiscal será el 31 de diciembre de cada año, por lo tanto los estados contables abarcarán el ejercicio correspondiente entre el 1 de enero al 31 de diciembre de cada año civil."]
[]
[null,"COMPOSICION DEL CAPITAL"]
[]
[null,"A     C     C     I     O     N    E     S"]
[null,"                                                   Nº  DE VOTOS QUE     SUSCRIPTO                  INTEGRADO                                                                                                  "]
[null,"  CANTIDAD       TIPO                    OTORGA C/U.                GS.                            GS.                                                       "]
[null,"  "]
[null,"3.792.183.-   ORDIN/NOMINATIVAS      5                              379.218.300.000.-                  379.219.300.000.-"]
[null,"   1.355.574.-     ORDIN/NOMINATIVAS     4                                135.557.400.000.-                    135.557.400.000.-"]
[null,"1.201.220.-     PREFE./NOMINATIVAS       1 RESTR                    120.122.000.000.-                    120.122.000.000.-"]
[null,"  6.348.977.-                                                                               634.897.700.000.-                        634.897.700.000.-"]
[null,"ACCIONES EN TESORERIA"]
[null,"        1.442.-   PREFER./NOMINATIVAS                                           144.200.000.-                        144.200.000.- "]
[null,"6.350.419.-                                                                                635.041.900.000.-                 635.041.900.000.-"]
[null,"========                                                                                  =============                    ============="]

{"sheet":"Nota 2","index":7,"n_rows":82,"n_cols":9,"rows_kept":82,"cut":false,"hidden":false,"merged":[[37,0,37,8],[56,9,56,10],[57,9,57,10],[2,0,2,8],[38,0,38,8],[8,0,8,8],[7,0,7,8],[5,0,5,8],[6,0,6,8],[34,0,34,8],[35,0,35,8],[4,0,4,8],[12,0,12,8],[30,0,30,8],[21,1,21,9],[9,0,9,8],[10,0,10,8],[29,0,29,8],[32,0,32,8],[36,0,36,8],[11,0,11,8],[33,0,33,8],[99,5,99,13],[58,0,58,8],[72,0,72,8],[65,0,65,8],[60,0,60,8],[61,0,61,8],[62,0,62,8],[66,9,66,10],[60,9,60,10],[61,9,61,10],[58,9,58,10],[80,0,80,8],[81,0,81,8],[69,9,69,10],[62,9,62,10],[78,0,78,7],[55,9,55,10],[82,0,82,8],[53,9,53,10],[54,0,54,8],[54,9,54,10],[53,0,53,8],[70,0,70,8],[59,0,59,8],[69,0,69,8],[64,0,64,8],[56,0,56,8],[57,0,57,8],[55,0,55,8],[39,0,39,8],[50,0,50,8],[51,0,51,8],[40,0,40,8],[41,0,41,8],[42,0,42,8],[43,0,43,8],[44,0,44,8],[46,0,46,8],[47,0,47,8]]}
[{"$f":"Indice!C1","v":"NICOLAS GONZALEZ ODDONE S.A.E.C.A"},null,null,"Indice"]
[]
["NOTA 2 - RESUMEN DE LAS PRINCIPALES POLÍTICAS CONTABLES"]
[]
["a.   Bases de contabilización "]
["Los presentes estados financieros se han preparado siguiendo los criterios de las Normas de Información Financiera (NIF) emitidas por el Consejo de Contadores Públicos del Paraguay sobre la base de costos históricos, excepto para el caso de activos y pasivos en moneda extranjera  y las propiedades, planta y equipo según se explica en los puntos c ) y k), y no reconocen en forma integral los efectos de la inflación sobre la situación patrimonial y financiera de la sociedad, sobre los resultados de sus operaciones y los flujos de efectivo, en atención a que la corrección monetaria no constituye una práctica contable obligatoria en el Paraguay. \n"]
["Según el índice general de precios del consumo (IPC) publicado por el Banco Central del Paraguay, la inflación acumulada del tercer trimestre fue de 4,6% en el año 2021 y 0,5% en el año 2020.\n\n"]
["b.   Uso de estimaciones contables"]
["La preparación de los presentes estados contables requiere que la Gerencia y el Directorio de la sociedad realicen estimaciones y evaluaciones que afectan el monto de los activos y pasivos registrados y contingentes revelados a fecha de cierre de cada balance, así como también los ingresos y egresos registrados en el ejercicio. El Directorio estima que los resultados reales futuros podrían diferir, en forma poco significativa, de las estimaciones y evaluaciones realizadas a la fecha de preparación de los presentes estados contables."]
[]
["c.   Moneda extranjera"]
["Los activos y pasivos en moneda extranjera se valúan a los tipos de cambio vigentes a la fecha de cierre del balance, publicados por la administración tributaria."]
["Las diferencias de cambio originadas por fluctuaciones en los tipos de cambio producidos entre las fechas de concertación de las operaciones y su liquidación o valuación al cierre del balance, son reconocidas en resultados."]
[null,null,"2021-09-30",null,null,null,"2020-12-31"]
[null,"Indicar moneda","Simbología ","Miles de Gs.",null,"Indicar moneda","Simbología","             Miles de Gs."]
["Activos C.","Euros ","€",0,null,"Euros ","€",141891416]
["Activos C.","Dólar Estadounidense  ","$",420862010617,null,"Dólar Estadounidense  ","$",392560970518]
["Activos N.C.","Dólar Estadounidense  ","$",2574927481,null,"Dólar Estadounidense  ","$",4854660818]
["Pasivos C.","Dólar Estadounidense  ","$",236597230772,null,"Dólar Estadounidense  ","$",192070643761]
["Pasivos NC.","Dólar Estadounidense  ","$",2184057621,null,"Dólar Estadounidense  ","$",4885020676,4885020676]
[]
[null,"El detalle de las cotizaciones de la moneda extranjera operada por la sociedad es el siguiente:"]
[]
[null,null,"2021-09-30",null,null,null,"2020-12-31"]
[null,"Indicar moneda","Simbología ","Cotización  Gs.",null,"Indicar moneda","Simbología ","Cotización Gs."]
["Activos ","Euros ","€",0,null,"Euros ","€",8466]
["Activos ","Dólar Estadounidense  ","$",6896,null,"Dólar Estadounidense  ","$",6892]
["Pasivos ","Dólar Estadounidense  ","$",6919,null,"Dólar Estadounidense  ","$",6942]
[]
["d.   Efectivo y equivalentes de efectivo"]
["Los saldos de este rubro al 30 de septiembre 2021 y 31 de diciembre de 2020, están compuestos por fondos de libre disponibilidad en poder de la Sociedad y en Bancos de plaza, en las modalidades de cuentas corrientes y cajas de ahorros en guaraníes y en moneda extranjera."]
[]
["e.   Inversiones"]
["Las inversiones temporales se valúan de acuerdo a los siguientes criterios de valuación:\n* Colocaciones financieras en moneda extranjera: a su valor de cotización al cierre del año/período . Ver Nota 4\n*  Las inversiones no corrientes en sociedades donde no se ejerce el control, se valúan al valor patrimonial proporcional. Ver Nota 8\n"]
["Obs.: En caso de la existencia de saldos y transacciones con partes relacionadas, la información que corresponda a ser expuesta por la sociedad, se ajustará  a lo requerido por la Norma de Información Financiera N° 7 Revelaciones de partes relacionadas."]
[]
["f. Previsión para cuentas de dudoso cobro/incobrables"]
["La Sociedad constituye previsiones sobre las cuentas de dudoso cobro o de difícil recuperabilidad, teniendo en cuenta el análisis de la Gerencia sobre   la antigüedad y cobrabilidad de cada uno de los créditos.  Las cuentas a cobrar en Gestión de Cobro Judicial y las que se encuentran en Convocatoria de Acreedores y/o Quiebra, han sido provisionadas en su totalidad.   "]
["Criterio para Previsiones                                                                                                                                                  "]
["1. Clientes que registran atrasos y estan por ser demandados. "]
["2. Clientes que tienen cuentas con otros proveedores y no estan pudiendo pagar."]
["3. Clientes con cheque devueltos."]
["4. Clientes que presentan atrasos normales."]
["5. Clientes sobregirados de acuerdo al límite de créditos establecido por el comité correspondiente."]
["6. Clientes que refinancian sus cuentas. "]
[]
["g. Inventarios"]
["Las existencias están valuadas al costo de adquisición más todos los gastos necesarios hasta la puesta en depósitos de la Compañía. La salida de las existencias es registrada utilizando el sistema de precio promedio ponderado. La Sociedad efectúa previsiones por obsolescencia de acuerdo al análisis de la Gerencia sobre la desvalorización y/o obsolescencia de los mismos.\n\nA partir del ejercicio 2008, la Compañía utiliza el Criterio del Valor Neto de Realización para valuar su hacienda vacuna. Ver Nota 7\n"]
["A partir del ejercicio 2008, la compañía utiliza el criterio del valor neto de realización para valuar su hacienda vacuna. Ver Nota 7"]
[]
["h. Activos disponibles para la venta"]
["Los activos disponibles para la venta representan bienes que fueron desafectados de la actividad productiva y se mantienen con el único objetivo de ser vendidos.  Los mismos se valúan, sin amortizar, al menor entre el valor de mercado de los mismos y su costo (valor libro) al momento de su designación como disponibles para la venta."]
[]
["i. Previsiones para desvalorización y deterioro de inventarios"]
["Las previsiones para desvalorización y deterioro de inventarios han sido estimadas tomando como base la valorización del stock deteriorado existente al cierre del ejercicio."]
[]
["j. Propiedades, planta y equipo"]
["Las propiedades, planta y equipo se exponen a su costo histórico ajustado por el % del valor residual  emitido por la Autoridad Tributaria, menos la correspondiente depreciación acumulada. El incremento neto por la re-expresión se acredita a la respectiva reserva patrimonial, cuyo saldo puede ser utilizado únicamente para  aumentar el capital."]
["El costo de las mejoras que extienden la vida útil de los bienes o aumentan su capacidad productiva es imputado a las cuentas respectivas del activo. Los gastos de mantenimiento son cargados a resultados."]
["La depreciación es calculada por el método de línea recta, conforme a la vida útil definida por la administración tributaria. "]
[]
["k. Intangibles"]
["Los intangibles se exponen a su costo incurrido menos las correspondientes amortizaciones acumuladas al cierre del año, y son reconocidas en los resultados."]
[]
["l. Reconocimiento de ingresos y egresos"]
["Los estados contables se preparan sobre la base de lo devengado. Bajo tal base los efectos de las transacciones y otros eventos son reconocidos cuando ocurren (y no cuando el efectivo o su equivalente es recibido o pagado) y son registrados en los libros contables y presentados en los estados financieros en los períodos a que se refieren. \n"]
[]
[]
[]
["m. Impuesto a la renta"]
["El Impuesto a la Rental, es calculado en base al resultado contable, ajustado por las partidas que la ley tributaria incluye o excluye para la actividad grabable, a esta cifra final se aplica la tasa del 10% en concepto de Impuesto a la Renta Empresarial Ley 6380/19 de Modernización del Sistema Tributario Nacional. \n\n"]
[]
["n. Restricciones a la distribución de utilidades"]
["No existen restricciones a la distribución de utilidades mas que lo siguiente: "]
["• La legislación paraguaya establece una transferencia del 5% de las utilidades del ejercicio para la constitución de una reserva legal hasta completar el 20% del "]
["capital integrado."]
["• De acuerdo a la ley Nº 6380/19 que deroga los libros I, III y IV de la Ley N° 125/91, la cual dispone aplicar sobre el importe a distribuir las siguientes tasas"]
["a) 8% (ocho por ciento) cuando el perceptor de los dividendos, utilidades o rendimientos sea una persona física, jurídica o entidad residente en el país."]
["b)15% (quince por ciento) cuando el perceptor de los dividendos, utilidades o rendimientos sea una persona física, jurídica o entidad no residente en el país, incluidos los obtenidos por la casa matriz del exterior."]
[]
["o. Acciones de tesoreria"]
["Al 30 de sptiembre de 2021, el saldo de Acciones en Tesorería es de 1.442 acciones. El valor nominal de dichas acciones es de G. 100.000.- cada una. El tratamiento contable que corresponde es el de las acciones propias en cartera, por lo que se las registró por su valor nominal en una cuenta denominada Acciones en Tesorería, y por la diferencia de valor entre el valor pagado y el valor nominal se debitó a otra cuenta denominada Prima de Recompra de Acciones, actuando ambas cuentas como Reguladoras del Patrimonio Neto."]

{"sheet":"Nota 3","index":8,"n_rows":20,"n_cols":4,"rows_kept":20,"cut":false,"hidden":false,"merged":[]}
[{"$f":"Indice!C1","v":"NICOLAS GONZALEZ ODDONE S.A.E.C.A"},null,"BG"]
[]
["NOTA 3 - EFECTIVO Y EQUIVALENTE DE EFECTIVO"]
["En miles de guaranies"]
[]
["La composición de la cuenta es la siguiente:"]
[]
["Cuentas ",null,"2021-09-30","2020-12-31"]
[]
["Recaudaciones a Depositar",null,2954667590,5478369942]
["Fondo Fijo",null,{"$f":"13500000+10000000+28000000+12000000+25000000+10000000+3000000","v":101500000},{"$f":"13500000+10000000+24500000+12000000+25000000+10000000+3000000","v":98000000}]
["Fondo de Sencillo ",null,{"$f":"1000000+2400000+2000000+1000000","v":6400000},{"$f":"1000000+2200000+2000000","v":5200000}]
[null,null,{"$f":"SUM(C10:C12)","v":3062567590},{"$f":"SUM(D10:D12)","v":5581569942}]
[]
["Bancos Cuentas Corrientes - Moneda Local (Gs)",null,7475951113,5720172159]
["Bancos Locales Cajas de Ahorros - Moneda Local (Gs)",null,35743999551,16393961813]
["Bancos Locales CTA.CTE Y C.AH - Moneda Extranjera (USD)",null,{"$f":"74071236173","v":74071236173},37079192591]
["Bancos Locales - Moneda Extranjera (EU)",null,0,141891416]
[null,null,{"$f":"SUM(C15:C18)","v":117291186837},{"$f":"SUM(D15:D18)","v":59335217979}]
["Total Disponibilidades",null,{"$f":"+C13+C19","v":120353754427},{"$f":"+D13+D19","v":64916787921}]

{"sheet":"Nota 4","index":9,"n_rows":20,"n_cols":3,"rows_kept":20,"cut":false,"hidden":false,"merged":[[2,0,2,2],[6,1,6,2],[3,0,3,1]]}
[{"$f":"Indice!C1","v":"NICOLAS GONZALEZ ODDONE S.A.E.C.A"},null,"BG"]
[]
["NOTA 4 - INVERSIONES TEMPORIAS - INVERSIONES FINANCIERAS"]
["En miles de guaranies"]
[]
["La composición de la cuenta es la siguiente:"]
[]
["Cuentas ","2021-09-30","2020-12-31"]
["Casa de Bolsa Puente ME",734879274,7867753315]
["CDA Bancop ",0,20676000000]
["Casa de Bolsa CADIEM",23575441607,27948468587]
["Puente - Fondos Mutuos ML",0,0]
["Puente - Fondos Mutuos ME",86396122,31284422782]
["Regional casa de Bolsa S.A ME",4288759270,11168968440]
["Pershing LLC- Exterior",27717380639,41352000000]
["Casa de Bolsa Cadiem Fondos Mutuos ME",27620328404,32079868476]
["Casa de Bolsa Cadiem Fondos Mutuos ML",3590650502,0]
["Investor casa de bolsa S.A Fondos mutuos ML",0,0]
["Regional casa de Bolsa S.A Fondos MutuosG.",1738353230,0]
["Total",{"$f":"SUM(B9:B19)","v":89352189048},{"$f":"SUM($C$9:C19)","v":172377481600}]

{"sheet":"Nota 5","index":10,"n_rows":49,"n_cols":8,"rows_kept":49,"cut":false,"hidden":false,"merged":[[52,2,52,3],[6,2,6,3],[53,2,53,3],[25,2,25,3],[2,0,2,2],[3,0,3,1],[5,2,5,3]]}
[{"$f":"Indice!C1","v":"NICOLAS GONZALEZ ODDONE S.A.E.C.A"},"BG"]
[]
["NOTA 5 - CUENTAS POR COBRAR COMERCIALES"]
["En miles de guaranies"]
[]
[]
["Las cuentas a cobrar comerciales a corto plazo se integran como sigue:",null,null,null,null,"Situación","Monto","% Previsiones  sobre Cartera "]
[null,null,"2021-09-30","2020-12-31",null,"A  Total Cartera no Vencida",{"$f":"254129618265+7430213211+47744487+22125677218","v":283733253181},2.9899999999999999E-2]
["Deudores por ventas locales","Moneda Local Guaraníes",{"$f":"179829891988+687884032-C11","v":161059627268},165834315005,null,"B. Total Cartera Vencida",{"$f":"+C28+C29+C40+C46+C35","v":35954860259},0.96464000000000005]
["Deudores por ventas locales","Moneda Extranjera Dólares",{"$f":"2062740140-C12-C16","v":2056176458.4400001},3485616440,null,"Composición Cartera Vencida"]
["Deudores - Entidad relacionada","Moneda Local Guaraníes",{"$f":"35432457499-49636360-C34+45653229+1000000+316668+6156481473-2446539","v":19458148752},29769291745,null,"Normal",{"$f":"+C28+C29+C46","v":4612935120},0.72307999999999995]
["Deudores - Entidad relacionada","Moneda Extranjera Dólares",{"$f":"624.11*6896","v":4303862.5600000005},3821621,null,"En Gestión de Cobro",12233152737,1]
["Cheques adelantados recibidos de clientes","Moneda Local Guaraníes",{"$f":"68397373750+5454750151","v":73852123901},89615029748,null,"En Gestión de Cobro Judicial",19107710418,1]
["Cheques rechazados","Moneda Local Guaraníes",761236114,1382886373,null,"Total de la cartera de créditos (A+B)",{"$f":"+G8+G9","v":319688113440}]
["Cupones Tj.credito ","Moneda Local Guaraníes",47744487,33255184]
["Deudores-Otros ingresos exterior ","Moneda Extranjera Dólares",2259819,19171900,null,"(-) Total Previsiones",{"$f":"-3211646756-12233152737-19107710418-7430213211","v":-41982723122}]
["Otros","Moneda Extranjera otros",{"$f":"8684345015-4318389714","v":4365955301},2260509411]
["Menos Previsiones",null,-7430213211,-7954685940,null,"TOTAL  NETO DE LA CARTERA DE CRÉDITOS",{"$f":"+G14+G16","v":277705390318}]
["Total",null,{"$f":"SUM(C9:C18)","v":254177362752},{"$f":"SUM(D9:D18)","v":284449211487}]
[null,null,null,null,null,"Observaciones"]
[null,null,null,null,null,"Criterios de Clasificación utilizados","De","A"]
[null,null,null,null,null,"Normal",30,60]
[null,null,null,null,null,"En Gestion de cobro",61,150]
[null,null,null,null,null,"En Gestión de Cobro Judicial","          Mas de 151 "]
["Las cuentas a cobrar comerciales a largo plazo se integran como sigue:"]
[]
[null,null,"2021-09-30","2020-12-31"]
["Deudores por ventas locales","Moneda Local Guaraníes",{"$f":"26341544261-C34","v":4215867043},3959410783]
["Deudores por ventas locales","Moneda Extranjera Dólares",{"$f":"398130061-C46-C35","v":393620077},0]
["Deudores por ventas locales","Moneda Extranjera otros"]
["Deudores por ventas en el exterior","Moneda Local Guaraníes"]
["Deudores por ventas en el exterior","Moneda Extranjera Dólares"]
["Deudores por ventas en el exterior","Moneda Extranjera otros"]
["Deudores - Entidad relacionada","Moneda Local Guaraníes",22125677218,0]
["Deudores - Entidad relacionada","Moneda Extranjera Dólares",{"$f":"154*6896","v":1061984},0]
["Deudores - Entidad relacionada","Moneda Extranjera otros"]
["Cheques adelantados recibidos de clientes","Moneda Local Guaraníes"]
["Cheques adelantados recibidos de clientes","Moneda Extranjera Dólares"]
["Cheques adelantados recibidos de clientes","Moneda Extranjera otros"]
["Deudores en gestión judicial","Moneda Local Guaraníes",{"$f":"12233152737+19107710418","v":31340863155},30147869835]
["Deudores en gestión judicial","Moneda Extranjera Dólares"]
["Deudores en gestión judicial","Moneda Extranjera otros"]
["Cheques rechazados","Moneda Local Guaraníes"]
["Cheques rechazados","Moneda Extranjera Dólares"]
["Otros","Moneda Local Guaraníes"]
["Deudores-Otros ingresos exterior ","Moneda Extranjera Dólares",{"$f":"6896*500","v":3448000},4824676]
["Otros","Moneda Extranjera otros",0,0]
["Menos Previsiones",null,{"$f":"-3211646756-12233152737-19107710418","v":-34552509911},-33359516591]
["Total",null,{"$f":"SUM(C28:C48)","v":23528027566},{"$f":"SUM(D28:D48)","v":752588703}]

{"sheet":"Nota 6","index":11,"n_rows":88,"n_cols":7,"rows_kept":88,"cut":false,"hidden":false,"merged":[]}
[{"$f":"Indice!C1","v":"NICOLAS GONZALEZ ODDONE S.A.E.C.A"},"BG"]
[]
["NOTA 6 - OTROS CRÉDITOS"]
["En miles de guaranies"]
[]
["La composición de la cuenta es la siguiente:"]
[]
["Cuentas ","2021-09-30","2020-12-31"]
["Corrientes - Actividad Comercial  "]
[]
["Anticipo de sueldos y comisiones ",300000,1625023]
["Anticipo de remuneraciones Direct. y Gerentes ",20454400,1340450]
["Anticipos para gastos de despachos",766652246,96134895]
["Anticipo para gastos varios ",12675322,58990584]
["Anticipo para compras activo fijo ",289161548,285525648]
["Anticipo para reparación edificios/activo fijo",946871067,0,null,"NOTA 6.1 - INVERSIONES FINANCIERAS"]
["Anticipo para instalación de mercaderías ",85318469,160074529,null,"No corrientes "]
["Préstamos al personal ",245527371,258491280]
["Préstamos a terceros ",2127786033,1155383625,null,"Cuentas ","2021-09-30","2020-12-31"]
["Deudores por alquileres a cobrar",114513084,113921650]
["Garantías de alquiler",32652381,31652381,null,"Intereses a vencer ME-LP",2176797420,4849836142]
["Intereses s/ Inversiones PF a cobrar",524393424,275528437,null,"Total Inversiones financieras",{"$f":"F21","v":2176797420},{"$f":"SUM(G21)","v":4849836142}]
["Seguros a cobrar",2963098,17437386]
["Retenciones Impuesto a la Renta ",0,0]
["Deudores por alquileres a cobrar ME",22068441,73478507]
["Garantías de alquiler ME",168434800,168337100]
["Gastos realizados por cta. De terceros ",128112286,128111718]
["Préstamos a directores",0,0]
["Intereses a vencer ",152130781,1896125207]
["Impuesto al valor agregado ",18263405,363957661]
["Retenciones de IVA ",0,790874499]
["Alquileres Pagados por Adelantado ME",205855229,401281913]
["Anticipo Impuesto a la Renta ",1256597526,0]
["Deudores por Vta. de Activo Fijo",1378010960,2859490800]
["Préstamos a terceros ME",4427059600,0]
["Préstamos al personal ME ",83931216,0]
["Anticipo para préstamos a terceros ",0,2067600000]
["Anticipo para Inversiones Financieras ME",0,0]
["Derechos aduaneros a aplicar ",0,0]
["Anticipo para Inversiones Financieras ME",0,0]
["Derechos aduaneros a aplicar ",0,0]
["Previsiones para incobrables ",0,0]
["Intereses pagados a recuperar ME. INV.FINANC",0,0]
["Total",{"$f":"SUM($B$11:B43)","v":13009732687},{"$f":"SUM($C$11:C43)","v":11205363293}]
[]
[]
["Corrientes - Actividad Ganadera"]
["Anticipo al personal Act.Ganadera ",75232233,11595636]
["Anticipos a Contratistas Act. Ganadera ",182936425,43674137]
["Anticipos p/ viáticos a la estancia Act. Ganadera ",12658773,7149041]
["Anticipos para gastos varios Act. Ganadera ",0,33485700]
["Combustibles a utilizar",63528533,93365002]
["Total",{"$f":"SUM(B48:B52)","v":334355964},{"$f":"SUM(C48:C52)","v":189269516}]
["Total general Otros créditos Act. Comercial y Ganadera ",{"$f":"+B44+B53","v":13344088651},{"$f":"+C44+C53","v":11394632809}]
[]
[]
["NOTA 6 - OTROS ACTIVOS "]
["En miles de guaranies"]
[]
["La composición de la cuenta es la siguiente:"]
["Cuentas ","2020-03-31","2019-12-31"]
["Corrientes"]
["Impuesto Inmobiliario ",241663304,0]
["Tasas Especiales",36821402,0]
["Patente Municipal",395438487,0]
["Impuestos y Tasas s/ Inversiones Inmob.",147672359,0]
["Impuestos y Tasas Prop. Rural",185842301,0]
["Total",{"$f":"SUM(B63:B67)","v":1007437853},{"$f":"SUM(C63:C67)","v":0}]
[]
[]
[]
["Cuentas ","2020-12-31","2019-12-31"]
["No Corrientes"]
["Derecho Aduanero a Regularizar",0,0]
["Total",{"$f":"SUM(B74:B74)","v":0},{"$f":"SUM(C74:C74)","v":0}]
[]
[]
["En miles de guaranies"]
[]
["La composición de la cuenta es la siguiente:"]
["Cuentas ","2021-09-30","2020-12-31"]
["Corrientes"]
["Impuesto Inmobiliario ",92103036,0]
["Tasas Especiales",21236442,0]
["Patente Municipal",135212673,0]
["Impuestos y Tasas Mun. s/ INM.INV.",48668108,0]
["Impuestos y Tasas Prop. Rural",66152329,0]
["Total",{"$f":"SUM(B83:B87)","v":363372588},{"$f":"SUM(C83:C87)","v":0}]

{"sheet":"Nota 7","index":12,"n_rows":36,"n_cols":3,"rows_kept":36,"cut":false,"hidden":false,"merged":[[5,0,5,6]]}
[{"$f":"Indice!C1","v":"NICOLAS GONZALEZ ODDONE S.A.E.C.A"},"BG"]
[]
["NOTA 7 – INVENTARIOS"]
["En miles de guaranies"]
[]
["Los bienes de cambio están compuestos de la siguiente manera:"]
[]
["Cuentas ","2021-09-30","2020-12-31"]
["Corrientes - Actividad Comercial  "]
["Mercaderías Gravadas ",120933250466,97971446508]
["Mercaderías S/Dto. 6406/05",53373138700,53504991180]
["Mercaderías con Obsolescencia",{"$f":"7571957552+9908904+1461249157","v":9043115613},{"$f":"10831592434+9908904+2220707135","v":13062208473}]
["Fondo de Obsolescencia ",{"$f":"-2656753050-9908904-345386936","v":-3012048890},{"$f":"-3769848040-9908904-578627332","v":-4358384276}]
["Repuestos Gravados ",9939288475,6027506776]
["Repuestos S/Dto. 6406/05",3376645,0]
["Repuestos con Obsolescencia",{"$f":"1182852571+32616353","v":1215468924},1622584140]
["Fondo de Obsolescencia ",{"$f":"-757879337-32595789","v":-790475126},-1022344666]
["Importaciones en curso ",237545822344,168362411469]
["Anticipo a Proveedores del Exterior",23317098050,8312682009]
["Total ",{"$f":"SUM(B10:B19)","v":451568035201},{"$f":"SUM(C10:C19)","v":343483101613}]
[]
["Corrientes - Actividad Ganadera "]
[]
["Hacienda Vacuna ",22458990540,16143163260]
["Hacienda Vacuna - Capitalización",44037000,4909773580]
["Total ",{"$f":"SUM(B24:B25)","v":22503027540},{"$f":"SUM(C24:C25)","v":21052936840}]
["Total general Inventarios Corrientes ",{"$f":"+B20+B26","v":474071062741},{"$f":"+C20+C26","v":364536038453}]
[]
[]
[]
["No corrientes - Actividad Comercial"]
[]
["Repuesto Grav. C/Obsolescencia ",{"$f":"3664913232+62403739","v":3727316971},2866324632]
["Fondo de Obsolescencia. Repuesto Grav. ",{"$f":"-994562299-55263903","v":-1049826202},-1138862036]
["Total",{"$f":"SUM(B33:B34)","v":2677490769},{"$f":"SUM(C33:C34)","v":1727462596}]
["Total general Inventarios no corrientes ",{"$f":"SUM(B35)","v":2677490769},{"$f":"SUM(C35)","v":1727462596}]

{"sheet":"Nota 8","index":13,"n_rows":35,"n_cols":6,"rows_kept":35,"cut":false,"hidden":false,"merged":[[3,0,3,6]]}
[{"$f":"Indice!C1","v":"NICOLAS GONZALEZ ODDONE S.A.E.C.A"},"BG"]
[]
[]
["Nota 8 - INVERSIONES EN ASOCIADAS"]
["En miles de guaraníes"]
[]
["Las inversiones en sociedades donde no se ejerce control se describen a continuación:"]
[]
[null,"2021-09-30","2020-12-31"]
["Total Inversión",{"$f":"+C35","v":47024924776},44713924776]
[]
["a) Datos sobre la sociedad:"]
[null,null,null,{"$f":"IFERROR(IF([2]Indice!B6=\"\",\"2XX2\",YEAR([2]Indice!B6)),\"2XX2\")","v":2020},"2021-09-30","2020-12-31"]
["Nombre de Sociedad","RUC","Cantidad de acciones","Total Patrimonio neto","Total del resultado"]
["Todo Franquicia S.A","80056073-6",17499,10106849270,7813643472,-5669536393]
["Confort para el Hogar - CPH S.A","80083931-5",33313,34630603592,6904280239.8000002,7932478564]
["Best Credit S.A","80111979-0",291,300000000,9601193,0]
["Best Home S.A ","80117733-2",2020,2030000000,7994226,0]
[]
[]
["Total ",null,null,null,{"$f":"SUM(E15:E20)","v":14735519130.799999},{"$f":"SUM(F15:F20)","v":2262942171}]
[]
[]
["b) Datos sobre la inversión:"]
[]
["Cantidad de acciones","Participación sobre los votos (%)","Total Inversión (miles de Gs)","Participación sobre el Patrimonio Neto (%)","Total valuación patrimonial proporcional","Resultado sobre inversiones"]
[17477,"5 voto por accion",10093710366,{"$f":"+C27/D15","v":0.99870000000504611},{"$f":"D27*D15","v":10093710366},{"$f":"+D27*E15","v":7803485735.5258284}]
[33304,"1 voto por accion",34620214410,{"$f":"+C28/D16","v":0.99969999997336456},{"$f":"D28*D16","v":34620214410},{"$f":"+D28*E16","v":6902208955.5441618}]
[291,"1 voto por accion",{"$f":"+A29*1000000","v":291000000},{"$f":"+C29/D17","v":0.97},{"$f":"D29*D17","v":291000000},{"$f":"+D29*E17","v":9313157.209999999}]
[2020,"1 voto por accion",{"$f":"+A30*1000000","v":2020000000},{"$f":"+C30/D18","v":0.99507389162561577},{"$f":"D30*D18","v":2020000000},7954845.5763546797]
[null,null,null,{"$f":"+C31/D19","v":{"$error":"#DIV/0!"}},{"$f":"C31*D19","v":0},0]
[null,null,null,{"$error":"#DIV/0!"},{"$f":"C32*D20","v":0}]
[0,null,{"$f":"+A33*1000000","v":0},{"$f":"+C33/D17","v":0},0,{"$f":"+D33*E21","v":0}]
[0,null,{"$f":"+A34*1000000","v":0},{"$f":"+C34/D18","v":0},0,{"$f":"+D34*E22","v":0}]
[null,null,{"$f":"SUM(C27:C34)","v":47024924776},null,{"$f":"SUM(E27:E32)","v":47024924776},{"$f":"SUM(F27:F32)","v":14722962693.856344}]

{"sheet":"Nota 9","index":14,"n_rows":50,"n_cols":13,"rows_kept":50,"cut":false,"hidden":false,"merged":[[8,0,8,12],[10,1,10,5],[10,6,10,11],[54,0,54,12]]}
["Obs.:"]
["Incluir aclaraciones en los siguientes casos:"]
["1.      Cuando los bienes de uso tienen alguna restricción sobre su utilización, como por ejemplo cuando están garantizando obligaciones. En su caso también hacer referencia a la nota correspondiente."]
["2.      Cuando exista alguna previsión por desvalorización (“deterioro”), detallando la evolución de la misma en el transcurso del año."]
["3.      Si se están capitalizando intereses al costo de bienes de uso. En su caso deberá aclararse la tasa utilizada para la capitalización."]
["Ver adicionalmente Norma de Información Financiera N° 11 Propiedades, planta y equipo"]
["NICOLAS GONZALEZ ODDONE SAECA ","BG"]
[]
["NOTA 9 - PROPIEDADES, PLANTA Y EQUIPO - NETO"]
["En miles de guaraníes"]
[null,"V     A     L     O    R     E     S        D   E         O     R    I     G     E     N ",null,null,null,null," D     E     P     R     E     C     I    A     C     I   O     N     E     S             "]
[null,"AL Inicio del periodo","Adquisiciones+ Transf. Del periodo","Bajas del periodo","Revalúo del año","Valor  al cierre del periodo","Depreciación acumulada  al inicio del año","Altas y Transf. Del periodo","Bajas de  del periodo","Revalúo depreciación acumulada del año","Depreciación acumulada  al final del periodo","Valor neto resultante","Valor neto resultante"]
[null,null,null,null,null,null,null,null,null,null,null,"2021-09-30","2020-12-31"]
["Actividad Comercial "]
["Muebles, Útiles y enseres ",15654467909,{"$f":"527273+1054545+6910000+42099750+1407100+837685+2006404+1299236-42099750+850641+596393+365885+1000000+781179+1636364+2363636-2621436+545455+1363636+9247745+942466+32750000+1585103+1288488+1600000+990930+6201520+6044003+6178941-222520+563636+563636+2636364+3090909+631430+1265111+1307673+1307673+563636+563636+1500000+1567641+1405626+2181818+2545455+2545455+2772727+750000+618182+1218182+42038815+34175000+68350000+3280800+1640400+46210820+3419360+872727+249091+102319533+1118187+837600+1559770+20089696+563636+563636+563636+2590909+654545+1309091+932091+1786080+1190728+5580504+512486","v":459538603},0,null,{"$f":"+B15+C15-D15","v":16114006512},7064368619,{"$f":"359525382+505107292-19493+155365743+166854946+151545275","v":1338379145},0,null,{"$f":"+G15+H15-I15","v":8402747764},{"$f":"+F15-K15","v":7711258748},8590099290]
["Máquinas de Oficinas ",4847064895,{"$f":"3277273+4252149+4049974+4049974+96728434+1644346+3376010+3376010+3910295+5131927+3376010+5131927+5131927+5131927+38720794+4379838-1705485+6217600+6217600+6217600+852709+12429103+603000+1206000-852709+6246651+91393630+696285904+4445024+4445024+4445024+6237436+12512000+1985461+365255969+22510175+3974002+94048+2115524+432523+21306+3974002+570423+4014347+2912624+4014347+2507400+8750486+373010306+3873900+1577195+1654131+1577195+1654131+4008584+4683300+2569673+1654131","v":1868260109},{"$f":"980289+4813128+3269708","v":9063125},null,{"$f":"+B16+C16-D16","v":6706261879},3416824823,{"$f":"136374747+350997789+9759+81228757+174348779+196537278","v":939497109},{"$f":"4652202-1382494","v":3269708},null,{"$f":"+G16+H16-I16","v":4353052224},{"$f":"+F16-K16","v":2353209655},1430240072]
["Maquinarias, Herramientas y Equipos",3415377288,{"$f":"47300000+42099750+1022727+5681818+867955+17914066+718182+78702279+936364+580569+38313136+12023523+19271152+936364","v":266367885},0,null,{"$f":"+B17+C17-D17","v":3681745173},2149174720,{"$f":"84483947+153475902+39659975+48280547+49140602","v":375040973},0,null,{"$f":"+G17+H17-I17","v":2524215693},1157529480,1266202568]
["Edificios y Construcciones ",118317919729,{"$f":"602822333+1768488","v":604590821},23061183,null,118899449367,25171400989,{"$f":"595104743+630446249+204258498-1768488-248829+211896223+205462043","v":1845150439},0,null,{"$f":"+G18+H18+I18","v":27016551428},{"$f":"+F18-K18","v":91882897939},93146518740]
["Transportes Terrestres ",6407512912,{"$f":"110327261+6000000+11363636+114334551+111272752+11363636+59732696","v":424394532},{"$f":"92041154+25755961","v":117797115},null,{"$f":"+B19+C19-D19","v":6714110329},4250566871,{"$f":"15781975+105385722+188775423+49026857+49026857+55351496","v":463348330},41537936,null,4672377265,2041733064,2156946041]
["Instalaciones ",15882463592,{"$f":"46169768+5727273","v":51897041},0,null,15934360633,12799848524,{"$f":"230869079+461833124+115450367+115450367+115450368","v":1039053305},{"$f":"D20","v":0},null,13838901829,{"$f":"+F20-K20","v":2095458804},3082615068]
["Construcciones en curso",213798506,{"$f":"9170000+27978182+61107025+2018182+29141336+47035080+13150000+5989153+1521386+30103466+15493522+5071255+24266468+56403864+4823727+57475727+17963660+9306830+136363636+206202254","v":760584753},{"$f":"260000+280000+220000+72727+263637+181818+181818+263637+909+602822333","v":604546879},null,369836380,0,0,0,null,0,{"$f":"+F21-K21","v":369836380},213798506]
["Construcciones en previo Ajeno ",1826371556,0,0,null,1826371556,1704960284,{"$f":"13174946+21800339+5829214+5829214+5829214","v":52462927},0,null,1757423211,{"$f":"+F22-K22","v":68948345},121411272]
["Aviones",3746716084,0,0,null,3746716084,2299151076,{"$f":"95703636+167477816+43863575+43863575+43863575","v":394772177},0,null,2693923253,{"$f":"+F23-K23","v":1052792831},1447565008]
["Sub Totales",{"$f":"SUM(B15:B23)","v":170311692471},{"$f":"SUM(C15:C23)","v":4435633744},{"$f":"SUM(D15:D23)","v":754468302},null,{"$f":"SUM(F15:F23)","v":173992857913},{"$f":"SUM(G15:G23)","v":58856295906},{"$f":"SUM(H15:H23)","v":6447704405},{"$f":"SUM(I15:I23)","v":44807644},null,{"$f":"SUM(K15:K23)","v":65259192667},{"$f":"SUM($L$15:L23)","v":108733665246},{"$f":"SUM($M$15:M23)","v":111455396565}]
[]
["Actividad Ganadera"]
["Construcciones ",{"$f":"977199205+974781158+262460243+42091183","v":2256531789},{"$f":"4881818+14983200+20498809+14983200+14515300","v":69862327},{"$f":"14983200","v":14983200},null,{"$f":"+B27+C27-D27","v":2311410916},486952026,{"$f":"11534635+10591031+13366692","v":35492358},0,null,522444384,{"$f":"+F27-K27","v":1788966532},1769579763]
["Instalaciones ",884246061,{"$f":"8313636","v":8313636},0,null,{"$f":"+B28+C28-D28","v":892559697},664145843,{"$f":"6945820+9956892+8025857","v":24928569},0,null,689074412,{"$f":"+F28-K28","v":203485285},220100218]
["Mejoras",{"$f":"7013853549+2947869159+1276882744+10056263148+59942704+321600302+1885496794+38483202+49053841+1653549810+694953452","v":25997948705},{"$f":"22659545+36502200+18805000+22500000+29941800+79324200+11859091+40700000+5627273+9584545+11537900+3458182+4769000+51983000+63717800+28093000+52089818+58635000+43032500+25968182+22581339+124545455+150913636+6109091+3038718+913771+5749858","v":934639904},0,null,{"$f":"+B29+C29-D29","v":26932588609},11553206986,{"$f":"319644698+419920308+398464527","v":1138029533},0,null,{"$f":"G29+H29-I29","v":12691236519},{"$f":"+F29-K29","v":14241352090},14444741719]
["Muebles y Equipos",{"$f":"212764439+11422637+5550985","v":229738061},{"$f":"1545455+1127273+1242846+1436364+5069566+513519+3376010+2116092+477467+893040+595364+1395126+2238727+5721461","v":27748310},0,null,{"$f":"+B30+C30-D30","v":257486371},174324401,{"$f":"3596093+5711931+5567000","v":14875024},0,null,{"$f":"G30+H30-I30","v":189199425},{"$f":"+F30-K30","v":68286946},55413660]
["Maquinarias e Implementos ",{"$f":"2318557984+167018593+79247788+89970847+72357801","v":2727153013},{"$f":"6135454+4868181","v":11003635},{"$f":"126913257","v":126913257},null,2611243391,1880353232,{"$f":"43982520+16204249+78248945+59813684","v":198249398},63766961,null,2014835669,{"$f":"+F31-K31","v":596407722},846799781]
["Equipos y Herramientas ",{"$f":"22077404+69035510+1062945384","v":1154058298},{"$f":"3340455+4868181+3340455+6135454+5040909+2989800","v":25715254},{"$f":"14344090","v":14344090},null,1165429462,870320103,{"$f":"24007662+45776553+45582928","v":115367143},0,null,985687246,179742216,283738195]
["Transportes Terrestres ",{"$f":"461406079+75267674+171910540+2356112","v":710940405},0,0,null,710940405,332012788,{"$f":"18712833+28530617+26070980","v":73314430},0,null,405327218,305613187,378927617]
["Equipos de Comunicación",103038406,{"$f":"4545455+3636364","v":8181819},0,null,111220225,83215981,{"$f":"1208198+2193791+2635574","v":6037563},0,null,89253544,21966681,19822425]
["Sub Totales",{"$f":"SUM(B27:B34)","v":34063654738},{"$f":"SUM(C27:C34)","v":1085464885},{"$f":"SUM(D27:D34)","v":156240547},null,{"$f":"SUM(F27:F34)","v":34992879076},{"$f":"SUM(G27:G34)","v":16044531360},{"$f":"SUM(H27:H34)","v":1606294018},{"$f":"SUM(I27:I34)","v":63766961},null,{"$f":"SUM(K27:K34)","v":17587058417},{"$f":"SUM($L$27:L34)","v":17405820659},{"$f":"SUM($M$27:M34)","v":18019123378}]
[null,null,null,null,null,null,null,null,null,null,null,{"$f":"+M33-'[3]Nota 9'!$L$36","v":0}]
["NO SUJETOS A DEPRECIACION",null,null,null,null,null,null,null,null,null,null,{"$f":"+M34-'[3]Nota 9'!$L$37","v":0}]
[]
["Actividad Comercial "]
["Inmuebles-Terrenos ",26146885643,0,0,null,{"$f":"+B40+C40-D40","v":26146885643},0,0,0,null,0,{"$f":"+F40-K40","v":26146885643},26146885643]
[null,{"$f":"SUM(B40)","v":26146885643},{"$f":"SUM(C40)","v":0},{"$f":"SUM(D40)","v":0},null,{"$f":"SUM(F40)","v":26146885643},{"$f":"SUM(G40)","v":0},{"$f":"SUM(H40)","v":0},{"$f":"SUM(I40)","v":0},null,{"$f":"SUM(K40)","v":0},{"$f":"SUM(L40)","v":26146885643},26146885643]
["Actividad Ganadera"]
["Inmuebles Rurales",155232969990,0,0,null,155232969990,0,0,0,null,0,155232969990,155232969990]
[null,{"$f":"SUM(B43)","v":155232969990},0,0,0,155232969990,0,0,0,0,0,{"$f":"SUM(L43)","v":155232969990},155232969990]
[]
["Hacienda Permanente",{"$f":"26300644704+51673810+4942850709+824990852","v":32120160075},{"$f":"6432584492+84863418+17670000+930000+1818182+819472090+3181818+35714286+92618182+18327273+44376000+954000+45570909+28800000+1440000+95238095+16571429+870000+6362182+75000+6000000","v":7753437356},{"$f":"79785000+202952382+132295294+162355827+232525682+44100000+110812500+192354790+1327928864+33468750+215768750+203895000+5492475600","v":8430718439},null,{"$f":"+B46+C46-D46","v":31442878992},947789472,0,{"$f":"101476191+61254782","v":162730973},null,{"$f":"G46+H46-I46","v":785058499},{"$f":"+F46-K46","v":30657820493},31172370603]
["Pasturas",17701577148,{"$f":"3600000+5000000+12935026","v":21535026},0,null,17723112174,10187762795,{"$f":"230423655+304273753+275879791","v":810577199},0,null,{"$f":"G47+H47-I47","v":10998339994},{"$f":"+F47-K47","v":6724772180},7513814353]
[null,{"$f":"SUM(B46:B47)","v":49821737223},{"$f":"SUM(C46:C47)","v":7774972382},{"$f":"SUM(D46:D47)","v":8430718439},null,{"$f":"SUM(F46:F47)","v":49165991166},{"$f":"SUM(G46:G47)","v":11135552267},{"$f":"SUM(H46:H47)","v":810577199},{"$f":"SUM(I46:I47)","v":162730973},null,{"$f":"SUM(K46:K47)","v":11783398493},{"$f":"SUM(L46:L47)","v":37382592673},{"$f":"SUM(M46:M47)","v":38686184956}]
["Sub Totales",{"$f":"+B41+B44+B48","v":231201592856},{"$f":"+C41+C44+C48","v":7774972382},{"$f":"+D41+D44+D48","v":8430718439},null,{"$f":"+F41+F44+F48","v":230545846799},{"$f":"+G41+G44+G48","v":11135552267},{"$f":"+H41+H44+H48","v":810577199},{"$f":"I41+I44+I48","v":162730973},null,{"$f":"K41+K44+K48","v":11783398493},{"$f":"+L41+L44+L48","v":218762448306},{"$f":"+M41+M44+M48","v":220066040589}]
["Total General ",{"$f":"+B24+B35+B49","v":435576940065},{"$f":"+C24+C35+C49","v":13296071011},{"$f":"+D24+D35+D49","v":9341427288},null,{"$f":"+F24+F35+F49","v":439531583788},{"$f":"+G24+G35+G49","v":86036379533},{"$f":"+H24+H35+H49","v":8864575622},{"$f":"+I24+I35+I49","v":271305578},null,{"$f":"+K24+K35+K49","v":94629649577},{"$f":"+L24+L35+L49","v":344901934211},{"$f":"+M24+M35+M49","v":349540560532}]

{"sheet":"Nota 10","index":15,"n_rows":69,"n_cols":3,"rows_kept":69,"cut":false,"hidden":false,"merged":[[2,16126,2,16131],[2,16132,2,16137],[2,16138,2,16143],[2,16144,2,16149],[2,16150,2,16155],[2,16156,2,16161],[2,16090,2,16095],[2,16096,2,16101],[2,16102,2,16107],[2,16108,2,16113],[2,16114,2,16119],[2,16120,2,16125],[2,16378,2,16381],[2,16342,2,16347],[2,16348,2,16353],[2,16354,2,16359],[2,16360,2,16365],[2,16366,2,16371],[2,16372,2,16377],[2,16306,2,16311],[2,16312,2,16317],[2,16318,2,16323],[2,16324,2,16329],[2,16330,2,16335],[2,16336,2,16341],[2,16270,2,16275],[2,16276,2,16281],[2,16282,2,16287],[2,16288,2,16293],[2,16294,2,16299],[2,16300,2,16305],[2,16234,2,16239],[2,16240,2,16245],[2,16246,2,16251],[2,16252,2,16257],[2,16258,2,16263],[2,16264,2,16269],[2,16198,2,16203],[2,16204,2,16209],[2,16210,2,16215],[2,16216,2,16221],[2,16222,2,16227],[2,16228,2,16233],[2,16162,2,16167],[2,16168,2,16173],[2,16174,2,16179],[2,16180,2,16185],[2,16186,2,16191],[2,16192,2,16197],[2,16054,2,16059],[2,16060,2,16065],[2,16066,2,16071],[2,16072,2,16077],[2,16078,2,16083],[2,16084,2,16089],[2,16018,2,16023],[2,16024,2,16029],[2,16030,2,16035],[2,16036,2,16041],[2,16042,2,16047],[2,16048,2,16053],[2,15982,2,15987],[2,15988,2,15993],[2,15994,2,15999],[2,16000,2,16005],[2,16006,2,16011],[2,16012,2,16017],[2,15946,2,15951],[2,15952,2,15957],[2,15958,2,15963],[2,15964,2,15969],[2,15970,2,15975],[2,15976,2,15981],[2,15910,2,15915],[2,15916,2,15921],[2,15922,2,15927],[2,15928,2,15933],[2,15934,2,15939],[2,15940,2,15945],[2,15874,2,15879],[2,15880,2,15885],[2,15886,2,15891],[2,15892,2,15897],[2,15898,2,15903],[2,15904,2,15909],[2,15838,2,15843],[2,15844,2,15849],[2,15850,2,15855],[2,15856,2,15861],[2,15862,2,15867],[2,15868,2,15873],[2,15802,2,15807],[2,15808,2,15813],[2,15814,2,15819],[2,15820,2,15825],[2,15826,2,15831],[2,15832,2,15837],[2,15766,2,15771],[2,15772,2,15777],[2,15778,2,15783],[2,15784,2,15789],[2,15790,2,15795],[2,15796,2,15801],[2,15730,2,15735],[2,15736,2,15741],[2,15742,2,15747],[2,15748,2,15753],[2,15754,2,15759],[2,15760,2,15765],[2,15694,2,15699],[2,15700,2,15705],[2,15706,2,15711],[2,15712,2,15717],[2,15718,2,15723],[2,15724,2,15729],[2,15658,2,15663],[2,15664,2,15669],[2,15670,2,15675],[2,15676,2,15681],[2,15682,2,15687],[2,15688,2,15693],[2,15622,2,15627],[2,15628,2,15633],[2,15634,2,15639],[2,15640,2,15645],[2,15646,2,15651],[2,15652,2,15657],[2,15586,2,15591],[2,15592,2,15597],[2,15598,2,15603],[2,15604,2,15609],[2,15610,2,15615],[2,15616,2,15621],[2,15550,2,15555],[2,15556,2,15561],[2,15562,2,15567],[2,15568,2,15573],[2,15574,2,15579],[2,15580,2,15585],[2,15514,2,15519],[2,15520,2,15525],[2,15526,2,15531],[2,15532,2,15537],[2,15538,2,15543],[2,15544,2,15549],[2,15478,2,15483],[2,15484,2,15489],[2,15490,2,15495],[2,15496,2,15501],[2,15502,2,15507],[2,15508,2,15513],[2,15442,2,15447],[2,15448,2,15453],[2,15454,2,15459],[2,15460,2,15465],[2,15466,2,15471],[2,15472,2,15477],[2,15406,2,15411],[2,15412,2,15417],[2,15418,2,15423],[2,15424,2,15429],[2,15430,2,15435],[2,15436,2,15441],[2,15370,2,15375],[2,15376,2,15381],[2,15382,2,15387],[2,15388,2,15393],[2,15394,2,15399],[2,15400,2,15405],[2,15334,2,15339],[2,15340,2,15345],[2,15346,2,15351],[2,15352,2,15357],[2,15358,2,15363],[2,15364,2,15369],[2,15298,2,15303],[2,15304,2,15309],[2,15310,2,15315],[2,15316,2,15321],[2,15322,2,15327],[2,15328,2,15333],[2,15262,2,15267],[2,15268,2,15273],[2,15274,2,15279],[2,15280,2,15285],[2,15286,2,15291],[2,15292,2,15297],[2,15226,2,15231],[2,15232,2,15237],[2,15238,2,15243],[2,15244,2,15249],[2,15250,2,15255],[2,15256,2,15261],[2,15190,2,15195],[2,15196,2,15201],[2,15202,2,15207],[2,15208,2,15213],[2,15214,2,15219],[2,15220,2,15225],[2,15154,2,15159],[2,15160,2,15165],[2,15166,2,15171],[2,15172,2,15177],[2,15178,2,15183],[2,15184,2,15189],[2,15118,2,15123],[2,15124,2,15129],[2,15130,2,15135],[2,15136,2,15141],[2,15142,2,15147],[2,15148,2,15153],[2,15082,2,15087],[2,15088,2,15093],[2,15094,2,15099],[2,15100,2,15105],[2,15106,2,15111],[2,15112,2,15117],[2,15046,2,15051],[2,15052,2,15057],[2,15058,2,15063],[2,15064,2,15069],[2,15070,2,15075],[2,15076,2,15081],[2,15010,2,15015],[2,15016,2,15021],[2,15022,2,15027],[2,15028,2,15033],[2,15034,2,15039],[2,15040,2,15045],[2,14974,2,14979],[2,14980,2,14985],[2,14986,2,14991],[2,14992,2,14997],[2,14998,2,15003],[2,15004,2,15009],[2,14938,2,14943],[2,14944,2,14949],[2,14950,2,14955],[2,14956,2,14961],[2,14962,2,14967],[2,14968,2,14973],[2,14902,2,14907],[2,14908,2,14913],[2,14914,2,14919],[2,14920,2,14925],[2,14926,2,14931],[2,14932,2,14937],[2,14866,2,14871],[2,14872,2,14877],[2,14878,2,14883],[2,14884,2,14889],[2,14890,2,14895],[2,14896,2,14901],[2,14830,2,14835],[2,14836,2,14841],[2,14842,2,14847],[2,14848,2,14853],[2,14854,2,14859],[2,14860,2,14865],[2,14794,2,14799],[2,14800,2,14805],[2,14806,2,14811],[2,14812,2,14817],[2,14818,2,14823],[2,14824,2,14829],[2,14758,2,14763],[2,14764,2,14769],[2,14770,2,14775],[2,14776,2,14781],[2,14782,2,14787],[2,14788,2,14793],[2,14722,2,14727],[2,14728,2,14733],[2,14734,2,14739],[2,14740,2,14745],[2,14746,2,14751],[2,14752,2,14757],[2,14686,2,14691],[2,14692,2,14697],[2,14698,2,14703],[2,14704,2,14709],[2,14710,2,14715],[2,14716,2,14721],[2,14650,2,14655],[2,14656,2,14661],[2,14662,2,14667],[2,14668,2,14673],[2,14674,2,14679],[2,14680,2,14685],[2,14614,2,14619],[2,14620,2,14625],[2,14626,2,14631],[2,14632,2,14637],[2,14638,2,14643],[2,14644,2,14649],[2,14578,2,14583],[2,14584,2,14589],[2,14590,2,14595],[2,14596,2,14601],[2,14602,2,14607],[2,14608,2,14613],[2,14542,2,14547],[2,14548,2,14553],[2,14554,2,14559],[2,14560,2,14565],[2,14566,2,14571],[2,14572,2,14577],[2,14506,2,14511],[2,14512,2,14517],[2,14518,2,14523],[2,14524,2,14529],[2,14530,2,14535],[2,14536,2,14541],[2,14470,2,14475],[2,14476,2,14481],[2,14482,2,14487],[2,14488,2,14493],[2,14494,2,14499],[2,14500,2,14505],[2,14434,2,14439],[2,14440,2,14445],[2,14446,2,14451],[2,14452,2,14457],[2,14458,2,14463],[2,14464,2,14469],[2,14398,2,14403],[2,14404,2,14409],[2,14410,2,14415],[2,14416,2,14421],[2,14422,2,14427],[2,14428,2,14433],[2,14362,2,14367],[2,14368,2,14373],[2,14374,2,14379],[2,14380,2,14385],[2,14386,2,14391],[2,14392,2,14397],[2,14326,2,14331],[2,14332,2,14337],[2,14338,2,14343],[2,14344,2,14349],[2,14350,2,14355],[2,14356,2,14361],[2,14290,2,14295],[2,14296,2,14301],[2,14302,2,14307],[2,14308,2,14313],[2,14314,2,14319],[2,14320,2,14325],[2,14254,2,14259],[2,14260,2,14265],[2,14266,2,14271],[2,14272,2,14277],[2,14278,2,14283],[2,14284,2,14289],[2,14218,2,14223],[2,14224,2,14229],[2,14230,2,14235],[2,14236,2,14241],[2,14242,2,14247],[2,14248,2,14253],[2,14182,2,14187],[2,14188,2,14193],[2,14194,2,14199],[2,14200,2,14205],[2,14206,2,14211],[2,14212,2,14217],[2,14146,2,14151],[2,14152,2,14157],[2,14158,2,14163],[2,14164,2,14169],[2,14170,2,14175],[2,14176,2,14181],[2,14110,2,14115],[2,14116,2,14121],[2,14122,2,14127],[2,14128,2,14133],[2,14134,2,14139],[2,14140,2,14145],[2,14074,2,14079],[2,14080,2,14085],[2,14086,2,14091],[2,14092,2,14097],[2,14098,2,14103],[2,14104,2,14109],[2,14038,2,14043],[2,14044,2,14049],[2,14050,2,14055],[2,14056,2,14061],[2,14062,2,14067],[2,14068,2,14073],[2,14002,2,14007],[2,14008,2,14013],[2,14014,2,14019],[2,14020,2,14025],[2,14026,2,14031],[2,14032,2,14037],[2,13966,2,13971],[2,13972,2,13977],[2,13978,2,13983],[2,13984,2,13989],[2,13990,2,13995],[2,13996,2,14001],[2,13930,2,13935],[2,13936,2,13941],[2,13942,2,13947],[2,13948,2,13953],[2,13954,2,13959],[2,13960,2,13965],[2,13894,2,13899],[2,13900,2,13905],[2,13906,2,13911],[2,13912,2,13917],[2,13918,2,13923],[2,13924,2,13929],[2,13858,2,13863],[2,13864,2,13869],[2,13870,2,13875],[2,13876,2,13881],[2,13882,2,13887],[2,13888,2,13893],[2,13822,2,13827],[2,13828,2,13833],[2,13834,2,13839],[2,13840,2,13845],[2,13846,2,13851],[2,13852,2,13857],[2,13786,2,13791],[2,13792,2,13797],[2,13798,2,13803],[2,13804,2,13809],[2,13810,2,13815],[2,13816,2,13821],[2,13750,2,13755],[2,13756,2,13761],[2,13762,2,13767],[2,13768,2,13773],[2,13774,2,13779],[2,13780,2,13785],[2,13714,2,13719],[2,13720,2,13725],[2,13726,2,13731],[2,13732,2,13737],[2,13738,2,13743],[2,13744,2,13749],[2,13678,2,13683],[2,13684,2,13689],[2,13690,2,13695],[2,13696,2,13701],[2,13702,2,13707],[2,13708,2,13713],[2,13642,2,13647],[2,13648,2,13653],[2,13654,2,13659],[2,13660,2,13665],[2,13666,2,13671],[2,13672,2,13677],[2,13606,2,13611],[2,13612,2,13617],[2,13618,2,13623],[2,13624,2,13629],[2,13630,2,13635],[2,13636,2,13641],[2,13570,2,13575],[2,13576,2,13581],[2,13582,2,13587],[2,13588,2,13593],[2,13594,2,13599],[2,13600,2,13605],[2,13534,2,13539],[2,13540,2,13545],[2,13546,2,13551],[2,13552,2,13557],[2,13558,2,13563],[2,13564,2,13569],[2,13498,2,13503],[2,13504,2,13509],[2,13510,2,13515],[2,13516,2,13521],[2,13522,2,13527],[2,13528,2,13533],[2,13462,2,13467],[2,13468,2,13473],[2,13474,2,13479],[2,13480,2,13485],[2,13486,2,13491],[2,13492,2,13497],[2,13426,2,13431],[2,13432,2,13437],[2,13438,2,13443],[2,13444,2,13449],[2,13450,2,13455],[2,13456,2,13461],[2,13390,2,13395],[2,13396,2,13401],[2,13402,2,13407],[2,13408,2,13413],[2,13414,2,13419],[2,13420,2,13425],[2,13354,2,13359],[2,13360,2,13365],[2,13366,2,13371],[2,13372,2,13377],[2,13378,2,13383],[2,13384,2,13389],[2,13318,2,13323],[2,13324,2,13329],[2,13330,2,13335],[2,13336,2,13341],[2,13342,2,13347],[2,13348,2,13353],[2,13282,2,13287],[2,13288,2,13293],[2,13294,2,13299],[2,13300,2,13305],[2,13306,2,13311],[2,13312,2,13317],[2,13246,2,13251],[2,13252,2,13257],[2,13258,2,13263],[2,13264,2,13269],[2,13270,2,13275],[2,13276,2,13281],[2,13210,2,13215],[2,13216,2,13221],[2,13222,2,13227],[2,13228,2,13233],[2,13234,2,13239],[2,13240,2,13245],[2,13174,2,13179],[2,13180,2,13185],[2,13186,2,13191],[2,13192,2,13197],[2,13198,2,13203],[2,13204,2,13209],[2,13138,2,13143],[2,13144,2,13149],[2,13150,2,13155],[2,13156,2,13161],[2,13162,2,13167],[2,13168,2,13173],[2,13102,2,13107],[2,13108,2,13113],[2,13114,2,13119],[2,13120,2,13125],[2,13126,2,13131],[2,13132,2,13137],[2,13066,2,13071],[2,13072,2,13077],[2,13078,2,13083],[2,13084,2,13089],[2,13090,2,13095],[2,13096,2,13101],[2,13030,2,13035],[2,13036,2,13041],[2,13042,2,13047],[2,13048,2,13053],[2,13054,2,13059],[2,13060,2,13065],[2,12994,2,12999],[2,13000,2,13005],[2,13006,2,13011],[2,13012,2,13017],[2,13018,2,13023],[2,13024,2,13029],[2,12958,2,12963],[2,12964,2,12969],[2,12970,2,12975],[2,12976,2,12981],[2,12982,2,12987],[2,12988,2,12993],[2,12922,2,12927],[2,12928,2,12933],[2,12934,2,12939],[2,12940,2,12945],[2,12946,2,12951],[2,12952,2,12957],[2,12886,2,12891],[2,12892,2,12897],[2,12898,2,12903],[2,12904,2,12909],[2,12910,2,12915],[2,12916,2,12921],[2,12850,2,12855],[2,12856,2,12861],[2,12862,2,12867],[2,12868,2,12873],[2,12874,2,12879],[2,12880,2,12885],[2,12814,2,12819],[2,12820,2,12825],[2,12826,2,12831],[2,12832,2,12837],[2,12838,2,12843],[2,12844,2,12849],[2,12778,2,12783],[2,12784,2,12789],[2,12790,2,12795],[2,12796,2,12801],[2,12802,2,12807],[2,12808,2,12813],[2,12742,2,12747],[2,12748,2,12753],[2,12754,2,12759],[2,12760,2,12765],[2,12766,2,12771],[2,12772,2,12777],[2,12706,2,12711],[2,12712,2,12717],[2,12718,2,12723],[2,12724,2,12729],[2,12730,2,12735],[2,12736,2,12741],[2,12670,2,12675],[2,12676,2,12681],[2,12682,2,12687],[2,12688,2,12693],[2,12694,2,12699],[2,12700,2,12705],[2,12634,2,12639],[2,12640,2,12645],[2,12646,2,12651],[2,12652,2,12657],[2,12658,2,12663],[2,12664,2,12669],[2,12598,2,12603],[2,12604,2,12609],[2,12610,2,12615],[2,12616,2,12621],[2,12622,2,12627],[2,12628,2,12633],[2,12562,2,12567],[2,12568,2,12573],[2,12574,2,12579],[2,12580,2,12585],[2,12586,2,12591],[2,12592,2,12597],[2,12526,2,12531],[2,12532,2,12537],[2,12538,2,12543],[2,12544,2,12549],[2,12550,2,12555],[2,12556,2,12561],[2,12490,2,12495],[2,12496,2,12501],[2,12502,2,12507],[2,12508,2,12513],[2,12514,2,12519],[2,12520,2,12525],[2,12454,2,12459],[2,12460,2,12465],[2,12466,2,12471],[2,12472,2,12477],[2,12478,2,12483],[2,12484,2,12489],[2,12418,2,12423],[2,12424,2,12429],[2,12430,2,12435],[2,12436,2,12441],[2,12442,2,12447],[2,12448,2,12453],[2,12382,2,12387],[2,12388,2,12393],[2,12394,2,12399],[2,12400,2,12405],[2,12406,2,12411],[2,12412,2,12417],[2,12346,2,12351],[2,12352,2,12357],[2,12358,2,12363],[2,12364,2,12369],[2,12370,2,12375],[2,12376,2,12381],[2,12310,2,12315],[2,12316,2,12321],[2,12322,2,12327],[2,12328,2,12333],[2,12334,2,12339],[2,12340,2,12345],[2,12274,2,12279],[2,12280,2,12285],[2,12286,2,12291],[2,12292,2,12297],[2,12298,2,12303],[2,12304,2,12309],[2,12238,2,12243],[2,12244,2,12249],[2,12250,2,12255],[2,12256,2,12261],[2,12262,2,12267],[2,12268,2,12273],[2,12202,2,12207],[2,12208,2,12213],[2,12214,2,12219],[2,12220,2,12225],[2,12226,2,12231],[2,12232,2,12237],[2,12166,2,12171],[2,12172,2,12177],[2,12178,2,12183],[2,12184,2,12189],[2,12190,2,12195],[2,12196,2,12201],[2,12130,2,12135],[2,12136,2,12141],[2,12142,2,12147],[2,12148,2,12153],[2,12154,2,12159],[2,12160,2,12165],[2,12094,2,12099],[2,12100,2,12105],[2,12106,2,12111],[2,12112,2,12117],[2,12118,2,12123],[2,12124,2,12129],[2,12058,2,12063],[2,12064,2,12069],[2,12070,2,12075],[2,12076,2,12081],[2,12082,2,12087],[2,12088,2,12093],[2,12022,2,12027],[2,12028,2,12033],[2,12034,2,12039],[2,12040,2,12045],[2,12046,2,12051],[2,12052,2,12057],[2,11986,2,11991],[2,11992,2,11997],[2,11998,2,12003],[2,12004,2,12009],[2,12010,2,12015],[2,12016,2,12021],[2,11950,2,11955],[2,11956,2,11961],[2,11962,2,11967],[2,11968,2,11973],[2,11974,2,11979],[2,11980,2,11985],[2,11914,2,11919],[2,11920,2,11925],[2,11926,2,11931],[2,11932,2,11937],[2,11938,2,11943],[2,11944,2,11949],[2,11878,2,11883],[2,11884,2,11889],[2,11890,2,11895],[2,11896,2,11901],[2,11902,2,11907],[2,11908,2,11913],[2,11842,2,11847],[2,11848,2,11853],[2,11854,2,11859],[2,11860,2,11865],[2,11866,2,11871],[2,11872,2,11877],[2,11806,2,11811],[2,11812,2,11817],[2,11818,2,11823],[2,11824,2,11829],[2,11830,2,11835],[2,11836,2,11841],[2,11770,2,11775],[2,11776,2,11781],[2,11782,2,11787],[2,11788,2,11793],[2,11794,2,11799],[2,11800,2,11805],[2,11734,2,11739],[2,11740,2,11745],[2,11746,2,11751],[2,11752,2,11757],[2,11758,2,11763],[2,11764,2,11769],[2,11698,2,11703],[2,11704,2,11709],[2,11710,2,11715],[2,11716,2,11721],[2,11722,2,11727],[2,11728,2,11733],[2,11662,2,11667],[2,11668,2,11673],[2,11674,2,11679],[2,11680,2,11685],[2,11686,2,11691],[2,11692,2,11697],[2,11626,2,11631],[2,11632,2,11637],[2,11638,2,11643],[2,11644,2,11649],[2,11650,2,11655],[2,11656,2,11661],[2,11590,2,11595],[2,11596,2,11601],[2,11602,2,11607],[2,11608,2,11613],[2,11614,2,11619],[2,11620,2,11625],[2,11554,2,11559],[2,11560,2,11565],[2,11566,2,11571],[2,11572,2,11577],[2,11578,2,11583],[2,11584,2,11589],[2,11518,2,11523],[2,11524,2,11529],[2,11530,2,11535],[2,11536,2,11541],[2,11542,2,11547],[2,11548,2,11553],[2,11482,2,11487],[2,11488,2,11493],[2,11494,2,11499],[2,11500,2,11505],[2,11506,2,11511],[2,11512,2,11517],[2,11446,2,11451],[2,11452,2,11457],[2,11458,2,11463],[2,11464,2,11469],[2,11470,2,11475],[2,11476,2,11481],[2,11410,2,11415],[2,11416,2,11421],[2,11422,2,11427],[2,11428,2,11433],[2,11434,2,11439],[2,11440,2,11445],[2,11374,2,11379],[2,11380,2,11385],[2,11386,2,11391],[2,11392,2,11397],[2,11398,2,11403],[2,11404,2,11409],[2,11338,2,11343],[2,11344,2,11349],[2,11350,2,11355],[2,11356,2,11361],[2,11362,2,11367],[2,11368,2,11373],[2,11302,2,11307],[2,11308,2,11313],[2,11314,2,11319],[2,11320,2,11325],[2,11326,2,11331],[2,11332,2,11337],[2,11266,2,11271],[2,11272,2,11277],[2,11278,2,11283],[2,11284,2,11289],[2,11290,2,11295],[2,11296,2,11301],[2,11230,2,11235],[2,11236,2,11241],[2,11242,2,11247],[2,11248,2,11253],[2,11254,2,11259],[2,11260,2,11265],[2,11194,2,11199],[2,11200,2,11205],[2,11206,2,11211],[2,11212,2,11217],[2,11218,2,11223],[2,11224,2,11229],[2,11158,2,11163],[2,11164,2,11169],[2,11170,2,11175],[2,11176,2,11181],[2,11182,2,11187],[2,11188,2,11193],[2,11122,2,11127],[2,11128,2,11133],[2,11134,2,11139],[2,11140,2,11145],[2,11146,2,11151],[2,11152,2,11157],[2,11086,2,11091],[2,11092,2,11097],[2,11098,2,11103],[2,11104,2,11109],[2,11110,2,11115],[2,11116,2,11121],[2,11050,2,11055],[2,11056,2,11061],[2,11062,2,11067],[2,11068,2,11073],[2,11074,2,11079],[2,11080,2,11085],[2,11014,2,11019],[2,11020,2,11025],[2,11026,2,11031],[2,11032,2,11037],[2,11038,2,11043],[2,11044,2,11049],[2,10978,2,10983],[2,10984,2,10989],[2,10990,2,10995],[2,10996,2,11001],[2,11002,2,11007],[2,11008,2,11013],[2,10942,2,10947],[2,10948,2,10953],[2,10954,2,10959],[2,10960,2,10965],[2,10966,2,10971],[2,10972,2,10977],[2,10906,2,10911],[2,10912,2,10917],[2,10918,2,10923],[2,10924,2,10929],[2,10930,2,10935],[2,10936,2,10941],[2,10870,2,10875],[2,10876,2,10881],[2,10882,2,10887],[2,10888,2,10893],[2,10894,2,10899],[2,10900,2,10905],[2,10834,2,10839],[2,10840,2,10845],[2,10846,2,10851],[2,10852,2,10857],[2,10858,2,10863],[2,10864,2,10869],[2,10798,2,10803],[2,10804,2,10809],[2,10810,2,10815],[2,10816,2,10821],[2,10822,2,10827],[2,10828,2,10833],[2,10762,2,10767],[2,10768,2,10773],[2,10774,2,10779],[2,10780,2,10785],[2,10786,2,10791],[2,10792,2,10797],[2,10726,2,10731],[2,10732,2,10737],[2,10738,2,10743],[2,10744,2,10749],[2,10750,2,10755],[2,10756,2,10761],[2,10690,2,10695],[2,10696,2,10701],[2,10702,2,10707],[2,10708,2,10713],[2,10714,2,10719],[2,10720,2,10725],[2,10654,2,10659],[2,10660,2,10665],[2,10666,2,10671],[2,10672,2,10677],[2,10678,2,10683],[2,10684,2,10689],[2,10618,2,10623],[2,10624,2,10629],[2,10630,2,10635],[2,10636,2,10641],[2,10642,2,10647],[2,10648,2,10653],[2,10582,2,10587],[2,10588,2,10593],[2,10594,2,10599],[2,10600,2,10605],[2,10606,2,10611],[2,10612,2,10617],[2,10546,2,10551],[2,10552,2,10557],[2,10558,2,10563],[2,10564,2,10569],[2,10570,2,10575],[2,10576,2,10581],[2,10510,2,10515],[2,10516,2,10521],[2,10522,2,10527],[2,10528,2,10533],[2,10534,2,10539],[2,10540,2,10545],[2,10474,2,10479],[2,10480,2,10485],[2,10486,2,10491],[2,10492,2,10497],[2,10498,2,10503],[2,10504,2,10509],[2,10438,2,10443],[2,10444,2,10449],[2,10450,2,10455],[2,10456,2,10461],[2,10462,2,10467],[2,10468,2,10473],[2,10402,2,10407],[2,10408,2,10413],[2,10414,2,10419],[2,10420,2,10425],[2,10426,2,10431],[2,10432,2,10437],[2,10366,2,10371],[2,10372,2,10377],[2,10378,2,10383]],"merged_total":2730,"flags":["merged_cut"]}
[{"$f":"+Indice!C1","v":"NICOLAS GONZALEZ ODDONE S.A.E.C.A"},"BG"]
[]
["NOTA 10 – ACTIVOS DISPONIBLES PARA LA VENTA"]
["En miles de guaraníes"]
[null,"2021-03-31","2020-12-31"]
["Propiedad, planta y equipo"]
["(Detallar bienes de uso)"]
["Total",0,0]
[]
["Activos intangibles"]
["(Detallar activos intangibles)"]
["Total",0,0]
[]
["Inversiones"]
["Inmuebles - Edificios y terrenos ","2021-09-30","2020-12-31"]
["1 INM. COLONIA INDEP. 360 M2 PADRON 18219,1 INM. COL.IND. 361 PADRON 18220, 3 INM ENCARN. 508 M2 CCC23-1685-09 , 4 INM. COLONIA TACUARI, 1082 M2 PADRON 11512",15377402.749983527,15377402.749983527]
["CCCAT. 11-0076-19 CABALLERO Y AZARA ",0,{"$f":"577201193+6988390+3152068","v":587341651}]
["CTA CTE 17225-06 LOTE 14 MANZANA G HORQUETA RUTA V KM40",69041421.80843164,69041421.80843164]
["CTA CTE 17-228-03 LOTE 2 MANZANA I HORQUETA RUTA V",63287970.38037923,63287970.38037923]
["CTA CTE CAT 30-0023-21 VILLAHAYES MAT P01/5 187",274583346.16981202,{"$f":"271659400+2923946","v":274583346}]
["CTA. CTE. CAT Nº 17-0423-03 DISTRITO DE CONCEPCION",111608903.909339,111608903.909339]
["CTA. CTE. CAT nº 18/1705 PADRON 2016- CAPIIBARY",60075415.822098978,60075415.822098978]
["CTA. CTE. CAT. Nº 27-1538-03 LUQUE LOTE 5",{"$f":"598643522+705966875","v":1304610397},{"$f":"598643522+705966875","v":1304610397}]
["CTA. CTE. CAT. Nº 27-5132-03/04/05 DTO. CAPIATA",105688017.98246279,105688017.98246279]
["CTA. CTE. Nº 12-0323-08 SUP 1116,5 M2FINCA 11-252 ESPAÑA 663 DTO.SAN ROQUE",{"$f":"3369682163+2409465633","v":5779147796},{"$f":"3369682163+2409465633","v":5779147796}]
["CTA. CTE. Nº 12-0578-05 ARTIGAS (EX ALARCON)",1027199682.5571936,1027199682.5571936]
["CTA.CTE. CAT. Nº 12-0578-04 LOTE 19 Y 20- ARTIGAS",1585648257,{"$f":"260057118+1325591139","v":1585648257}]
["CTA.CTE. CAT. Nº 15-1359-07-00-01 - ARBOLEDA",0,147438344.02875501]
["CTA.CTE. CAT. Nº 19-0063-08 FINCA Nº 271- CAACUPE",{"$f":"752438845+1632383635","v":2384822480},{"$f":"752438845+1632383635","v":2384822480}]
["CTA.CTE.CAT. 11-0058-12 CABALLERO Y A.",{"$f":"137925115+886639840","v":1024564955},{"$f":"137925115+886639840","v":1024564955}]
["CTA.CTE.CAT. 11-0058-13 CABALLERO Y AZARA",{"$f":"125290755+805424132","v":930714887},{"$f":"125290755+805424132","v":930714887}]
["CTA.CTE.CAT. 11-0058-14 CABALLERO Y A.",{"$f":"234891612+1468708737","v":1703600349},{"$f":"234891612+1468708737","v":1703600349}]
["CTA.CTE.CAT. 11-0058-15 CABALLERO Y A.",{"$f":"35224244+685284614","v":720508858},{"$f":"35224244+685284614","v":720508858}]
["CTA.CTE.CAT. 11-0058-16 CABALLERO Y A.",{"$f":"166708121+1042377113","v":1209085234},{"$f":"166708121+1042377113","v":1209085234}]
["CTA.CTE.CAT. 11-0076-20 CABALLERO Y MD",{"$f":"478693068+994931729","v":1473624797},{"$f":"478693068+994931729","v":1473624797}]
["CTA.CTE.CAT. 13-0620-09/10/11 PIZARRO",{"$f":"169092282+647372954","v":816465236},{"$f":"169092282+647372954","v":816465236}]
["CTA.CTE.CAT. 15-0885-01 JULIO C.",{"$f":"452753345+404941204","v":857694549},{"$f":"452753345+404941204","v":857694549}]
["CTA.CTE.CAT. 15-0885-18",404941204.2168771,404941204.2168771]
["CTA.CTE.CAT. 27-0081-11",2883271535.6771421,2883271535.6771421]
["CTA.CTE.CAT. 27-0552-16 ITAUGUA",4565216.2876381725,4565216]
["CTA.CTE.CAT. 27-1077-13/14 - AREGUA",8410059.3150466979,8410059.3150466979]
["CTA.CTE.CAT. 27-1734-01 GALERIA SL",{"$f":"4136759404+2260092578+1537866771+2988683572","v":10923402325},{"$f":"4136759404+2260092578","v":6396851982}]
["CTA.CTE.CAT. Nº 15-1359-07-00-01 - ARBOLEDA",0,378515111]
["CTA.CTE.CAT.26-2259-03-04-05 C.ESTE.",39914730.340699032,39914730.340699032]
["ASFALTADO 17-0081-11",29641834.654051524,29641834.654051524]
["CURUGUATY PADRON Nº 1763",101215081.27397078,101215081.27397078]
["DEP. NRO A101 BLOQUE A 1ER PISO Y 2 COLCH. 20 Y 21 COCH ADIC 5 BALKONIA",{"$f":"1211654638+19524206","v":1231178844},1211654638]
["FINCA Nº7 DIST.STA.ROSA DEL AGUARAY, PADRON 13 LOTE1 MANZ34 GUSTAVO DIAZ ",{"$f":"170958982.99+191996659+1184414412","v":1547370053.99},{"$f":"170958982.99+191996662","v":362955644.99000001}]
["DISTRITO ABAI, FINCA 2207, PADRON 3198 SUPERF. 9999m2 ",603590668,603590668]
["INMUEBLE FINCA 7745 DEPART. CAAZAPA,FRACCION LOMA CLAVEL 1000MTRS.",125000000,125000000]
["FINCA 903 SUP. 588 M2 LOTE 7 MANZANA 11 YBY YAU",28767259.476163421,28767259.476163421]
["FINCA N° 21-289 - CAAGUAZU PADRON 17946",185685128.40487385,185685128.40487385]
["FINCA Nº 29584, PADRON Nº 26964, CAPIATA",8922678.8247905821,8922678.8247905821]
["FRACCION SOL NACIENTE LOTE Nº9 MANZANA 06 CTA CTE. 27-0129-18",{"$f":"502727273+133636364+15461233","v":651824870},651824870]
["INMUEBLE CON FINCA 24282 CDE",144329029.09405553,144329029.09405553]
["INMUEBLES CON MAT.K01/32285 HERNANDARIAS",329004765.90225798,{"$f":"322759697+6245069","v":329004766}]
["LOTE 1 PADRON 12192 FINCA 1173 MAT 19371 CAACUPE",305214086.99434561,305214086.99434561]
["PADRON 2882-FINCA 3403 EUSEBIO AYALA",26683208.587641317,26683208.587641317]
["PADRON 3182-FINCA 3330 E.AYALA",50481747.133070603,50481747.133070603]
["PADRON 6324 BO TELLEZ CUE CNEL BOGADO ITAPUA",48433169.020790301,48433169.020790301]
["PADRON Nº 1266 / FINCA Nº 1147 - AYOLAS",167947.48284493003,167947.48284493003]
["DISTRITO DE ITAUGUA SUPERFICIE de 900 m2., FINCA Nº 15.972, PADRON Nº 15.461 ",31483792.106998,31483792.106998]
["CCC27-0190-27 FINCA 10886 SAN LORENZO",151171716.23544815,151171716.23544815]
["CCC 26-0971-20, distrito CDE, 736m2 AVDA. BERNARDINO CABALLERO ",{"$f":"2499623407+1484255029-679675+118245454+73733969","v":4175178184},3983198761]
["DISTRI.SAN LORENZO LOTE 7 CCC27-4056-11 367m2 ",10000000,10000000]
["CTA CTE CAT 19-2650-08 427,68m2 CAACUPE",{"$f":"16873259+3354605","v":20227864},20227862]
["YPANE MAT 4428 27-1860-13",1700000,1700000]
["CONSTRUCCIONES EN CURSO",2079992539,4656791365]
["Total general",{"$f":"SUM(B16:B68)","v":47669119495.398407},{"$f":"SUM(C16:C68)","v":45436745044.067459}]

{"sheet":"cred","index":16,"n_rows":14,"n_cols":3,"rows_kept":14,"cut":false,"hidden":true,"merged":[[3,0,3,2],[4,0,4,1]]}
[{"$f":"Indice!C1","v":"NICOLAS GONZALEZ ODDONE S.A.E.C.A"},null,"BG"]
[]
[]
["NOTA 10 - CREDITOS POR VENTAS "]
["En miles de guaranies"]
[]
[]
[]
[]
["Cuentas ","2020-03-31","2019-12-31"]
["Casa de Bolsa Puente ME",13354381956,10266827892]
["CDA Bancop",30921600000,31459200000]
["Puente - Fondos Mutuos ME",0,3560595316]
["Total",{"$f":"SUM($B$11:B13)","v":44275981956},{"$f":"SUM($C$11:C13)","v":45286623208}]

{"sheet":"Nota 11","index":17,"n_rows":31,"n_cols":3,"rows_kept":31,"cut":false,"hidden":false,"merged":[[2,0,2,3]]}
[{"$f":"Indice!C1","v":"NICOLAS GONZALEZ ODDONE S.A.E.C.A"},"BG"]
[]
["NOTA 11 – ACTIVOS INTANGIBLES"]
["En miles de guaranies"]
[]
["Las cuentas Activos intengibles se componen como sigue:"]
[]
["Cuentas ","2021-09-30","2020-12-31"]
["Actividad Comercial"]
["Marcas ",{"$f":"54104002-54104002","v":0},0]
["Gastos de Organización",{"$f":"43068550-43068550","v":0},0]
["Gastos de Organización",43068550,43068550]
["Amortización acum. Gastos de Organiz.",-43068550,-43068550]
["Licencias de Informática",7830482635,6517454738]
["Amortización acum. Licenc. de Informática",-3502608591,-2468109719]
["Programas de Informática",4287120189,3748352451]
["Amortización acum. Programas de Inform.",-2910277704,-2435701164]
["Licencias para Teléfonos ",351811895,345380986]
["Amortización acum. Lic. para teléfonos ",-294503988,-254709369]
["Programas de Informática en Línea S.A",342316500,342316500]
["Amortización acum. Program. de inf. en línea",-342316500,-342316500]
["Total",{"$f":"SUM(B10:B21)","v":5762024436},{"$f":"SUM(C10:C21)","v":5452667923}]
[]
["Actividad Ganadera "]
["Marca NGO ",{"$f":"599465-599465","v":0},0]
["Marca NGO ",599465,599465]
["Amortización acum. Marcas y señales",-599465,-599465]
["Licencias de Informática Act. Ganadera ",14269091,14269091]
["Amortización acum. Lic. De Informática Act. Ganad.",-14269091,-13854886]
["Total",{"$f":"SUM(B25:B29)","v":0},{"$f":"SUM(C25:C29)","v":414205}]
["Total general",{"$f":"+B22+B30","v":5762024436},{"$f":"+C22+C30","v":5453082128}]

{"sheet":"Nota 12","index":18,"n_rows":11,"n_cols":3,"rows_kept":11,"cut":false,"hidden":false,"merged":[[3,1,3,2]]}
[{"$f":"Indice!C1","v":"NICOLAS GONZALEZ ODDONE S.A.E.C.A"},null,"BG"]
[]
["NOTA 12 – GOODWILL"]
["En miles de guaranies"]
["NO APLICA"]
[]
["Goodwill","2021-09-30","2020-12-31"]
[]
[]
[]
["Total general",{"$f":"SUM(B8:B10)","v":0},{"$f":"SUM(C8:C10)","v":0}]

{"sheet":"Nota 13","index":19,"n_rows":40,"n_cols":3,"rows_kept":40,"cut":false,"hidden":false,"merged":[]}
[{"$f":"Indice!C1","v":"NICOLAS GONZALEZ ODDONE S.A.E.C.A"},"BG"]
[]
["NOTA 13 – CUENTAS POR PAGAR COMERCIALES "]
["En miles de guaranies"]
[]
["Las cuentas por pagar comerciales se componen como sigue:"]
[]
["Cuentas ","2021-09-30","2020-12-31"]
["Actividad Comercial "]
["Proveedores del Exterior "]
[]
["Jose Alladio e Hijo Sa",9892775614,213041162]
["Guangdong Chigo Heating",96845104,0]
["Seb do Brasil",0,5241176608]
["Whirlpool S.A",3548605233,3241380300]
["Rational International AG",1141550641,1520073079]
["Refrimate engenharia do frio LTDA.",0,175722638]
["Whirlpool Chile LTDA.",4564464,3071737812]
["Kronen Internacional S.A",5194231680,2739868556]
["Shanghai Qi Yun Enterprise",112697503,0]
["Whirlpool Corporation",52059453,0]
["Fábrica austral de productos electricos S.A",0,5697124737]
["Middleby Worldwide Sociedad Anónima",4463101,0]
["York InternationalCorporation",1182662248,5622326]
["Vitamix corporation",27673578,0]
["Groupe Seb Chile com. LTD",1641944154,4922830581]
["Sony Uruguay Branck de Sony Latin",142774188,210682758]
["Cem S.A",295233730,297069006]
["Metalurgica Siemsen LTDA.",1623543,0]
["Color Visao do Brasil industria acrilica LTDA.",22787035,0]
["Metalúrgica Trapp S.A",0,689170521]
["Glaziar Electrical Appliances S.L",0,153508446]
["LG electronics inc.",0,1928151608]
["Total",{"$f":"SUM(B12:B33)","v":23362491269},{"$f":"SUM(C12:C33)","v":30107160138}]
[]
["Proveedores Locales "]
["Bancard S.A",18246998,17861902]
["Total ",{"$f":"SUM(B37)","v":18246998},{"$f":"SUM(C37)","v":17861902}]
[]
["Total general ",{"$f":"+B34+B38","v":23380738267},{"$f":"+C34+C38","v":30125022040}]

{"sheet":"Nota 14","index":20,"n_rows":27,"n_cols":12,"rows_kept":27,"cut":false,"hidden":false,"merged":[]}
[{"$f":"Indice!C1","v":"NICOLAS GONZALEZ ODDONE S.A.E.C.A"},"BG"]
[]
["NOTA 14 – DEUDAS BANCARIAS - PRESTAMOS A CORTO PLAZO"]
["En miles de guaranies"]
[]
["Las cuentas Deudas Bancarias se componen como sigue:"]
[]
["Préstamos de Entidades Locales "]
["Por Cartas de Crédito "]
[null,null,null,"2021-09-30",null,null,null,null,null,"2020-12-31"]
["Cuentas ","Vencimiento","Símbolo","Moneda"," ","Tipo de Garantía",null,"Vencimiento","Símbolo ","Moneda","Importe (miles de Gs)","Tipo de Garantía"]
["BBVA Banco ","S/tipo de Negociación","USD",{"$f":"IFERROR(VLOOKUP(C12,'[1]Base de Monedas'!A:B,2,0),\"\")","v":"Dólar estadounidense"},60193146877,"A sola firma ",null,"S/tipo de Negociación","USD",{"$f":"IFERROR(VLOOKUP(I12,'[1]Base de Monedas'!A:B,2,0),\"\")","v":"Dólar estadounidense"},74298686264,"A sola firma "]
["Banco Regional S.A.E.C.A ","S/tipo de Negociación","USD",{"$f":"IFERROR(VLOOKUP(C13,'[1]Base de Monedas'!A:B,2,0),\"\")","v":"Dólar estadounidense"},84949397998,"A sola Firma ",null,"S/tipo de Negociación","USD",{"$f":"IFERROR(VLOOKUP(I13,'[1]Base de Monedas'!A:B,2,0),\"\")","v":"Dólar estadounidense"},61533481518,"A sola firma "]
["Banco Basa ","S/tipo de Negociación","USD",{"$f":"IFERROR(VLOOKUP(C14,'[1]Base de Monedas'!A:B,2,0),\"\")","v":"Dólar estadounidense"},54541782542,"A sola firma ",null,"S/tipo de Negociación","USD",{"$f":"IFERROR(VLOOKUP(I14,'[1]Base de Monedas'!A:B,2,0),\"\")","v":"Dólar estadounidense"},7025523576,"A sola firma "]
["Total ",null,null,{"$f":"IFERROR(VLOOKUP(C15,'[1]Base de Monedas'!A:B,2,0),\"\")","v":""},{"$f":"SUM(E12:E14)","v":199684327417},null,null,null,null,{"$f":"IFERROR(VLOOKUP(I15,'[1]Base de Monedas'!A:B,2,0),\"\")","v":""},{"$f":"SUM(K12:K14)","v":142857691358}]
[null,null,null,{"$f":"IFERROR(VLOOKUP(C16,'[1]Base de Monedas'!A:B,2,0),\"\")","v":""},null,null,null,null,null,{"$f":"IFERROR(VLOOKUP(I16,'[1]Base de Monedas'!A:B,2,0),\"\")","v":""}]
["Por Préstamos ",null,null,{"$f":"IFERROR(VLOOKUP(C17,'[1]Base de Monedas'!A:B,2,0),\"\")","v":""},null,null,null,null,null,{"$f":"IFERROR(VLOOKUP(I17,'[1]Base de Monedas'!A:B,2,0),\"\")","v":""}]
["BBVA Banco - Préstamos","2021-11-25","PYG","Guarani",3500000000,"A sola firma ",null,"2021-11-25","PYG","Guarani",14000000000,"A sola firma "]
["Banco Regional- Préstamos ","2021-11-18","PYG","Guarani",13740000000,"A sola Firma ",null,"2021-11-18","PYG","Guarani",13740000000,"A sola firma "]
["Banco GNB- Préstamos ","2021-11-30","PYG","Guarani",53000000000,"A sola Firma ",null,"2021-11-30","PYG","Guarani",53000000000,"A sola firma "]
["Total",null,null,null,{"$f":"SUM(E18:E20)","v":70240000000},null,null,null,null,{"$f":"IFERROR(VLOOKUP(I21,'[1]Base de Monedas'!G:H,2,0),\"\")","v":""},{"$f":"SUM(K18:K20)","v":80740000000}]
[]
["Intereses préstamos entidades financieras a pagar"]
["Intereses s/ préstamos bancarios a pagar",null,"PYG","Guarani",557568492,null,null,"-","PYG","Guarani",3016479452,"-"]
["(-) Intereses s/ préstamos bancarios a Vencer ",null,"PYG","Guarani",-517430823,null,null,"-","PYG","Guarani",-2928806163,"-"]
["Total",null,null,null,{"$f":"SUM(E24:E25)","v":40137669},null,null,null,null,null,{"$f":"SUM(K24:K25)","v":87673289}]
["Total general deudas Bancarias ",null,null,{"$f":"IFERROR(VLOOKUP(C27,'[1]Base de Monedas'!A:B,2,0),\"\")","v":""},{"$f":"+E15+E21+E26","v":269964465086},null,null,null,null,null,{"$f":"+K15+K21+K26","v":223685364647}]

{"sheet":"Nota 15","index":21,"n_rows":13,"n_cols":3,"rows_kept":13,"cut":false,"hidden":false,"merged":[[4,1,4,2],[3,0,3,1]]}
[{"$f":"Indice!C1","v":"NICOLAS GONZALEZ ODDONE S.A.E.C.A"},"BG"]
[]
["NOTA 15 – PORCION CORRIENTE DE LA DEUDA A LARGO PLAZO"]
["En miles de guaranies"]
["NO APLICA"]
["Porción corriente de la deuda a largo plazo","2021-09-30","2020-12-31"]
["Cuentas por pagar comerciales"]
["Préstamos bancarios"]
["Bonos bursátiles"]
["Intereses bancarios a pagar"]
["Intereses bursatiles a pagar"]
[]
["Total general",{"$f":"SUM($B$7:B12)","v":0},{"$f":"SUM($C$7:C12)","v":0}]

{"sheet":"Nota 16","index":22,"n_rows":21,"n_cols":3,"rows_kept":21,"cut":false,"hidden":false,"merged":[[6,1,6,2],[3,0,3,1]]}
[{"$f":"Indice!C1","v":"NICOLAS GONZALEZ ODDONE S.A.E.C.A"},"BG"]
[]
["NOTA 16 – REMUNERACIONES Y CARGAS SOCIALES A PAGAR"]
["En miles de guaranies"]
[]
["Las cuentas cargas sociales se componen como sigue:"]
[]
["Cuentas ","2021-09-30","2020-12-31"]
["Actividad Comercial"]
["Seguro social I.P.S ",625767126,505754082]
["Sueldos y comisiones a Pagar ",38782378,43187778]
["Aguinaldos a Pagar",912397999,0]
["Gratificaciones/Bonificaciones  a Pagar ",0,2252238150]
["Remuneracion Directorio a pagar",0,3993000]
["Total",{"$f":"SUM($B$10:B14)","v":1576947503},{"$f":"SUM($C$10:C14)","v":2805173010}]
[]
["Actividad Ganadera "]
["Seguro Social I.P.S a pagar Act. Ganadera ",38534854,34797050]
["Sueldos y Jornales a pagar Act. Ganadera.",5500000]
["Total ",{"$f":"SUM(B18:B19)","v":44034854},{"$f":"SUM(C18)","v":34797050}]
["Total general",{"$f":"+B15+B20","v":1620982357},{"$f":"+C15+C20","v":2839970060}]

{"sheet":"Nota 17","index":23,"n_rows":15,"n_cols":3,"rows_kept":15,"cut":false,"hidden":false,"merged":[[6,1,6,2],[3,0,3,1]]}
[{"$f":"Indice!C1","v":"NICOLAS GONZALEZ ODDONE S.A.E.C.A"},"BG"]
[]
["NOTA 17 –  IMPUESTOS A PAGAR"]
["En miles de guaranies"]
[]
["Las cuentas Impuestos a pagar se componen como sigue:"]
[]
["cuentas ","2021-09-30","2020-12-31"]
["Impuesto al Valor Agregado ",1964886462,0]
["Retenciones de Impuestos ",54553755,68092124]
["Impuesto a la renta a pagar",0,2794172660]
["Retencion de Impuesto Prov.Locales ",235854641,440483321]
["Retención IRE a pagar",115200,0]
["IVA aduana a pagar ",0,0]
["Total Impuestos a pagar",{"$f":"SUM(B9:B14)","v":2255410058},{"$f":"SUM(C9:C14)","v":3302748105}]

{"sheet":"Nota 18","index":24,"n_rows":51,"n_cols":3,"rows_kept":51,"cut":false,"hidden":false,"merged":[[2,0,2,3]]}
[{"$f":"Indice!C1","v":"NICOLAS GONZALEZ ODDONE S.A.E.C.A"},"BG"]
[]
["NOTA 18 -  PROVISIONES"]
["En miles de guaranies"]
[]
["Provisiones Moneda Local "]
["Cuentas ","2021-09-30","2020-12-31"]
["Actividad Comercial"]
["Publicidad a Pagar ",4658788122,4887364071]
["Cuentas a pagar",2804049158,2081347825]
["Fletes a pagar",91590625,180090553]
["Seguros a Pagar ",165180200,474305668]
["Despachantes - Ctas. a Pagar ",195804599,41714617]
["Cheques emitidos al Cobro ",873249035,0]
["Remuneración síndico a pagar ",15634091,16378158]
["Remuner. Direct. Y Gerente a pagar",0,0]
["Honorarios Profesionales a Pagar",56316750,41409023]
["Cuentas a pagar - Tarjetas",53622143,42669834]
["Cuentas a Pagar - Vales ",178990000,198590000]
["Cuentas a Pagar Instaladores ",382470500,435568009]
["Seguros a Vencer ",-112468120,-420288176]
["Cuentas a Vencer ",-53614558,-30249644]
["Viáticos a Reembolsar",1865000,310000]
["Total",{"$f":"SUM(B9:B23)","v":9311477545},{"$f":"SUM(C9:C23)","v":7949209938}]
[]
["Provisiones Moneda Extranjera"]
["Publicidad a Pagar M.E",117623000,218666058]
["Cuentas a pagar M.E",2312286755,5175654195]
["Fletes a pagar M.E",10303930339,11065604230]
["Seguros a pagar M.E",302129344,149026274]
["Honorarios Profesionales M.E a pagar",164373022,73307520]
["Intereses M.E a devengar ",152638178,1909881194]
["Seguros M.E a vencer ",0,-813954]
["Cuentas ME  vencer ",-162640441,0]
["Total",{"$f":"SUM($B$27:B34)","v":13190340197},{"$f":"SUM($C$27:C34)","v":18591325517}]
["Total General Provisiones Act. Comercial ",{"$f":"+B24+B35","v":22501817742},{"$f":"+C24+C35","v":26540535455}]
[]
[]
[]
["Actividad Ganadera "]
["Provisiones Moneda Local "]
["Seguros a pagar Act. Ganadera",12800000,10968000]
["Cuentas a pagar Act. Ganadera ",308926478,378397667]
["Seguros a Vencer Act. Ganadera ",-12846716,-10702754]
["Total",{"$f":"SUM($B$42:B44)","v":308879762},{"$f":"SUM($C$42:C44)","v":378662913}]
[]
["Provisiones Moneda Extranjera"]
["Cuentas a pagar M.E Act. Ganadera ",114682148,23405509]
["Total",{"$f":"SUM($B$48:B48)","v":114682148},{"$f":"SUM($C$48:C48)","v":23405509}]
["Total General Provisiones Act. Ganadera ",{"$f":"+B45+B49","v":423561910},{"$f":"+C45+C49","v":402068422}]
["Total Provisiones ",{"$f":"+B50+B36","v":22925379652},{"$f":"+C50+C36","v":26942603877}]

{"sheet":"Nota 19","index":25,"n_rows":33,"n_cols":3,"rows_kept":33,"cut":false,"hidden":false,"merged":[[3,0,3,1]]}
[{"$f":"Indice!C1","v":"NICOLAS GONZALEZ ODDONE S.A.E.C.A"},"BG"]
[]
["NOTA 19 – OTROS PASIVOS CORRIENTES "]
["En miles de guaranies"]
[]
["Otros Pasivos corrientes Moneda Local "]
["cuentas ","2021-09-30","2020-12-31"]
[]
["Anticipos de Clientes ",0,53017206]
["Garantías de Alquiler ",78564000,67832000]
["Señas ",4336678,4336678]
["Anticipos Varios ",815326689,1449424749]
["Comisiones S/Vtas. A pagar",49601221,55730908]
["Dividendos a Pagar ",1018867595,0]
["Total ",{"$f":"SUM(B9:B14)","v":1966696183},{"$f":"SUM(C9:C14)","v":1630341541}]
[]
["Otros Pasivos Corrientes Moneda Extranjera"]
["Anticipos de clientes M.E",200525200,448367940]
["Garantías de Alquiler M.E",42551850,42693300]
["Total ",{"$f":"SUM(B18:B19)","v":243077050},{"$f":"SUM(C18:C19)","v":491061240}]
[]
[]
["Ingresos No Devengados "]
["Ingresos no devengados",912796029,1170484811]
["Total ",{"$f":"SUM(B24)","v":912796029},{"$f":"SUM(C24)","v":1170484811}]
["Total general Otros Pasivos Corrientes ",{"$f":"+B15+B20+B25","v":3122569262},{"$f":"+C15+C20+C25","v":3291887592}]
[]
["NOTA 19.1 –PASIVOS NO CORRIENTES "]
[]
["Otros Pasivos corrientes Moneda Extranjera"]
["cuentas ","2021-09-30","2020-12-31"]
["Intereses a Devengar ME LP",2184057621,4885020675]
["Total general Otros Pasivos Corrientes ",{"$f":"+B22+B27+B32","v":2184057621},{"$f":"+C22+C27+C32","v":4885020675}]

{"sheet":"Nota 20","index":26,"n_rows":15,"n_cols":3,"rows_kept":15,"cut":false,"hidden":false,"merged":[[2,0,2,3],[0,0,0,1],[3,0,3,1]]}
[{"$f":"Indice!C1","v":"NICOLAS GONZALEZ ODDONE S.A.E.C.A"},null,"BG"]
[]
["NOTA 20 – CAPITAL INTEGRADO"]
["En miles de guaranies"]
[]
["Cuentas ","2021-09-30","2020-12-31"]
[]
["Capital ",{"$f":"+B9+B10+B11+B12","v":643227002000},{"$f":"+C9+C10+C11+C12","v":643227002000}]
["Capital Suscripto ",800000000000,800000000000]
["Capital a Integrar",-164958100000,-164958100000]
["Acciones en tesorería ",-144200000,-144200000]
["Premio de Emisión ",8329302000,8329302000]
["Cantidad de Acciones ",6348977,6348977]
["Valor Nominal de Acciones",100000,100000]
["Total",{"$f":"SUM(B9:B12)","v":643227002000},{"$f":"SUM(C9:C12)","v":643227002000}]

{"sheet":" Nota 21","index":27,"n_rows":38,"n_cols":3,"rows_kept":38,"cut":false,"hidden":false,"merged":[[2,0,2,5],[3,0,3,1]]}
[{"$f":"Indice!C1","v":"NICOLAS GONZALEZ ODDONE S.A.E.C.A"},"BG"]
[]
["NOTA 21 – RESERVAS"]
["En miles de guaranies"]
[null,"2021-09-30","2020-12-31"]
[]
["a.1 Reserva de revalúo Ley 125/91 ",{"$f":"57008661721+33978554091+472930672+107394557","v":91567541041},{"$f":"57008661721+33978554091+472930672+107394557","v":91567541041}]
["a.2 Reserva de revalúo Técnico ",87405000939,87405000939]
["Total",{"$f":"SUM(B7:B8)","v":178972541980},{"$f":"SUM(C7:C8)","v":178972541980}]
[]
[]
[]
["b.1 Reserva legal",54822159516,49691949474]
["b.2 Reserva legal CPH",506745718,506745718]
["Total",{"$f":"SUM(B13:B14)","v":55328905234},{"$f":"SUM(C13:C14)","v":50198695192}]
[]
[]
["c Reservas estatutarias"]
[]
[]
[]
["d Reservas facultativas",{"$f":"+SUM($B$23:B28)","v":0},{"$f":"+SUM($C$23:C28)","v":0}]
["d.1. (nuevas cuentas a incluir)"]
["d.2. (nuevas cuentas a incluir)"]
[]
[]
[]
[]
[]
["c. Reserva para Capitalización ",148352473750,80120680209]
["Total",{"$f":"SUM(B30)","v":148352473750},{"$f":"SUM(C30)","v":80120680209}]
[]
[]
[]
[]
["Correspondiente a las Acciones en Tesoreria"]
["* Prima de compra de Acciones",-47385000,-47385000]
["Total general Reservas ",{"$f":"B9+B15+B31+B37","v":382606535964},{"$f":"+C9+C15+C31+C37","v":309244532381}]

{"sheet":"Nota 22","index":28,"n_rows":10,"n_cols":3,"rows_kept":10,"cut":false,"hidden":false,"merged":[[4,1,4,2],[3,0,3,1]]}
[{"$f":"Indice!C1","v":"NICOLAS GONZALEZ ODDONE S.A.E.C.A"},null,"BG"]
[]
["NOTA 22 –  DIFERENCIA TRANSITORIA POR CONVERSION"]
["En miles de guaranies"]
["NO APLICA"]
[null,"2021-09-30","2020-12-31"]
["Diferencia transitoria por conversión"]
[]
[]
[null,"-","-"]

{"sheet":"Nota 23","index":29,"n_rows":14,"n_cols":3,"rows_kept":14,"cut":false,"hidden":false,"merged":[[3,0,3,1],[9,1,9,2]]}
[{"$f":"Indice!C1","v":"NICOLAS GONZALEZ ODDONE S.A.E.C.A"},null,"BG"]
[]
["NOTA 23 –  RESULTADOS ACUMULADOS"]
[]
["Cuenta","2021-06-30","2020-12-31"]
["Resultados Acumulados",0,0]
["Totales",{"$f":"SUM($B6:B$6)","v":0},{"$f":"SUM($C6:C$6)","v":0}]
[]
[]
[]
["Cuenta","2021-09-30","2020-12-31"]
["Resultado de ejercicios anteriores",0,0]
["Resultado del ejercicio ",74115008613,102604200814]
["Totales",{"$f":"SUM($B$13:B13)","v":74115008613},{"$f":"SUM($C$13:C13)","v":102604200814}]

{"sheet":"Nota 24","index":30,"n_rows":9,"n_cols":3,"rows_kept":9,"cut":false,"hidden":false,"merged":[[3,0,3,1],[9,1,9,2],[4,1,4,2]]}
[{"$f":"Indice!C1","v":"NICOLAS GONZALEZ ODDONE S.A.E.C.A"},null,"BG"]
[]
["NOTA 24 –  INTERES MINORITARIO"]
["En miles de guaranies"]
["NO APLICA"]
[null,"2021-09-30","2020-12-31"]
["Interes Minoritario"]
[]
[null,"-","-"]

{"sheet":"Nota 25","index":31,"n_rows":20,"n_cols":3,"rows_kept":20,"cut":false,"hidden":false,"merged":[[6,1,6,2],[3,0,3,1]]}
[{"$f":"Indice!C1","v":"NICOLAS GONZALEZ ODDONE S.A.E.C.A"},null,"ER"]
[]
["NOTA 25 –  VENTAS"]
["En miles de guaranies"]
[]
["Las Ventas netas al 30 de setiembre de 2021 y 2020 son las siguientes:"]
[]
["Cuentas ","2021-09-30","2020-09-30"]
["Ventas Actividad Comercial "]
["Ventas de Mercaderías ",{"$f":"19117315042+500275991628","v":519393306670},438691931156]
["Venta de Repuestos ",3919491683,4010042494]
["Ventas Servicio Técnico",4113720050,1495229208]
["Total Ventas Actividad Comercial ",{"$f":"SUM(B10:B12)","v":527426518403},{"$f":"SUM(C10:C12)","v":444197202858}]
[]
[]
["Ventas Actividad Ganadera "]
["Ventas Activ. Ganadera ",9232114560,2238200982]
["Ventas Activ. Ganadera capitalización",7976947616,870739223]
["Ventas Equinos",0,0]
["Total Ventas Actividad  Ganadera",{"$f":"SUM(B17:B19)","v":17209062176},{"$f":"SUM(C17:C19)","v":3108940205}]

{"sheet":"Nota 26","index":32,"n_rows":18,"n_cols":3,"rows_kept":18,"cut":false,"hidden":false,"merged":[[22,0,22,2]]}
[{"$f":"Indice!C1","v":"NICOLAS GONZALEZ ODDONE S.A.E.C.A"},"ER"]
[]
["NOTA 26 - COSTO DE VENTAS"]
["Miles de guaraníes"]
[]
["Costo de ventas","2021-09-30","2020-09-30"]
["Comercial "]
["Existencia inicial del inventario",168535470731,323834508963]
["+ Compra de bienes y servicios",668407643144,299389678730]
["+ Costo de producción",0,0]
["- Existencia final de inventario",-454245525970,-309702144812]
["Ganadera "]
["Existencia inicial del inventario",16143163260,22025480989]
["+ Compra de bienes y servicios",0,0]
["+ Costo de producción"]
["- Existencia final de inventario",-22503027540,-11594997745]
["Tranferencia por reclasificacion de ganado/VM",23568926456,-7321543039]
["Total costo de ventas ",{"$f":"SUM(B8:B17)","v":399906650081},{"$f":"SUM(C8:C17)","v":316630983086}]

{"sheet":"Nota 27","index":33,"n_rows":34,"n_cols":7,"rows_kept":34,"cut":false,"hidden":false,"merged":[[4,0,4,7],[7,0,8,0]]}
[{"$f":"Indice!C1","v":"NICOLAS GONZALEZ ODDONE S.A.E.C.A"},"ER"]
[]
["NOTA 27 - GASTOS"]
["Miles de guaraníes"]
[]
["El rubro está compuesto de la siguiente forma: "]
[]
["Cuentas ",null,"2021-09-30",null,null,"2020-09-30"]
[null,"Gastos de Ventas","Gastos Administrativos","Total","Gastos de Ventas","Gastos Administrativos","Total"]
["Movilidad y viáticos",{"$f":"631817220+5635340+21667983+33309658+46006077+38000+56327676+211000","v":795012954},{"$f":"34455187+198496+3551018","v":38204701},{"$f":"+C10+B10","v":833217655},500285184,10678914,{"$f":"+F10+E10","v":510964098}]
["Combustibles y lubricantes ",{"$f":"570071+84012124+147969826+150000","v":232702021},{"$f":"117141528+2492947+1662078+1422578+9852825+2906189","v":135478145},{"$f":"+B11+C11","v":368180166},249507140,93468608,{"$f":"+F11+E11","v":342975748}]
["Gastos de alquiler",{"$f":"154858054+933354868+117000000","v":1205212922},{"$f":"183915000+27638699","v":211553699},{"$f":"+C12+B12","v":1416766621},1277924060,194997069,{"$f":"+F12+E12","v":1472921129}]
["Computación y redes",0,0,0,0,0,{"$f":"+F13+E13","v":0}]
["Gastos por servicios",{"$f":"55100712+2347818+603691866+128680481+4545454","v":794366331},{"$f":"357935008+604720061+8156592+18945455+1759451","v":991516567},1785882898,{"$f":"32058034+180900000+55605418+720798629","v":989362081},{"$f":"219407546+112628671+21491535","v":353527752},1342889833]
["Honorarios profesionales y asesoramiento",{"$f":"170733136+148632363+401447503+99433005+77327271","v":897573278},{"$f":"1153425942+106543500+62073999+212640+61795000+12986050+59235006+10485000","v":1466757137},2364330415,768050237,5904372487,6672422724]
["Impuestos y tasas",{"$f":"4968700","v":4968700},750165042,755133742,3419300,685022310,688441610]
["Gastos de reparación y mantenimiento",{"$f":"16895662+532200986+12393578+5920407","v":567410633},{"$f":"493063013+298988582+318985068","v":1111036663},1678447296,481298280,1093176660,1574474940]
["Seguros pagados",{"$f":"954546+280514700+31215370+5191972","v":317876588},{"$f":"43026005+54515506+4031442+24003938+814842","v":126391733},444268321,160143611,153387042,313530653]
["Otros gastos de operación",0,0,0,null,null,0]
["Remuneraciones de administradores, directores, síndicos y consejo de vigilancia",0,{"$f":"707850000+39123333+46902273","v":793875606},793875606,{"$f":"693330000+38115000+44667702","v":776112702},776112702,1552225404]
["Sueldos y Jornales",{"$f":"2512398450+18639+3289177401+59199521+551659491+132336000+3575353407+6000000+1511844321+80597342+333621631+22847342","v":12075053545},{"$f":"2546629940+375736690+61770000+88280000+497663703+1066577583+549963334+475375464","v":5661996714},{"$f":"+C21+B21","v":17737050259},10527784444,5212312750,15740097194]
["Contribuciones Sociales",{"$f":"84471754+100087964+998272350+35973952+320711350+8920000+114331057+1096420+39286259+199549249+85132712+636493332+69147671+211247249+24176545+57422986+40073824+350053657+8691972+114967738+11695722+27889562+65348953+3003750+21098113","v":3629144141},{"$f":"142979604+35966366+522321119+27191635+166697470+15271242+24330000+88648717+29334313+88016510+190508025+62706593+29353333+33000000+101032250+29493057+31333333+83606952+219284+28895330","v":1730905133},5360049274,3569513898,1364675205,4934189103]
["Gastos del personal y capacitación",{"$f":"1119976+195375000+20479534+17101709+3120202+25454+35670000+4611364+4619840+450000+12674391+319305000+7402240+56772773+7589393+20639350+8700000+138375940+13475091+7500000+156780000+2653627+16647869+19754545+6628000+35850000+746361+318182+75700","v":1114461541},{"$f":"1707521+202825000+1872800+37709086+21251401+800787+15685912+2439024+22315000+89089+6710963+6589467+5813396+579120875+26670000+204543+9755449+7734922+25000000+24910000+31835906+7778133+4145454+6195000+12021441+186368000+12405000+50908+8339687+14228769+2981000","v":1285554533},{"$f":"+C23+B23","v":2400016074},1316379011,336116332,1652495343]
["Comisiones a Vendedores ",1551764455,0,{"$f":"+C24+B24","v":1551764455},1413745439,0,1413745439]
["Honorarios por servicios técnicos",{"$f":"183049236+6480000","v":189529236},0,{"$f":"+C25+B25","v":189529236},304395883,0,304395883]
["Gastos de Publicidad y Propaganda",17656291998,0,17656291998,12236065663,0,12236065663]
["Intereses, multas y recargos impositivos",0,0,{"$f":"+C27+B27","v":0},0,441275210,441275210]
["Intereses a bancos e instituciones financieras",0,0,0,null,0,0]
["Depreciación bienes de uso",0,{"$f":"1338398638+940869844+375040973+1846918927+463348330+1039053305+52462927+394772177","v":6450865121},{"$f":"+B29+C29","v":6450865121},0,5470961268,5470961268]
["Amortización activos intangibles",0,{"$f":"2630233+16964095+1034498872+474576540+39794619","v":1568464359},{"$f":"+B30+C30","v":1568464359},0,1287844161,1287844161]
["Previsiones",0,0,0,0,0,0]
["Gastos de Distribución",4264599818,0,{"$f":"+C32+B32","v":4264599818},4352208402,0,4352208402]
["Otros",{"$f":"400226739510-378180061256+20502579535+13516005971+5311402950-2098573242+3224888794-2418953407-B10-B11-B12-B14-B15-B16-B17-B18-B21-B22-B23-B24-B25-B26-B32","v":14788060694},{"$f":"18466914561+780548291+3661971158+1052861266+859868910-C10-C11-C12-C13-C14-C15-C16-C17-C18-C19-C20-C21-C22-C23-C24-C25-C26-C27-C28-C29-C30-C31-C32","v":2499399033},{"$f":"+C33+B33","v":17287459727},{"$f":"12699172181-E14","v":11709810100},{"$f":"3179854543-F14","v":2826326791},{"$f":"+F33+E33","v":14536136891}]
["Total",{"$f":"+SUM($B$10:B33)","v":60084028855},{"$f":"+SUM($C$10:C33)","v":24822164186},{"$f":"+SUM($D$10:D33)","v":84906193041},{"$f":"SUM(E10:E33)","v":50636005435},{"$f":"+SUM($F$10:F33)","v":26204255261},{"$f":"+SUM($G$10:H33)","v":76840260696}]

{"sheet":"Nota 28","index":34,"n_rows":78,"n_cols":7,"rows_kept":78,"cut":false,"hidden":false,"merged":[[7,1,7,2],[2,0,2,6],[48,0,48,2]]}
[{"$f":"Indice!C1","v":"NICOLAS GONZALEZ ODDONE S.A.E.C.A"},"ER"]
[]
["Nota 28 - Otros Ingresos y gastos operativos"]
["Miles de guaraníes"]
[]
["El rubro está compuesto de la siguiente forma: "]
[]
["Otros Ingresos ",null,null,null,"Otros gastos"]
["Cuentas ","2021-09-30","2020-09-30",null,"Cuentas ","2021-09-30","2020-09-30"]
["Actividad Comercial ",null,null,null,"Actividad Ganadera"]
["Créditos Recuperados Gr.",415915696,844772682,null,"Gastos Administrativos ",-794764317,-563193376]
["Reembolso de Seguros Gr.",341758400,83121344,null,"Gastos de Explotación",-3688637345,-3995786934]
["Ingresos por comisiones",5991391,651901,null,"Depreciación Bienes de uso ",{"$f":"-1606291018-810577199","v":-2416868217},-1874086190]
["Ingresos Varios GR.",447877598,98130230,null,"Amortización Licencias Informática",-414205,-414204]
["Otros ingresos Varios GR.",25094002,85122143,null,"Gastos de Ventas ",-189093013,-33750400]
["Ingresos varios EX de IVA",5794008,0,null,"Gastos de Ventas Capitalización",-1563075994,-348582194]
["Diferencias de Inventarios",823626430,152596776,null,"Diferencias de Cambios",-1303606,-28224537]
["Ingresos por servicios de Logística ",1581679635,916771818,null,"Pérdida de Inventarios",-799901952,0]
["Ingresos varios de logística ",40581804,25507347,null,"Total",{"$f":"SUM(F11:F18)","v":-9454058649},{"$f":"SUM(G11:G18)","v":-6844037835}]
["Ingresos varios de T.I",23179972,17509799]
["Fletes cobrados",35929616,12509357]
["Desafectación de Mercad. y Rep c/Obsol.",{"$f":"1114066516+268216001+210651485+31965314","v":1624899316},7299718338]
["Otros ingresos Varios de ventas ",534055763,86291136]
["Ingresos varios GR.de ventas ",803289509,819746232]
["Ingresos por Acuerdos comerciales ",70298202,443438021]
["Aporte publicitario del Exterior ",0,829450716]
["Publicidad Cobrada ",0,986102920]
["Ingresos varios de Marketing",25226026,40634650]
["Otros Ingresos varios GR-repuestos ",400000,24110014]
["Servicio de Delivery - Repuestos",6307299,1698668]
["Servicio de Delivery - ST",175143595,141007834]
["Ingresos por servicios varios ST ",111193047,102761784]
["Otros ingresos varios ST ",24297500,17668193]
["Otros ingresos varios Gr ST",4805625,1582500]
["Ingresos extraordinarios -devoluc.der.Aduan.",25355802,128974090]
["Ingresos varios Avion ",0,32734372]
["Creditos recuperados EX",5858255,0]
["Total Otros Ingresos Act. Comerc.",{"$f":"SUM(B11:B37)","v":7158558491},{"$f":"SUM(C11:C37)","v":13192612865}]
[]
["Actividad Ganadera"]
["Diferencias de Cambios ",549584,1738355]
["Ingresos Varios ",47887634,14065443]
["Resultados vta. Activo fijo ",14123431,0]
["Valor Neto de Realización ",18716204022,1143174233]
["Total Otros Ingresos Act.Ganad.",{"$f":"SUM($B$41:B44)","v":18778764671},{"$f":"SUM($C$41:C44)","v":1158978031}]
["Total General Otros Ingresos ",{"$f":"+B38+B45","v":25937323162},{"$f":"C38+C45","v":14351590896}]
[]
[]
["Nota 28.1 - Otros Ingresos y gastos no operativos"]
[null,null,"ER"]
["El rubro está compuesto de la siguiente forma: "]
[]
["Cuentas ","2021-09-30","2020-09-30"]
["Alquileres ganados ",1401591742,1276982368]
["Resultado Vtas. Bienes de uso ",1183795599,0]
["Otros ingresos de Inversiones Inmob.",46268001,23003640]
["Ipuesto Inmobiliario ",-76696510,-73626456]
["Impuesto Inmobiliario no ded.",0,-7320056]
["Patentes y tasas municipales",-83139049,-123722761]
["Impuestos, patentes y tasas munic. No ded.",0,-7670500]
["Impuesto a la construcción",-40683000,0]
["Depreciaciones Edificios de Invers.",0,-293620277]
["Mant. y reparación de edificios de Invers. ",-25252408,-868181]
["Seguros de Edificios de invers.",-7055812,-4314986]
["Gastos varios de Invers.",{"$f":"-400719473-93960000","v":-494679473},-169344996]
["Gastos varios de Invers. No ded.",-45031630,-22357206]
["Resultado Vtas. Bienes de uso ",-52199827,0]
["Servicios de seguridad. ",-226192862,-143981813]
["Malos créditos de Invers. Inmob.",0,0]
["Pérdida en vta. Bienes de uso ",0,0]
["Pérdida por Siniestros ",0,0]
["Total",{"$f":"SUM($B$54:B71)","v":1580724771},{"$f":"SUM($C$54:C71)","v":453158776}]
[]
[]
["Cuentas ","2021-09-30","2020-09-30"]
["Resultado de ejercicios anteriores ",-6797514,-514464]
["Total",{"$f":"+B76","v":-6797514},{"$f":"+C76","v":-514464}]
["Total General Otros Resultados no operativos ",{"$f":"+B72+B77","v":1573927257},{"$f":"+C72+C76","v":452644312}]

{"sheet":"Nota 29","index":35,"n_rows":31,"n_cols":7,"rows_kept":31,"cut":false,"hidden":false,"merged":[]}
[{"$f":"Indice!C1","v":"NICOLAS GONZALEZ ODDONE S.A.E.C.A"},"ER"]
[]
["NOTA 29 - INGRESOS Y GASTOS FINANCIEROS NETOS"]
["Miles de guaraníes"]
[]
["El rubro está compuesto de la siguiente forma: "]
[]
["Ingresos Financieros Netos ",null,null,null,"Gastos Financieros netos"]
["Cuentas ","2021-09-30","2020-09-30",null,"Cuentas ","2021-09-30","2020-09-30"]
["Intereses Cajas de ahorro",295026632,199658915,null,"Intereses y com. Bancarios ",-11237648,-10344457]
["Diferencias de Cambios GR. Financ.",41822745272,21237549682,null,"Intereses y com.S/Prest.Bancarios ",-2411375340,-1265515567]
["Intereses p/ Refinanciaciones Grav.",3717328513,3087974999,null,"Diferencias de cambios GR.Gtos. Financ.",-39140149262,-11468976965]
["Intereses Cobrados ",562393380,85312677,null,"Diferencias de cambios Gtos. Financ.",-528945,-996030]
["Intereses p/ Vta. A credito Grav.",168913718,344774073,null,"Total gastos financieros",{"$f":"SUM(F10:F13)","v":-41563291195},{"$f":"SUM(G10:G13)","v":-12745833019}]
["Total ingresos financieros",{"$f":"SUM($B10:B14)","v":46566407515},{"$f":"SUM(C10:C14)","v":24955270346}]
[]
[]
[]
[]
["NOTA 29.1 - INGRESOS Y GASTOS  DE INVERSIONES FINANCIERAS"]
[null,null,"ER"]
["El rubro está compuesto de la siguiente forma: "]
[]
["Ingresos de Inversión Financiera",null,null,null,"Gastos de Inversión Financiera"]
["Cuentas ","2021-09-30","2020-09-30",null,"Cuentas ","2021-09-30","2020-09-30"]
["Intereses por Inversiones financieras EX",3825073849,1863181585,null,"Intereses y com.p/Invers. Financ.",0,-560800]
["Diferencias de cambio GR. INV.FIN.",1643108559,0,null,"Dif.de cambios Gr. G.Inv.FIN.",-5787085778,0]
["Ganancias por valuación ",163060047,0,null,"Dif.de cambios EX.INV.FIN.",-7308252600,0]
["Intereses por Inversiones financieras ",259971568,0,null,"Pérdidas por valuacion ",-294132037,-170066289]
["Diferencias de cambio Inv.fin.Ex",6549977438,0,null,"Intereses y com.p/Invers. Financ. EX",-2983669,-18576250]
["Total Ingresos de Inv. Financ.",{"$f":"SUM(B26:B30)","v":12441191461},{"$f":"SUM(C26:C30)","v":1863181585},null,"Total Gatos de Inv. Financiera",{"$f":"SUM(F26:F30)","v":-13392454084},{"$f":"SUM(G26:G30)","v":-189203339}]

{"sheet":"Nota 30","index":36,"n_rows":11,"n_cols":3,"rows_kept":11,"cut":false,"hidden":false,"merged":[]}
[{"$f":"Indice!C1","v":"NICOLAS GONZALEZ ODDONE S.A.E.C.A"},"ER"]
[]
["Nota 30 - Resultado de inversiones en asociadas"]
["Miles de guaraníes"]
["NO APLICA"]
["Cuentas","2021-09-30","2020-09-30"]
["Resultado en inversiones permanentes"]
["Resultado en inversiones permanentes"]
["Ajuste VPP"]
["Total",{"$f":"SUM(B7:B9)","v":0},{"$f":"SUM(C7:C9)","v":0}]
["El resultado de las inversiones en las empresas asociadas, son reconocidas al cierre de año, aplicando el VPP. "]

{"sheet":"Nota 31","index":37,"n_rows":12,"n_cols":3,"rows_kept":12,"cut":false,"hidden":false,"merged":[[3,0,3,1],[4,1,4,2]]}
[{"$f":"Indice!C1","v":"NICOLAS GONZALEZ ODDONE S.A.E.C.A"},"ER"]
[]
["Nota 31 - Resultado participación minoritaria"]
["Miles de guaraníes"]
["NO APLICA"]
[]
["Resultado participación minoritaria","2021-09-30","2020-09-30"]
["(Detallar cuenta)"]
[]
[]
[]
["Total",0,0]

{"sheet":"Nota 32","index":38,"n_rows":9,"n_cols":3,"rows_kept":9,"cut":false,"hidden":false,"merged":[[4,1,4,2]]}
[{"$f":"Indice!C1","v":"NICOLAS GONZALEZ ODDONE S.A.E.C.A"},"ER"]
[]
["Nota 32 - IMPUESTO A LA RENTA"]
["En miles de guaraníes"]
[]
["Cuentas ","2021-09-30","2020-09-30"]
["Impuesto a la Renta Ley 125/91",7816774311,8264960554]
["Impuesto a la renta adic. p/ distrib. Utilid.",0,0]
["Total",{"$f":"SUM($B7:B8)","v":7816774311},{"$f":"SUM($C7:C8)","v":8264960554}]

{"sheet":"Nota 33","index":39,"n_rows":13,"n_cols":3,"rows_kept":13,"cut":false,"hidden":false,"merged":[[3,0,3,1]]}
[{"$f":"Indice!C1","v":"NICOLAS GONZALEZ ODDONE S.A.E.C.A"},"ER"]
[]
["Nota 33 - Resultado extraordinario neto de impuesto a la renta"]
["En miles de guaraníes"]
["NO APLICA"]
[null,"2021-09-30","2020-09-30"]
["Conceptos"]
["(Detallar)"]
[]
[]
[]
[]
["Total",{"$f":"SUM($B7:B12)","v":0},{"$f":"SUM($C7:C12)","v":0}]

{"sheet":"Nota 34","index":40,"n_rows":10,"n_cols":3,"rows_kept":10,"cut":false,"hidden":false,"merged":[[3,0,3,1]]}
[{"$f":"Indice!C1","v":"NICOLAS GONZALEZ ODDONE S.A.E.C.A"},"ER"]
[]
["Nota 34 - Resultado sobre actividades discontinuadas neto de impuesto a la renta"]
["En miles de guaraníes"]
["NO APLICA"]
["Resultado sobre actividades discontinuadas neto de impuesto a la renta","2021-09-30","2020-09-30"]
["(nueva cuenta a incluir)"]
["Subtotal"]
["- Impuesto a la renta"]
["Total",{"$f":"SUM($B7:B9)","v":0},{"$f":"SUM($C7:C9)","v":0}]

{"sheet":"Nota 35","index":41,"n_rows":14,"n_cols":5,"rows_kept":14,"cut":false,"hidden":false,"merged":[[12,0,12,6],[13,0,13,6]]}
[{"$f":"Indice!C1","v":"NICOLAS GONZALEZ ODDONE S.A.E.C.A"},"ER",null,null,"ER"]
[]
["NOTA 35- UTILIDAD (PÉRDIDA) NETA DEL AÑO Y POR ACCION ORDINARIA"]
[]
["Cuentas","2021-09-30","2020-09-30"]
["Cantidad de Acciones Ordinarias Nominativas Clase A",{"$f":"3792182","v":3792182},3792182]
["Cantidad de Acciones Ordinarias Nominativas Clase B",1355574,1355574]
["Cantidad de Acciones Preferidas Nominativas Clase C ",1201220,1201220]
["Total Acciones ",{"$f":"SUM(B6:B8)","v":6348976},{"$f":"SUM(C6:C8)","v":6348976}]
["Utilidad Neta",74115008613,67413551673]
["Utilidad Neta por Acción",{"$f":"IFERROR(B10/B9,0)","v":11673.537372483373},{"$f":"IFERROR(C10/C9,0)","v":10618.019610248959}]
[]
["La Sociedad calcula la utilidad neta por acción sobre la base de la utilidad  del año y el total de acciones ordinarias integradas con valor nominal de G. 100.000 cada una.Las acciones ordinarias nominativas clase A tienen derecho a 5 votos, las acciones ordinarias  nominativas clase B tienen derecho a 4 votos, en tanto que las acciones preferidas nominativas clase C tienen derecho a Rest. de 1 voto."]
["Las acciones se encuentran en proceso de desmaterialización. "]

{"sheet":"Nota 36","index":42,"n_rows":15,"n_cols":5,"rows_kept":15,"cut":false,"hidden":false,"merged":[[4,0,4,8],[2,0,2,4]]}
[{"$f":"Indice!C1","v":"NICOLAS GONZALEZ ODDONE S.A.E.C.A"},null,null,"Indice"]
[]
["NOTA 36 - ACTIVOS GRAVADOS"]
["NO APLICA"]
["Los siguientes bienes de propiedad de la Sociedad han sido hipotecados y prendados en garantía de obligaciones financieras."]
[]
[{"$f":"IFERROR(\"Al \"&DAY(Indice!B3)&\" de \"&VLOOKUP(MONTH(Indice!B3),Indice!S:T,2,0)&\" de \"&YEAR(Indice!B3-365),\"Al dia... de mes… de año 2021…\")","v":"Al dia... de mes… de año 2021…"}]
["Tipo de Activo","Datos  del activo gravado","Tipo de garantía","Importe (indicar   moneda)","A favor de"]
[]
[]
[]
[]
[]
[{"$f":"IFERROR(\"Al \"&DAY(Indice!B3)&\" de \"&VLOOKUP(MONTH(Indice!B3),Indice!S:T,2,0)&\" de \"&YEAR(Indice!B3-1),\"Al dia... de mes… de año 2021…\")","v":"Al dia... de mes… de año 2021…"}]
["Tipo de Activo","Datos  del activo gravado","Tipo de garantía","Importe (indicar   moneda)","A favor de"]

{"sheet":"Nota 37","index":43,"n_rows":15,"n_cols":4,"rows_kept":15,"cut":false,"hidden":false,"merged":[[14,0,14,7],[4,0,4,8],[5,0,5,8],[10,0,11,7]]}
[{"$f":"Indice!C1","v":"NICOLAS GONZALEZ ODDONE S.A.E.C.A"},null,null,"Indice"]
[]
["NOTA 37 - CONTINGENCIAS Y COMPROMISOS "]
["NO APLICA"]
["(Esta nota debería incluir un breve detalle de contratos con terceros, vigente a la fecha de cierre del ejercicio, cuyo incumplimiento o cláusula específica podrían generar obligaciones contingentes para el cliente). "]
[{"$f":"IFERROR(\"Los principales contratos suscriptos por la Sociedad, vigentes al  \"&DAY(Indice!B3)&\" de \"&VLOOKUP(MONTH(Indice!B3),Indice!S:T,2,0)&\" de \"&YEAR(Indice!B3-1)&\" son:\",\"Los principales contratos suscriptos por la Sociedad, vigentes al … de …  2021 son:\")","v":"Los principales contratos suscriptos por la Sociedad, vigentes al … de …  2021 son:"}]
["a) ----------------------------------------------"]
["b) --------------------------------------------"]
[]
[]
[{"$f":"IFERROR(\"Al  \"&DAY(Indice!B3)&\" de \"&VLOOKUP(MONTH(Indice!B3),Indice!S:T,2,0)&\" de \"&YEAR(Indice!B3-1)&\" no existen situaciones contingentes, ni reclamos que pudieran resultar en la generación de obligaciones para la Sociedad adicionales a las que se presentan en estos estados financieros.\",\"Al … de …………... 2021 no existen situaciones contingentes, ni reclamos que pudieran resultar en la generación de obligaciones para la Sociedad adicionales a las que se presentan en estos estados financieros.\")","v":"Al … de …………... 2021 no existen situaciones contingentes, ni reclamos que pudieran resultar en la generación de obligaciones para la Sociedad adicionales a las que se presentan en estos estados financieros."}]
[]
[]
[]
["Obs.: Esta información debe estar ajustada  a lo requerido por la Norma de Información Financiera N° 5 Contingencias y sucesos que ocurren después de la fecha del balance. "]

{"sheet":"Nota 38","index":44,"n_rows":26,"n_cols":4,"rows_kept":26,"cut":false,"hidden":false,"merged":[[2,0,2,6],[6,0,6,6],[7,0,7,6],[9,0,9,6]]}
[{"$f":"Indice!C1","v":"NICOLAS GONZALEZ ODDONE S.A.E.C.A"},null,null,"Índice"]
[]
["NOTA 38 - IMPUESTO DIFERIDO"]
["En miles de guaraníes"]
[]
["NO APLICA"]
["Al … de …........... 2021 la Sociedad constituyó una provisión para impuesto a la renta de Guaraníes  …... (Al … de …...............2021:  Guaraníes  …....) / (La Sociedad no ha constituido provisión para impuesto a la renta, debido a que a esa fecha la misma generó renta imponible que fue compensada con quebrantos impositivos acumulados a esa fecha). "]
["La Sociedad contabiliza el impuesto a la renta por el método de lo diferido, método del pasivo. El mencionado método establece la determinación de activos o pasivos impositivos diferidos netos basados en las diferencias temporales y temporarias, con cargo a la línea Impuesto a la renta del Estado de resultados."]
[]
["El siguiente cuadro detalla las diferencias temporales a la tasa del impuesto a los efectos de determinación del impuesto diferido:"]
[]
[null,"2021-09-30","2020-09-30"]
["Activos y pasivos impositivos diferidos: "]
["Caja y Bancos"]
["Inversiones"]
["Previsión para deudores incobrables"]
["Bienes de uso"]
["Activos intangibles"]
["Previsión del pasivo"]
["Deudas comerciales y bancarias"]
["Bienes de cambio"]
["Sub - total  "]
["Previsión para impuestos diferidos netos "]
["Total activo/pasivo impositivo diferido neto antes de quebrantos"]
["Quebranto impositivo"]
["Total"]

{"sheet":"Nota 39","index":45,"n_rows":4,"n_cols":3,"rows_kept":4,"cut":false,"hidden":false,"merged":[[4,0,4,8],[7,0,7,8]]}
[{"$f":"Indice!C1","v":"NICOLAS GONZALEZ ODDONE S.A.E.C.A"},null,"Indice"]
[]
[]
["NOTA 39 - HECHOS POSTERIORES"]

{"sheet":"Nota 40","index":46,"n_rows":145,"n_cols":3,"rows_kept":145,"cut":false,"hidden":false,"merged":[[153,0,153,5]]}
["NICOLAS GONZALEZ ODDONE S.A.E.C.A",null,"Indice"]
[]
["NOTA 40 - SALDOS Y TRANSACCIONES CON PARTES RELACIONADAS"]
["Miles de guaraníes"]
[]
[null,"2021-09-30","2020-09-30"]
["Personas con derecho a voto que controlen al menos 10% del capital"]
["Nicolás V. González R."]
["Mauro E. González R."]
["Montserrat González de Caballero"]
["Beatriz González de Bosio"]
["Gisela González de Fúster"]
[]
["Directores, administradores, síndicos, auditores Internos y apoderados"]
[]
["Presidente: Nicolás V. González R.","Presidente"]
["Vicepresidente: Mauro E. González R.","Vicepresidente"]
["Director Titular: Montserrat González de Caballero","Director"]
["Director Titular: Gisela González de Fúster","Director"]
["Director Titular: Juan Jose Bosio","Director"]
["Director Titular: Nino Cricco","Director"]
["Director Titular: Domingo Daher","Director"]
["Síndico Titular: Óscar Benítez Codas","Síndico "]
["Auditora Interna: Ana Cristaldo","Auditoria Interna"]
[]
["Cónyuges y parientes hasta el segundo grado de consaguinidad o afinidad  de  "]
["las personas de los incisos anteriores, con participación en el capital de la "]
["sociedad"]
[]
["Nicolas E. González Z."]
["Jose A. González Z."]
["Esteban J. González K."]
["Violeta M. González K."]
["Bruno A. González K."]
["Juan Jose Bosio G."]
["Irmina E. Quintana"]
["Raquel Sofia Aguilar Zapag"]
["Mauro Antonio González K."]
[]
[]
["Activo"]
[]
["Cuentas a Cobrar"]
[]
["Todo Franquicia S.A adeuda a NGO, al 30/09/2021, por compras de mercaderias "]
["activo fijo y alquileres la suma de G.",35528427517,25860505551]
[]
["Confort para el Hogar adeuda NGO, al 30/09/2021 por  compras de mercaderias"]
["y préstamos  la suma de G.",12755850464,11107292108]
[]
["Estirpe Guaraní S.A adeuda a NGO, al 30/09/2021 por  compras de merecaderías"]
["la suma de G. ",117913576,37314265]
[]
["Monday S.A Inmobiliaria adeuda a NGO, al 30/09/2021 por compras de mercade-"]
["rías la suma de G. ",0,17352834]
[]
["Agropecuaria cuatro vientos adeuda a NGO al 30/09/2021 por compras de "]
["mercaderías, repuestos  y servicio técnico, la suma de G. ",29550000,0]
[]
["M. Montserrat González"]
["* Productos ",0,1937977]
[]
["Mauro Esteban González "]
["* Productos ",33571263,131002]
[]
["Sara Comercial Villamorra S.A "]
["* Productos ",2650611733,3164411965]
[]
["Nicolas V. González"]
["* Productos ",7988031,17008835]
[]
["Gisela González de Fúster"]
["* Productos ",3384449,784353]
[]
["Beatriz Eugenia González de Bosio "]
["* Producto ",5139026,4305110]
[]
["Juan José Bosio González"]
["*Producto ",6451579,5642171]
[]
["Ana Mariela Cristaldo "]
["*Producto ",1474588,2854053]
[]
["Inversiones Mobiliarias Permanentes "]
["NGO SAECA, es socio Fundador de la sociedad TODO FRANQUICIA S.A., "]
["el capital social de la firma, por asamblea extraordinaria en abril 2011, "]
["aumentó a la suma de cincuenta millones de guaranies. La particpación "]
["de NGO SAECA es (99, 87 %), en dicha sociedad. "]
["La integracón a la fecha asciende a Gs. 27.477.000.000",{"$f":"17477000000+10000000000-17383289634","v":10093710366},3914711856]
[]
["NGO SAECA, es socio fundador de la sociedad CONFORT PARA EL HOGAR"]
["CPH S.A, el capital social de la firma según escritura de constitución de "]
["fecha 4 de marzo de 2014 es de cincuenta millomes de guaraníes. La"]
["participación de NGO SAECA (99, 97%) en dicha sociedad, es cuarenta y "]
["nueve mil quinientos millones de guaraníes G. 49.500.000.000.-"]
["La integración actual asciende a Gs. 45.006.000.000",{"$f":"33304000000+11702000000-10385785590","v":34620214410},28298825575]
[]
["NGO SAECA, es socio fundador de la sociedad BEST CREDIT S.A., el capital"]
["social de la asciende a la suma de Seiscientos mil millones de guaraníes."]
["La participación de NGO SAECA  es (97,00%) en dicha sociedad. La integracion",291000000,0]
["actual asciende a 291.000.000 de G."]
[]
["NGO SAECA, es socio fundador de la sociedad BEST CREDIT S.A., el capital"]
["social de la asciende a la suma de Cincuenta mil millones de guaraníes."]
["La participación de NGO SAECA es (99,51%) en dicha sociedad. La integracion"]
["actual asciende a 2.020.000.000 de G.",2020000000,0]
[]
["Ingresos"]
["Ingresos por alquiler de uno de sus inmuebles de inversión, a la sociedad"]
["Compañía Internacional de Comercio S.R.L. (CIDECOM SRL)",0,16500000]
[]
["Ingresos por alquiler de inmuebles de inversion a Todo Franquicia S.A.",305811199,181814547]
[]
["Ingresos por alquiler de uno de sus inmuebles a la empresa Estirpe Guaraní SA"]
[null,0,15275627]
[]
["Ingresos por ventas de productos,  servicios e intereses "]
["Nicolás V. González R.",36127789,12595969]
["Mauro E. González R.",62639479,69425853]
["Montserrat González de Caballero",2150402,10943872]
["Gisela González de Bosio",5949698,11317017]
["Juan José Bosio González",45837699,34459850]
["Beatriz Eugenia González de Bosio",16667435,28224565]
["Nicolas E. González Z.",5903776,13338024]
["Jose A. González Z.",8348216,170876]
["Esteban J. González K.",2514486,31596829]
["Violeta M. González K.",0,0]
["Bruno A. González K.",7000000,0]
["Mauro Antonio González K.",0,0]
["Ana Mariela Cristaldo",76572486,10917300]
["Cidecom SRL",53133673,16500000]
["Estirpe Guarani SRL",207158730,79700556]
["Todo Franquicia S.A.",19576079409,9316757802]
["Monday SA Inmobiliaria",5674704,13948940]
["Agropecuaria Cuatro Vientos S.A.",27622476,286364]
["Sara Comercial Villa Morra S.A.",2224504391,1489557560]
[]
["Ingresos por servicios e intereses  "]
["Confort para le Hogar S.A.",{"$f":"9685253972-7547125000","v":2138128972},1067996203]
[]
["Egresos"]
[]
["Gastos de publicidad Todo Franquicia",81818182,27530682]
["Gastos de publicidad  Sara comercial Villamorra S.A",7545455,0]
["Total ",{"$f":"SUM(B7:B144)","v":123062475659},{"$f":"SUM(C7:C144)","v":84881936091}]