{"text_format":"1","workbook":"xlsx","n_sheets":47,"sheets":["Caratula","Indice","BG","ER","EVPN ","EFE","Nota1","Nota 2","Nota 3","Nota 4","Nota 5","Nota 6","Nota 7","Nota 8","Nota 9","Nota 10","Nota 11","Nota 12","Nota 13","Nota 14","Nota 15","Nota 16","Nota 17","Nota 18","Nota 19","Nota 20"," Nota 21","Nota 22","Nota 23","Nota 24","Nota 25","Nota 26","Nota 27","Nota 28","Nota 29","Nota 30","Nota 31","Nota 32","Nota 33","Nota 34","Nota 35","Nota 36","Nota 37","Nota 38","Nota 39","Nota 40","Base de Monedas"],"not_rendered":{"charts":0,"images":4,"macros":1,"external_links":22,"defined_names":365,"comments":0,"pivot_tables":0},"unopened":[],"bounds":{"document_bytes":16777216,"sheet_cells":100000,"rows_first":2000,"rows_last":500,"rows_between":2000,"halvings":0,"cell_chars":16384,"cell_head_chars":4096},"cells_cut":0,"cells_raw":0,"read":"whole","date_system":"1900"}

{"sheet":"Caratula","index":0,"n_rows":29,"n_cols":3,"rows_kept":29,"cut":false,"hidden":false,"merged":[[28,2,28,8]]}
[]
[]
[]
[]
[]
[]
[]
[]
[]
[]
[]
[]
[]
[]
[]
[]
[]
[]
[]
[]
[]
[]
[]
[]
[]
[]
[]
[]
[null,null,"INFORME DE LOS ESTADOS FINANCIEROS INTERMEDIOS POR EL PERIODO FINALIZADO  EL 30 DE JUNIO DE 2020"]

{"sheet":"Indice","index":1,"n_rows":60,"n_cols":20,"rows_kept":60,"cut":false,"hidden":false,"merged":[]}
[]
[null,null,null,null,null,null,null,null,null,null,null,null,null,null,null,null,null,null,1,"Enero"]
[null,"Sociedad:","PASFIN S.A.E.C.A.",null,null,null,null,null,null,null,null,null,null,null,null,null,null,null,2,"Febrero"]
[null,null,null,null,null,null,null,null,null,null,null,null,null,null,null,null,null,null,3,"Marzo"]
[null,null,null,null,null,null,null,null,null,null,null,null,null,null,null,null,null,null,4,"Abril"]
["Fecha Presentación:","2020-06-30",null,null,null,null,null,null,null,null,null,null,null,null,null,null,null,null,5,"Mayo"]
[null,null,null,null,null,null,null,null,null,null,null,null,null,null,null,null,null,null,6,"Junio"]
[null,null,null,null,null,null,null,null,null,null,null,null,null,null,null,null,null,null,7,"Julio"]
[null,null,"INDICE","NOTA",null,null,null,null,null,null,null,null,null,null,null,null,null,null,8,"Agosto"]
[null,"Informacion General",null,null,null,null,null,null,null,null,null,null,null,null,null,null,null,null,9,"Septiembre"]
[null,null,"Descripción de la naturaleza y del negocio de la Sociedad","Nota 1",null,null,null,null,null,null,null,null,null,null,null,null,null,null,10,"Octubre"]
[null,null,"Resumen de las principales políticas contables","Nota 2",null,null,null,null,null,null,null,null,null,null,null,null,null,null,11,"Noviembre"]
[null,"Balance General",null,"BG",null,null,null,null,null,null,null,null,null,null,null,null,null,null,12,"Diciembre"]
[null,"Estado de Resultados ",null,"ER"]
[null,"Estado de Evolución del Patrimonio Neto",null,"EVPN "]
[null,"Estado de Flujos de Efectivo",null,"EFE"]
[null,null,"Efectivo y equivalente de efectivo","Nota 3"]
[null,null,"Inversiones temporales","Nota 4"]
[null,null,"Cartera de créditos","Nota 5"]
[null,null,"Otros créditos","Nota 6"]
[null,null,"Inventarios","Nota 7"]
[null,null,"Inversión en asociadas","Nota 8"]
[null,null,"Propiedades, planta y equipo","Nota 9"]
[null,null,"Activos disponibles para la venta","Nota 10"]
[null,null,"Activos intangibles","Nota 11"]
[null,null,"Goodwill","Nota 12"]
[null,null,"Cuentas por pagar comerciales","Nota 13"]
[null,null,"Préstamos a corto y largo plazo","Nota 14"]
[null,null,"Porción corriente de la deuda a largo plazo","Nota 15"]
[null,null,"Remuneraciones y cargas sociales a pagar","Nota 16"]
[null,null,"Impuestos a pagar","Nota 17"]
[null,null,"Provisiones","Nota 18"]
[null,null,"Otros pasivos","Nota 19"]
[null,null,"Capital integrado","Nota 20"]
[null,null,"Reserva de revalúo","Nota 21"]
[null,null,"Reserva legal","Nota 21"]
[null,null,"Reservas estatutarias","Nota 21"]
[null,null,"Reservas facultativas","Nota 21"]
[null,null,"Diferencia transitoria por conversión","Nota 22"]
[null,null,"Resultados acumulados","Nota 23"]
[null,null,"Interés minoritario","Nota 24"]
[null,null,"Ventas","Nota 25"]
[null,null,"Costo de ventas","Nota 26"]
[null,null,"Gastos de ventas","Nota 27"]
[null,null,"Gastos administrativos","Nota 27"]
[null,null,"Otros ingresos y gastos ","Nota 28"]
[null,null,"Ingresos financieros - neto","Nota 29"]
[null,null,"Gastos financieros - neto","Nota 29"]
[null,null,"Resultado de inversiones en asociadas","Nota 30"]
[null,null,"Resultado participación minoritaria","Nota 31"]
[null,null,"Impuesto a la renta","Nota 32"]
[null,null,"Resultado extraordinario neto de impuesto a la renta","Nota 33"]
[null,null,"Resultado sobre actividades discontinuadas neto de impuesto a la renta","Nota 34"]
[null,null,"Utilidad/(Pérdida) neta del año y por acción ordinaria","Nota 35"]
[null,"Otras Notas de los Estados Financieros"]
[null,null,"Activos gravados","Nota 36"]
[null,null,"Contingencias y compromisos","Nota 37"]
[null,null,"Impuesto diferido","Nota 38"]
[null,null,"Hechos posteriores","Nota 39"]
[null,null,"Saldos y transacciones con partes relacionadas","Nota 40"]

{"sheet":"BG","index":2,"n_rows":60,"n_cols":7,"rows_kept":60,"cut":false,"hidden":false,"merged":[[50,2,50,3],[5,1,5,6],[46,2,46,3],[65,5,65,6],[11,2,11,3],[12,2,12,3],[13,2,13,3],[14,2,14,3],[15,2,15,3],[25,2,25,3],[31,2,31,3],[33,2,33,3],[34,2,34,3],[35,2,35,3],[36,2,36,3],[55,2,55,3],[49,2,49,3],[48,2,48,3],[51,2,51,3],[3,0,3,6],[6,0,6,6],[64,5,64,6],[52,2,52,3],[54,2,54,3],[27,2,27,3],[23,2,23,3],[24,2,24,3],[20,2,20,3],[21,2,21,3],[22,2,22,3],[32,2,32,3],[4,0,4,6],[18,2,18,3],[47,2,47,3],[19,2,19,3],[70,5,70,6],[71,1,71,3],[9,1,9,3],[29,1,29,3],[44,1,44,3],[43,1,43,3],[56,1,56,3],[69,5,69,6],[28,1,28,3],[57,1,57,3],[37,2,37,3],[40,2,40,3],[41,2,41,3],[45,2,45,3]]}
[{"$f":"Indice!C3","v":"PASFIN S.A.E.C.A."},null,null,null,"Indice"]
[]
[]
["ESTADO DE SITUACION PATRIMONIAL"]
[{"$f":"IFERROR(IF(Indice!B6=\"\",\"Al dia... de mes… de año 2XX2…\",\"Al \"&DAY(Indice!B6)&\" de \"&VLOOKUP(MONTH(Indice!B6),Indice!S:T,2,0)&\" de \"&YEAR(Indice!B6)),\"Al dia... de mes… de año 2XX2…\")","v":"Al 30 de Junio de 2020"}]
[null,"Comparativo con el ejercicio anterior"]
["(Cifras expresadas en guaraníes)"]
[]
[null,null,null,null,"Nota","2020-06-01","2019-12-01"]
[null,"ACTIVOS"]
[null,"Activos Corrientes"]
[null,null,"Efectivo y equivalente de efectivo",null,3,{"$f":"'Nota 3'!C16","v":13282994665},{"$f":"'Nota 3'!D16","v":20886433456}]
[null,null,"Inversiones temporales",null,4,{"$f":"'Nota 4'!B14","v":6197454327},{"$f":"'Nota 4'!C14","v":45000000}]
[null,null,"Cartera de créditos",null,5,{"$f":"'Nota 5'!C15","v":236008322586},{"$f":"'Nota 5'!D15","v":296632593813}]
[null,null,"Otros créditos",null,6,{"$f":"'Nota 6'!B19","v":7515962072},{"$f":"'Nota 6'!C19","v":3121533672}]
[null,null,"Inventarios",null,7,{"$f":"'Nota 7'!B15","v":0},{"$f":"'Nota 7'!C15","v":0}]
[null,null,"Total activos corrientes",null,null,{"$f":"SUM(F12:F16)","v":263004733650},{"$f":"SUM(G12:G16)","v":320685560941}]
[null,"Activos no Corrientes"]
[null,null,"Inversiones temporales",null,4,{"$f":"'Nota 4'!B21","v":210000000},{"$f":"'Nota 4'!C21","v":320000000}]
[null,null,"Cartera de créditos",null,5,{"$f":"'Nota 5'!C27","v":104782909895},{"$f":"'Nota 5'!D27","v":51917623134}]
[null,null,"Otros créditos ",null,6,{"$f":"'Nota 6'!B25","v":38000000},{"$f":"'Nota 6'!C25","v":38000000}]
[null,null,"Inversión en asociadas",null,8,{"$f":"'Nota 8'!B8","v":150000000},{"$f":"'Nota 8'!C8","v":150000000}]
[null,null,"Propiedades, planta y equipo/Bienes de uso, neto",null,9,{"$f":"'Nota 9'!L17","v":1844806136},{"$f":"'Nota 9'!M17","v":1925854584}]
[null,null,"Activos disponibles para la venta",null,10,{"$f":"'Nota 10'!B11","v":22329040397},{"$f":"'Nota 10'!C11","v":21503939176}]
[null,null,"Activos intangibles",null,11,{"$f":"'Nota 11'!B10","v":3984476644},{"$f":"'Nota 11'!C10","v":4240927495}]
[null,null,"Goodwill",null,12,{"$f":"'Nota 12'!B11","v":0},{"$f":"'Nota 12'!C11","v":0}]
[null,null,"Activo por impuesto diferido",null,38,{"$f":"'Nota 38'!D34","v":2845737},{"$f":"'Nota 38'!F34","v":2845737}]
[null,null,"Total activos no corrientes",null,null,{"$f":"SUM(F19:F27)","v":133342078809},{"$f":"SUM(G19:G27)","v":80099190126}]
[null,"Total Activos",null,null,null,{"$f":"+F17+F28","v":396346812459},{"$f":"+G17+G28","v":400784751067}]
[null,"PASIVOS Y PATRIMONIO NETO"]
[null,"Pasivos corrientes",null,null,null,-1]
[null,null,"Cuentas por pagar comerciales",null,13,{"$f":"'Nota 13'!D11","v":752648764},{"$f":"'Nota 13'!E11","v":1605590749}]
[null,null,"Préstamos a corto plazo ",null,14,{"$f":"'Nota 14'!E125","v":108906193735},{"$f":"'Nota 14'!K125","v":114325411973}]
[null,null,"Porción corriente de la deuda a largo plazo",null,15,{"$f":"'Nota 15'!B14","v":0},{"$f":"'Nota 15'!C14","v":0}]
[null,null,"Remuneraciones y cargas sociales a pagar",null,16,{"$f":"'Nota 16'!B10","v":371023551},{"$f":"'Nota 16'!C10","v":64453412}]
[null,null,"Impuestos a pagar",null,17,{"$f":"'Nota 17'!B11","v":738898392},{"$f":"'Nota 17'!C11","v":811270137}]
[null,null,"Provisiones",null,18,{"$f":"'Nota 18'!B11","v":9497476},{"$f":"'Nota 18'!C11","v":0}]
[null,null,"Otros pasivos corrientes",null,19,{"$f":"'Nota 19'!B11","v":7011249267},{"$f":"'Nota 19'!C11","v":455986873}]
[null,null,"Total Pasivos Corrientes",null,null,{"$f":"+F32+F33+F34+F35+F36+F38+F37","v":117789511185},{"$f":"SUM(G32:G38)","v":117262713144}]
[null,"Pasivos no corrientes"]
[null,null,"Préstamos a largo plazo ",null,14,{"$f":"'Nota 14'!E186","v":160424466846},{"$f":"'Nota 14'!K186","v":162044149219}]
[null,null,"Otros pasivos  no corrientes",null,19,0,0]
[null,null,"Total pasivos no corrientes",null,null,{"$f":"SUM(F41:F42)","v":160424466846},{"$f":"SUM(G41:G42)","v":162044149219}]
[null,"Total Pasivos",null,null,null,{"$f":"+F39+F43","v":278213978031},{"$f":"+G39+G43","v":279306862363}]
[null,"Patrimonio Neto"]
[null,null,"Capital integrado",null,20,{"$f":"'Nota 20'!B13","v":107942000000},{"$f":"'Nota 20'!C13","v":98910000000}]
[null,null,"Adelanto irrevocable a cuenta de integración de capital",null,20,{"$f":"'Nota 20'!B10","v":10667945},{"$f":"'Nota 20'!C10","v":0}]
[null,null,"Reserva de revalúo",null,21,{"$f":"' Nota 21'!B8","v":383681070},{"$f":"' Nota 21'!C8","v":383681070}]
[null,null,"Reserva legal",null,21,{"$f":"' Nota 21'!B13","v":3782180262},{"$f":"' Nota 21'!C13","v":3782180262}]
[null,null,"Reservas estatutarias",null,21,0,0]
[null,null,"Reservas facultatitvas",null,21,{"$f":"' Nota 21'!B16","v":9409093934},{"$f":"' Nota 21'!C16","v":4100000000}]
[null,null,"Diferencia transitoria por conversión",null,22,{"$f":"'Nota 22'!B8","v":0},{"$f":"'Nota 22'!C8","v":0}]
[null,null,"Resultados acumulados",null,23,{"$f":"'Nota 23'!B8","v":4170698},{"$f":"'Nota 23'!C8","v":4170698}]
[null,null,"Resultado del ejercicio",null,23,{"$f":"'Nota 23'!B9","v":-3398959481},{"$f":"'Nota 23'!C9","v":14297856674}]
[null,null,"Subtotal",null,null,{"$f":"SUM(F46:F54)","v":118132834428},{"$f":"SUM(G46:G54)","v":121477888704}]
[null,null,"Interés minoritario",null,24,{"$f":"'Nota 24'!B8","v":0},{"$f":"'Nota 24'!C8","v":0}]
[null,"Total Patrimonio Neto",null,null,null,{"$f":"F55","v":118132834428},{"$f":"G55","v":121477888704}]
[null,"Total Pasivos y Patrimonio Neto",null,null,null,{"$f":"+F44+F57","v":396346812459},{"$f":"+G44+G57","v":400784751067}]
[]
[null,"Las notas que se acompañan forman parte integrante de estos estados financieros."]

{"sheet":"ER","index":3,"n_rows":31,"n_cols":4,"rows_kept":31,"cut":false,"hidden":false,"merged":[[42,2,42,3],[3,0,3,3],[4,0,4,3],[5,0,5,3],[6,0,6,3],[36,2,36,3]]}
[{"$f":"Indice!C3","v":"PASFIN S.A.E.C.A."},"Indice"]
[]
[]
["ESTADO DE RESULTADOS"]
[{"$f":"IFERROR(IF(Indice!B6=\"\",\"Al dia... de mes… de año 2XX2…\",\"Al \"&DAY(Indice!B6)&\" de \"&VLOOKUP(MONTH(Indice!B6),Indice!S:T,2,0)&\" de \"&YEAR(Indice!B6)),\"Al dia... de mes… de año 2XX2…\")","v":"Al 30 de Junio de 2020"}]
["Comparativo con igual período del año anterior"]
["(Cifras expresadas en guaraníes)"]
[]
[null,"Nota","2020-06-30","2019-06-30"]
["Ventas",25,{"$f":"'Nota 25'!B15","v":34871631602},{"$f":"'Nota 25'!C15","v":50639853034}]
["Costo de ventas",26,{"$f":"-'Nota 26'!B13","v":-21268563084},{"$f":"-'Nota 26'!C13","v":-19996904486}]
["Utilidad bruta",null,{"$f":"C10+C11","v":13603068518},{"$f":"D10+D11","v":30642948548}]
["Gastos de ventas",27,{"$f":"-'Nota 27'!B30","v":-746747491},{"$f":"-'Nota 27'!E30","v":-698722127}]
["Gastos administrativos ",27,{"$f":"-'Nota 27'!C30","v":-14471843894},{"$f":"-'Nota 27'!F30","v":-19366253286}]
["Resultado operativo",null,{"$f":"SUM(C12:C14)","v":-1615522867},{"$f":"SUM(D12:D14)","v":10577973135}]
["Otros ingresos",28,{"$f":"'Nota 28'!B14","v":15966505939},{"$f":"'Nota 28'!C14","v":14521462180}]
["Otros gastos",28,{"$f":"-'Nota 28'!B21","v":-16580803619},{"$f":"-'Nota 28'!C21","v":-11319510920}]
["Gastos financieros ",29,{"$f":"-'Nota 29'!B9","v":-1169138934},{"$f":"-'Nota 29'!C9","v":-849574714}]
["Resultado de inversiones en asociadas",30,{"$f":"'Nota 30'!B12","v":0},{"$f":"'Nota 30'!C12","v":0}]
["Resultados ordinarios antes de impuesto a la renta y participación minoritaria",null,{"$f":"SUM(C15:C19)","v":-3398959481},{"$f":"SUM(D15:D19)","v":12930349681}]
["Resultado participación minoritaria",31,{"$f":"'Nota 31'!B12","v":0},{"$f":"'Nota 31'!C12","v":0}]
["Resultado ordinario antes del impuesto a la renta",null,{"$f":"SUM(C20)","v":-3398959481},{"$f":"SUM(D20)","v":12930349681}]
["Impuesto a la renta",32,{"$f":"-'Nota 32'!B9","v":0},{"$f":"-'Nota 32'!C9","v":-1573623556}]
["Resultado neto de actividades ordinarias",null,{"$f":"C22+C23","v":-3398959481},{"$f":"D22+D23","v":11356726125}]
["Resultado extraordinario neto de impuesto a la renta",33,{"$f":"'Nota 33'!B10","v":0},{"$f":"'Nota 33'!C10","v":0}]
["Resultado sobre actividades discontinuadas neto de impuesto a la renta",34,{"$f":"'Nota 34'!B12","v":0},{"$f":"'Nota 34'!C12","v":0}]
["Utilidad/Pérdida neta del año ",null,{"$f":"C24+C25+C26","v":-3398959481},{"$f":"D24+D25+D26","v":11356726125}]
["Utilidad/Pérdida neta por acción ordinaria",35,{"$f":"'Nota 35'!B10","v":-81314.82011961723},{"$f":"'Nota 35'!C10","v":271731.01701201132}]
[]
[]
["Las notas que se acompañan forman parte integrante de estos estados financieros."]

{"sheet":"EVPN ","index":4,"n_rows":42,"n_cols":19,"rows_kept":42,"cut":false,"hidden":false,"merged":[[10,0,11,0],[10,2,11,2],[10,5,11,5],[10,7,11,7],[10,9,11,9],[4,5,4,9],[5,5,5,9],[6,5,6,9],[9,18,11,18],[3,5,3,9],[10,13,11,13],[10,15,11,15],[10,16,11,16],[9,7,9,9],[9,11,9,16],[9,2,9,5],[10,11,11,11],[10,3,11,3]]}
[{"$f":"Indice!C3","v":"PASFIN S.A.E.C.A."},null,null,null,null,null,null,"Indice"]
[]
[]
[null,null,null,null,null,"ESTADO DE EVOLUCIÓN DEL PATRIMONIO NETO"]
[null,null,null,null,null,"Al 30 de Junio de 2020"]
[null,null,null,null,null,"Comparativo con igual periodo del año anterior"]
[null,null,null,null,null,"(Cifras expresadas en guaraníes)"]
[]
[]
[null,null,"Aporte de los propietarios",null,null,null,null,"Reservas",null,null,null,"Ganancias reservadas",null,null,null,null,null,null,"Total"]
[null,null,"Capital suscripto e integrado","Aporte para aumento de capital",null,"Primas de emisión",null,"Reserva de revalúo",null,"Reserva de revalúo técnico",null,"Reserva legal",null,"Reserva facultativa",null,"Resultados acumulados","Resultados del ejercicio"]
[null,null,null,null,null,null,null,null,null,null,null,null,null,null,null,"Total","Total"]
[]
["Saldo al 31 de Diciembre 2018",null,77703000000,0,null,0,null,33918855,null,0,null,3029661490,null,0,null,4166188,23495638570,null,{"$f":"SUM(C14:R14)","v":104266385103}]
["Cambio en política contable ",null,0,0,null,0,null,0,null,0,null,0,null,0,null,0,0]
["Saldo reestructurado",null,{"$f":"SUM(C14:C15)","v":77703000000},0,null,{"$f":"SUM(F14:F15)","v":0},null,{"$f":"SUM(H14:H15)","v":33918855},null,{"$f":"SUM(J14:J15)","v":0},null,{"$f":"SUM(L14:L15)","v":3029661490},null,{"$f":"SUM(N14:N15)","v":0},null,{"$f":"SUM(P14:P15)","v":4166188},{"$f":"SUM(Q14:Q15)","v":23495638570},null,{"$f":"SUM(S14:S15)","v":104266385103}]
["Distribución de dividendos s/Acta de Asamblea Ordinaria ",null,0,0,null,0,null,0,null,0,null,0,null,0,null,-5052032438,0,null,{"$f":"SUM(C17:Q17)","v":-5052032438}]
["Transferencia a resultado acumulado",null,0,0,null,0,null,0,null,0,null,0,null,0,null,23495638570,-23495638570,null,{"$f":"SUM(C18:Q18)","v":0}]
["Integración del capital social",null,21049000000,0,null,0,null,0,null,0,null,0,null,0,null,-14091000000,0,null,6958000000]
["Reducción del capital social s/Acta de Asamblea General ",null,0,0,null,0,null,0,null,0,null,0,null,0,null,0,0,null,0]
["Impuesto por distribucion de utilidades",null,0,0,null,0,null,0,null,0,null,0,null,0,null,-252601622,0,null,-252601622]
["Revalúo de activos fijos",null,0,0,null,0,null,0,null,0,null,0,null,0,null,0,0,null,0]
["Revalúo técnico",null,0,0,null,0,null,0,null,0,null,0,null,0,null,0,0,null,0]
["Reserva facultativa",null,0,0,null,0,null,0,null,0,null,0,null,4100000000,null,-4100000000,null,null,0]
["Resultado del año",null,0,0,null,0,null,0,null,0,null,0,null,0,null,0,11356726125,null,11356726125]
[]
["Saldo al 30 de Junio de 2019",null,{"$f":"C16+C17+C19+C20+C22+C23+C25","v":98752000000},{"$f":"SUM(D14:D25)","v":0},null,{"$f":"F16+F17+F19+F20+F22+F23+F25","v":0},{"$f":"SUM(G14:G26)","v":0},{"$f":"H16+H17+H19+H20+H22+H23+H25","v":33918855},null,{"$f":"J16+J17+J19+J20+J22+J23+J25","v":0},null,{"$f":"L16+L17+L19+L20+L22+L23+L25","v":3029661490},null,{"$f":"N16+N17+N19+N20+N22+N23+N25+N24","v":4100000000},null,{"$f":"P16+P17+P19+P20+P22+P23+P25+P18+P21+P24","v":4170698},{"$f":"Q16+Q18+Q19+Q20+Q22+Q23+Q25","v":11356726125},null,{"$f":"S16+S17+S19+S20+S22+S23+S25+S21+S18+S24","v":117276477168}]
[]
["Saldo al 31 de Diciembre 2019",null,98910000000,0,null,0,null,383681070,null,0,null,3782180262,null,4100000000,null,4170698,14297856674,null,{"$f":"SUM(C29:R29)","v":121477888704}]
["Distribución de dividendos s/Acta de Asamblea General Ordinaria",null,0,0,null,0,null,0,null,0,null,0,null,0,null,0,0,null,{"$f":"SUM(C30:Q30)","v":0}]
["Transferencia a resultado acumulado",null,0,0,null,0,null,0,null,0,null,0,null,0,null,14297856674,-14297856674,null,{"$f":"SUM(C31:Q31)","v":0}]
["Integración de capital social",null,9032000000,0,null,0,null,0,null,0,null,0,null,0,null,-8988762740,0,null,43237260]
["Adelanto irrevocable a cuenta de integración de capital",null,0,10667945,null,0,null,0,null,0,null,0,null,0,null,0,0,null,10667945]
["Revalúo de activos fijos",null,0,0,null,0,null,0,null,0,null,0,null,0,null,0,0,null,0]
["Desafectación de la reserva de revalúo técnico",null,0,0,null,0,null,0,null,0,null,0,null,0,null,0,0,null,0]
["Reserva facultativa",null,0,0,null,0,null,0,null,0,null,0,null,5309093934,null,-5309093934,0,null,0]
["Resultado del año",null,0,0,null,0,null,0,null,0,null,0,null,0,null,0,-3398959481,null,-3398959481]
[]
["Saldo al 30 de Junio de 2020",null,{"$f":"C29+C30+C32+C34+C35+C37","v":107942000000},{"$f":"SUM(D27:D37)","v":10667945},null,{"$f":"F27+F30+F34+F35+F37","v":0},null,{"$f":"H29+H30+H34+H35+H37","v":383681070},null,{"$f":"J27+J30+J34+J35+J37","v":0},null,{"$f":"L29+L30+L34+L35+L37","v":3782180262},null,{"$f":"N29+N30+N34+N36+N37","v":9409093934},null,{"$f":"P29+P30+P31+P34+P35+P37+P32+P36","v":4170698},{"$f":"Q29+Q30+Q31+Q34+Q35+Q37","v":-3398959481},null,{"$f":"S29+S30+S34+S35+S37+S32+S33+S31+S36","v":118132834428}]
[]
[]
["Las notas que se acompañan forman parte integrante de estos estados financieros."]

{"sheet":"EFE","index":5,"n_rows":37,"n_cols":3,"rows_kept":37,"cut":false,"hidden":false,"merged":[[23,0,23,2],[12,0,12,2],[2,0,2,2],[4,0,4,2],[5,0,5,2],[6,0,6,2],[7,0,7,2]]}
[{"$f":"Indice!C3","v":"PASFIN S.A.E.C.A."},"Indice"]
[]
[]
[]
["ESTADO DE FLUJOS DE EFECTIVO"]
[{"$f":"IFERROR(IF(Indice!B6=\"\",\"Al dia... de mes… de año 2XX2…\",\"Al \"&DAY(Indice!B6)&\" de \"&VLOOKUP(MONTH(Indice!B6),Indice!S:T,2,0)&\" de \"&YEAR(Indice!B6)),\"Al dia... de mes… de año 2XX2…\")","v":"Al 30 de Junio de 2020"}]
["Comparativo con igual periodo del año anterior"]
["(Cifras expresadas en guaraníes)"]
[]
[]
[null,"2020-06-30","2019-06-30"]
[]
["FLUJO DE EFECTIVO DE ACTIVIDADES OPERATIVAS"]
["Cobranzas efectuadas a clientes",34871631602,50639853034]
["Financiación a clientes",7758984466,-29154825074]
["Pagos efectuados a proveedores y empleados",-19022121714,-21639041690]
["Pagos de impuesto a la renta",-735608861,-1321964597]
["Flujo neto de efectivo de actividades operativas",{"$f":"SUM(B14:B17)","v":22872885493},{"$f":"SUM(C14:C17)","v":-1475978327}]
[]
["FLUJO DE EFECTIVO DE ACTIVIDADES DE INVERSIÓN "]
["Adquisición de bienes de uso e intangibles",-439096205,-289008008]
["Flujo neto de efectivo de actividades de inversión",{"$f":"SUM(B21:B21)","v":-439096205},{"$f":"SUM(C21:C21)","v":-289008008}]
[]
["FLUJO DE EFECTIVO DE ACTIVIDADES DE FINANCIACIÓN"]
["(Disminución) Incremento de préstamos",-29685356608,1675700870]
["Aportes de capital recibidos",53905205,6958000000]
["Dividendos pagados",0,-5052032438]
["Gastos financieros",-1168360887,-3297047624]
["Flujo neto de efectivo de actividades de financiamiento",{"$f":"B25+B26+B28","v":-30799812290},{"$f":"C25+C26+C28+C27","v":284620808}]
[]
["(Disminución) Incremento neto de efectivo",{"$f":"B29+B22+B18","v":-8366023002},{"$f":"C29+C22+C18","v":-1480365527}]
["Efecto estimado de la diferencia de cambio sobre el saldo de efectivo",762584211,414920492]
["Efectivo al principio del año",20886433456,33970211933]
[]
["Efectivo al final del periodo",{"$f":"+SUM(B31:B33)","v":13282994665},{"$f":"+SUM(C31:C33)","v":32904766898}]
[]
["Las notas que se acompañan forman parte integrante de estos estados financieros."]

{"sheet":"Nota1","index":6,"n_rows":65,"n_cols":9,"rows_kept":65,"cut":false,"hidden":false,"merged":[[51,6,51,7],[52,6,52,7],[50,4,50,5],[52,4,52,5],[53,4,53,5],[53,6,53,7],[54,6,54,7],[56,6,56,7],[57,6,57,7],[58,6,58,7],[55,6,55,7],[55,4,55,5],[58,2,58,3],[59,2,59,3],[60,2,60,3],[64,6,64,7],[60,6,60,7],[59,6,59,7],[61,2,61,3],[61,4,61,5],[61,6,61,7],[62,2,62,3],[62,4,62,5],[62,6,62,7],[63,2,63,3],[63,4,63,5],[63,6,63,7],[51,2,51,3],[52,2,52,3],[64,2,64,3],[51,4,51,5],[56,4,56,5],[57,4,57,5],[58,4,58,5],[59,4,59,5],[60,4,60,5],[64,4,64,5],[53,2,53,3],[54,2,54,3],[55,2,55,3],[56,2,56,3],[57,2,57,3],[54,4,54,5],[43,1,43,8],[49,4,49,5],[49,6,49,7],[12,0,42,8],[49,0,50,1],[49,2,49,3],[50,2,50,3],[47,0,48,7],[50,6,50,7],[5,0,5,8],[8,9,8,11],[10,1,10,8],[9,1,9,8],[11,1,11,8]]}
[{"$f":"Indice!C3","v":"PASFIN S.A.E.C.A."},null,null,null,null,null,null,null,"BG"]
[]
[]
["NOTAS A LOS ESTADOS FINANCIEROS POR EL PERIODO FINALIZADO EL 30 DE JUNIO DE 2020"]
["Balance General: Correspondiente al periodo finalizado el 30 de junio de 2020, presentado en forma comparativa con el ejercicio finalizado el 31 de diciembre de 2019"]
["Estado de Resultados: Correspondiente al periodo finalizado el 30 de junio de 2020, presentado en forma comparativa con el periodo finalizado el 30 de junio de 2019"]
[]
[]
["NOTA 1 – DESCRIPCIÓN DE LA NATURALEZA Y DEL NEGOCIO DE LA COMPAÑÍA"]
["Denominación:","PASFIN S.A.E.C.A."]
["Domicilio Legal:","Avda. Santa Teresa N° 2106 e/ Aviadores del Chaco y Herminio Maldonado. Torres del Paseo - Torre 1 piso 1. Asunción - Paraguay"]
["Actividad Principal:","Otorgar anticipos sobre créditos provenientes de ventas a plazo, asumir sus riesgos, mediante la compra de facturas, créditos, hipotecas, bonos, valores y documentos en general, realizar descuentos de facturas; gestionar su cobro y prestar asistencia técnica administrativa. Así también podrá dar préstamos en moneda nacional y/o extranjera con o sin intereses, financiamiento en general de toda clase de créditos con cualquiera de las seguridades previstas por la legislación, con o sin garantía."]
["La entidad fue constituida bajo la forma jurídica de Sociedad Anónima con la denominación de Acciona S.A., según Escritura Pública Nº 45 de fecha 06 de abril del año 2010. En el año 2011 fue modificada con la denominación de PASFIN S.A. según Escritura Publica Nº 40 de fecha 06 de mayo de 2011 fijando domicilio legal en la ciudad de Asunción, Capital del Paraguay. En dicho acto se establece la primera integración de Capital de la S.A. que se realiza de la siguiente manera: a) Con el Capital de Acciona S.A. que posee conforme al Balance General al 31 de Diciembre de 2010, un Capital de Gs. 100.000.000 (Guaraníes cien millones) que fue integrado en su totalidad. \nEl plazo de duración de la Entidad  fue establecida en noventa y nueve (99) años y tiene por Objeto ejecutar por cuenta propia y/o terceros, toda clase de actividades comerciales, industriales, mercantiles, de importación, exportación, compra-venta y comercialización de mercaderías y productos, representaciones, comisiones, consignaciones y mandatos comerciales, servicios en general y cualquier acto y operación comercial o civil lícito que se relacione directamente o indirectamente con sus actividades sociales. Según Escritura Pública Nº 45 de fecha  06 de Abril del año 2010, queda formalizada la emisión de 100 Acciones, cada serie de acciones consta de cien (100) acciones de Guaraníes un millón (Gs.1.000.000) y el valor de cada serie emitida es de Guaraníes cincuenta millones (Gs. 50.000.000) que hacen un total de cien millones de guaraníes (Gs. 100.000.000).\nSegún Escritura Pública Nº 40 de fecha 06 del mes de Mayo de 2011, se modifica el Artículo 5º y queda autorizado el aumento de Capital Social a la suma de Mil Millones de Guaraníes (Gs. 1.000.000.000) representado por 1000 acciones nominativas o al portador con derecho a un voto por acción, numeradas del uno al mil con un valor nominal de un millón de guaraníes (Gs. 1.000.000) cada una y distribuidas en 20 series. \nMediante Escritura Publica Nº 142, de fecha 25 de Julio de 2014, a través del cual fue aumentado el Capital Social y modificada la denominación Social y el Estatuto Social, quedando con la denominación de Pasfin S.A.E.C.A, queda autorizado el aumento del Capital social a la suma de  Gs. 6.000.000.000 (guaraníes seis mil millones), representado por 2000 acciones Ordinarias de Voto Múltiple, con derecho a 5 votos por acción, 2.000 acciones Ordinarias de Voto simple, con un voto por acción y 2.000 acciones Preferidas, sin derecho a voto. Las mismas serán agrupadas en series de Guaraníes Cien Millones (Gs. 100.000.000). Cada serie estará compuesta de cien (100) Acciones. \nEl Capital Social autorizado queda fijado en la suma de seis mil millones de Guaraníes (Gs. 6.000.000.000) y el primer Directorio queda constituido de la siguiente forma: Presidente: Luis Augusto Montanaro Bedoya; Vicepresidente: Alejandro Omar Codas Laterza; Director Titular: Marcelo Campuzano Yaluk; Síndico Titular: Abg. Guillermo Ehrecke; Síndico Suplente: José Santiviago.\nSegún Escritura Pública Nº 55, de fecha 12 de agosto de 2016 se modifica el Artículo 4º del Objeto Social con el fin de adecuarlo a las necesidades de la compañía, queda autorizado el aumento del Capital Social a Gs 50.000.000.000 (guaraníes cincuenta mil millones) representada por 15.000 Acciones Ordinarias de voto múltiple, 15.000 Acciones Ordinarias de voto simple, 2000 Acciones preferidas clase A, 6.000 Acciones preferidas clase B y 12.000 Acciones preferidas clase C.-  \nSegún Acta de Asamblea General Extraordinaria N° 14/17 de fecha 25/04/17 se aprueba la modificación de los Estatutos Sociales y el aumento del Capital Social a G. 55.000.000.000 (guaraníes cincuenta y cinco mil millones) formalizado por Escritura N° 25 de fecha 2 de marzo de 2018, inscripta en el Registro Público de Comercio bajo el N° 004, Folio 48-60, de fecha 13 de abril de 2018.\nModificación de los Estatutos Sociales, aprobada por Acta de Asamblea General Extraordinaria N° 22/18 de fecha 19/04/18 por la cual se establece el aumento del Capital Social a G. 100.000.000.000 (guaraníes cien mil millones) según Escritura N° 19 de fecha 13/07/2018 Inscripta en el Registro Público de Comercio bajo el N° 05 folio 61 y siguiente de fecha 17/08/2018.                                                                                                                                                                                                                                                                                                                                          Por Escritura Pública N° 4 de fecha 15/02/19 se realizó la transcripción del Acta de Asamblea Extraordinaria N° 17/2019 de fecha 23/01/19, Modificación de Estatuto Social y Emisión de Acciones, aumentado el capital social a Gs. 250.000.000.000 (guaraníes doscientos cincuenta mil millones) inscripta en el Registro Público de Comercio bajo el N° 06 folio 76-87 de fecha 11/04/19\nLa entidad cierra su año económico el 31 de diciembre. "]
[]
[]
[]
[]
[]
[]
[]
[]
[]
[]
[]
[]
[]
[]
[]
[]
[]
[]
[]
[]
[]
[]
[]
[]
[]
[]
[]
[]
[]
[]
["Inscripción en la Comisión Nacional de Valores:","Inscripta y reconocida como S.A.E.C.A. por Resolución N° 45 E/15. Acta de Directorio N° 53 de fecha 25/08/2015 de la Comisión Nacional de Valores"]
[]
[]
[]
["COMPOSICION DEL CAPITAL"]
[]
["Capital Social Gs.",null,"Capital Emitido",null,"Capital Suscripto",null,"Capital Integrado"]
[null,null,"en Gs.",null," en Gs.",null,"en Gs."]
["Total ",250000000000,250000000000,null,107942000000,null,107942000000]
["Acciones Ordinarias de Votos Múltiples",50000000000,50000000000,null,19906000000,null,19906000000]
["Acciones Ordinarias Simples ",50000000000,50000000000,null,21894000000,null,21894000000]
["Acciones Preferidas Clase A ",2000000000,2000000000,null,2000000000,null,2000000000]
["Acciones Preferidas Clase B",6000000000,6000000000,null,6000000000,null,6000000000]
["Acciones Preferidas Clase C",12000000000,12000000000,null,12000000000,null,12000000000]
["Acciones Preferidas Clase D",1000000000,1000000000,null,1000000000,null,1000000000]
["Acciones Preferidas Clase E",4000000000,4000000000,null,4000000000,null,4000000000]
["Acciones Preferidas Clase F",25000000000,25000000000,null,25000000000,null,25000000000]
["Acciones Preferidas Clase G",15000000000,15000000000,null,11684000000,null,11684000000]
["Acciones Preferidas Clase H",3000000000,3000000000,null,2977000000,null,2977000000]
["Acciones Preferidas Clase I",1100000000,1100000000,null,1081000000,null,1081000000]
["Acciones Preferidas Clase J",400000000,400000000,null,400000000,null,400000000]
["Acciones Preferidas sin características",80500000000,80500000000,null,"-",null,"-"]

{"sheet":"Nota 2","index":7,"n_rows":87,"n_cols":15,"rows_kept":87,"cut":false,"hidden":false,"merged":[[67,9,67,10],[68,9,68,10],[69,9,69,10],[67,0,67,8],[51,1,51,2],[52,1,52,2],[53,1,53,2],[59,0,59,8],[56,0,56,8],[62,0,62,8],[73,9,73,10],[74,9,74,10],[74,0,74,8],[72,0,72,8],[68,0,68,8],[69,0,69,8],[73,0,73,8],[70,0,70,8],[72,9,72,10],[104,5,104,13],[78,9,78,10],[79,9,79,10],[5,0,5,8],[8,0,8,8],[14,0,14,8],[13,0,13,8],[35,0,35,8],[36,0,36,8],[33,0,33,8],[11,0,11,8],[12,0,12,8],[26,0,26,8],[29,2,29,3],[29,6,29,7],[65,0,65,8],[46,1,46,2],[87,0,87,8],[79,0,79,8],[76,0,76,8],[80,0,80,8],[77,0,77,8],[86,0,86,8],[81,0,81,8],[82,0,82,8],[83,0,83,8],[84,0,84,8],[47,1,47,2],[48,1,48,2],[49,1,49,2],[50,1,50,2],[7,0,7,8],[3,0,3,8],[40,0,40,8],[64,0,64,8],[10,0,10,8],[9,0,9,8],[6,0,6,8],[34,0,34,8],[37,0,37,8],[38,0,38,8],[24,0,24,8],[41,0,41,8],[43,0,43,8],[44,0,44,8],[42,0,42,8],[45,1,45,4]]}
[{"$f":"Indice!C3","v":"PASFIN S.A.E.C.A."},null,null,null,null,null,null,null,"BG"]
[]
[]
["NOTA 2 - RESUMEN DE LAS PRINCIPALES POLÍTICAS CONTABLES"]
[]
["a.   Bases de preparación de los Estados Financieros"]
["Los estados financieros se han preparado siguiendo los criterios de las Normas de Información Financiera (NIF) emitidas por el Consejo de Contadores Públicos del Paraguay sobre la base de costos históricos, excepto para el caso de activos y pasivos en moneda extranjera  y las propiedades, planta y equipo según se explica en los puntos c ) y k), y no reconocen en forma integral los efectos de la inflación sobre la situación patrimonial y financiera de la sociedad, sobre los resultados de sus operaciones y los flujos de efectivo, en atención a que la corrección monetaria no constituye una práctica contable obligatoria en el Paraguay. \n"]
["Algunas cifras correspondientes al año terminado el 31 de diciembre de 2019 fueron reclasificadas en los presentes estados financieros con el fin de facilitar su comparación."]
[]
["b.   Uso de estimaciones contables"]
["La preparación de los presentes estados financieros requiere que la Gerencia de la sociedad realice estimaciones y evaluaciones que afectan el monto de los activos y pasivos registrados y contingentes, como así también los ingresos y egresos registrados en el ejercicio.  Los resultados reales futuros pueden diferir de las estimaciones y evaluaciones realizadas a la fecha de preparación de los presentes estados financieros."]
[]
["c.   Moneda extranjera"]
["Los activos y pasivos en moneda extranjera se valúan a la cotización vigente al cierre de los estados financieros conforme a la publicación efectuada por la Administración Tributaria."]
["Las diferencias de cambio originadas por fluctuaciones en los tipos de cambio producidos entre las fechas de concertación de las operaciones y su liquidación o valuación al cierre del ejercicio, son reconocidas en resultados."]
[]
[null,null,"2020-06-30",null,null,null,"2019-12-01"]
[null,"Indicar moneda","Simbología según ISO 4217","G.",null,"Indicar moneda","Simbología según ISO 4217","G."]
["Activos","Dólares Americanos","USD",119649494203.47139,null,"Dólares Americanos","USD",126185354844.69542]
[]
["Pasivos","Dólares Americanos","USD",-94008017708,null,"Dólares Americanos","USD",-100273300017]
[]
["Posición neta",null,null,{"$f":"+D19+D21","v":25641476495.47139},null,null,null,{"$f":"+H19+H21","v":25912054827.695419}]
[]
["A la fecha de emisión de estos estados financieros, el tipo de cambio de la moneda extranjera Dólares Americanos varió en un 5% con respecto al vigente al 31 de diciembre de 2019.",null,null,null,null,null,null,null,null,null,null,"TC al 31/12/19","tc al 30/06/2020","Variacion","%"]
[null,null,null,null,null,null,null,null,null,null,"c",6442.33,6793.79,{"$f":"M26-L26","v":351.46000000000004},{"$f":"+N26/L26","v":5.4554796168467007E-2}]
["El detalle de las cotizaciones de la moneda extranjera operada por la sociedad es el siguiente:",null,null,null,null,null,null,null,null,null,"v",6463.95,6820.47,{"$f":"+M27-L27","v":356.52000000000044},{"$f":"+N27/L27","v":5.5155129603415939E-2}]
[]
[null,null,"2020-06-30",null,null,null,"2019-12-01"]
[null,null,"Cotización en Gs.",null,null,null,"Cotización en Gs."]
[null,"Indicar moneda","Compra","Venta",null,"Indicar moneda","Compra","Venta"]
[null,"Dólares Americanos",6793.79,6820.47,null,"Dólares Americanos",6442.33,6463.95]
[]
["d.   Efectivo y equivalentes de efectivo"]
["Se considerarán dentro del concepto de efectivo los saldos en efectivo, disponibilidades en cuentas bancarias y toda inversión de muy alta liquidez, con vencimiento originalmente pactado no superior a tres meses."]
[]
["e.   Inversiones"]
["Las inversiones temporales se valúan de acuerdo a los siguientes criterios de valuación:\n Colocaciones financieras en moneda local: a su valor nominal más los intereses devengados al cierre del año/período. Ver Nota 4\n Colocaciones financieras en moneda extranjera: a su valor de cotización al cierre del año/período más intereses devengados a ese momento. Ver Nota 4\n Las inversiones no corrientes en sociedades donde no se ejerce el control, se valúan a su valor patrimonial proporcional. Ver Nota 8\n"]
["Observación: En caso de la existencia de saldos y transacciones con partes relacionadas, la información que corresponda a ser expuesta por la sociedad, se ajustará  a lo requerido por la Norma de Información Financiera N° 7 Revelaciones de partes relacionadas."]
[]
["f. Previsión para cuentas de dudoso cobro/incobrables"]
["Las previsiones para cuentas de dudoso cobro se determinan mensualmente sobre la base del estudio de la cartera de créditos realizado con el objeto de determinar la porción no recuperable de las cuentas a cobrar. La entidad se rige por la siguiente política de constitución de previsiones:  "]
["Política de previsiones vigente al cierre de los estados financieros:"]
["La sociedad constituirá dos tipos de previsiones, primeramente, las previsiones por tramo las cuales estarán ligadas a los días de mora de la operación o a su clasificación RRR. Segundo, las previsiones genéricas. "]
["Las previsiones son calculados sobre la totalidad del saldo de la operación y no así de la cuota vencida. "]
[null,"TABLA DE PREVISIONES"]
[null,"PREVISIÓN",null,"% DE PREVISIÓN","CATEGORÍA CLIENTE"]
[null,"de 1 - 30 días de mora ",null,"0.5%","1a"]
[null,"de 31 - 60 días de mora. ",null,1.4999999999999999E-2,"1b"]
[null,"De 61 a 90 días de mora ",null,0.05,2]
[null,"de 91 - 120 días de mora. ",null,0.25,3]
[null,"de 121 - 180 días de mora. ",null,0.5,4]
[null,"de 181 - 270 días de mora. ",null,0.75,5]
[null,"superiores a 271 días de mora ",null,1,6]
[]
["Previsiones por tramo "]
["Operaciones RRR: Las operaciones RRR se previsionarán según la categoría crediticia del cliente."]
[]
["Previsiones genéricas"]
["Se constituirán adicionalmente previsiones genéricas las cuales deberán representar al menos 2,5% de la cartera vigente no debiendo superar el 15% de la cartera total. "]
[]
["Previsiones subjetivas "]
["Cuando existan operaciones reclasificadas por motivos subjetivos, se previsionarán según la categoría crediticia del cliente definida en la tabla de previsiones."]
[]
["g. Activos disponibles para la venta"]
["Los activos disponibles para la venta representan bienes muebles o inmuebles recibidos en recuperación de créditos designados para la venta. Los mismos se valúan, sin amortizar, al menor valor entre el valor del crédito recuperado y el valor de mercado de los mismos. "]
[]
["h. Propiedades, planta y equipo"]
["Las propiedades, planta y equipo se exponen a su costo histórico ajustado por el coeficiente de revalúo emitido por la Administración Tributaria, menos la correspondiente depreciación acumulada. El incremento neto por la re-expresión se acredita a la respectiva reserva patrimonial, cuyo saldo puede ser utilizado únicamente para  aumentar el capital."]
["El costo de las mejoras que extienden la vida útil de los bienes o aumentan su capacidad productiva es imputado a las cuentas respectivas del activo. Los gastos de mantenimiento son cargados a resultados."]
["La depreciación es calculada por el método de línea recta conforme a la vida útil definida por la Administración Tributaria."]
[]
["i. Intangibles"]
["Los intangibles se exponen a su costo incurrido menos las correspondientes amortizaciones acumuladas al cierre del año."]
["Las amortizaciones son calculadas por el método de línea recta y son reconocidas en los resultados del año. "]
[]
["j. Reconocimiento de ingresos y egresos"]
["Los ingresos y egresos son reconocidos en función de su devengamiento."]
[]
["k. Impuesto a la renta"]
["El impuesto a la renta que se carga a los resultados del año se basa en la utilidad contable antes de este concepto, ajustada por las partidas que la ley incluye o excluye para la determinación de la utilidad gravable a la que se aplica la tasa legal vigente del 10% del impuesto y por el reconocimiento del cargo o el ingreso originado por la aplicación del impuesto diferido, si los hubiere. "]
["De acuerdo a la Ley 6380/19 la distribución de dividendos y utilidades está sujeta a una retención del 8% en concepto del Impuesto a los Dividendos y a las Utilidades (IDU) a personas físicas o jurídicas domiciliadas en el país, mientras que la tasa será del 15% cuando se tratase de no domiciliados. Excepcionalmente durante el presente año las ganancias acumuladas generadas en ejercicios anteriores y que no fueron capitalizadas ni distribuidas, podrán ser distribuidas y abonar sobre el monto determinado una tasa única y extraordinaria del 5% cuando sus socios y accionistas residan en el país y del 10% en caso de residentes en el exterior."]
["El impuesto diferido es calculado utilizando el método del estado de situación basado en el balance general, determinado a partir de las diferencias temporarias entre los importes contables de activos y pasivos y los importes utilizados para fines fiscales. El importe de impuesto diferido calculado está basado en la forma esperada de realización o liquidación de los importes contables de activos y pasivos, utilizando la tasa de impuesto aprobada a la fecha de los estados financieros."]
["Un activo por impuesto diferido es reconocido solamente hasta el importe que es probable que futuras ganancias imponibles estarán disponibles, contra cuyos respectivos impuestos, el activo pueda ser utilizado."]
[]
[]
["Observación: Cambios en políticas contables y su efecto sobre los estados financieros, como así también las modificaciones o ajustes de la información de ejercicios anteriores deben exponerse conforme a lo requerido por la Norma de Información Financiera N° 6 Utilidad o pérdida neta por el período, errores fundamentales y cambios en políticas contables"]

{"sheet":"Nota 3","index":8,"n_rows":16,"n_cols":5,"rows_kept":16,"cut":false,"hidden":false,"merged":[]}
["PASFIN S.A.E.C.A.",null,null,null,"BG"]
[]
[]
["NOTA 3 - EFECTIVO Y EQUIVALENTE DE EFECTIVO"]
["(Cifras expresadas en guaraníes)"]
["La composición de la cuenta es la siguiente:"]
[]
["Concepto",null,"2020-06-01","2019-12-01"]
["Financieras Locales - Moneda local Guaraníes",null,5009292967,15632861623]
["Bancos Locales - Moneda extranjera Dólares",null,4971218802,397648569]
["Bancos Locales - Moneda local Guaraníes",null,2851625235,1158376918]
["Caja - Moneda extranjera Dólares",null,316230543,397472434]
["Financieras Locales - Moneda extranjera Dólares",null,117170118,3249041412]
["Caja - Moneda local Guaraníes",null,13479500,51032500]
["Recaudaciones a depositar - Moneda local Guaraníes",null,3977500,0]
["Total",null,{"$f":"SUM($C$9:C15)","v":13282994665},{"$f":"SUM($D$9:D15)","v":20886433456}]

{"sheet":"Nota 4","index":9,"n_rows":21,"n_cols":4,"rows_kept":21,"cut":false,"hidden":false,"merged":[[3,0,3,2],[4,0,4,1],[17,1,17,2]]}
[{"$f":"Indice!C3","v":"PASFIN S.A.E.C.A."},null,null,"BG"]
[]
[]
["NOTA 4 - INVERSIONES TEMPORALES"]
["(Cifras expresadas en guaraníes)"]
["La composición de la cuenta es la siguiente:"]
[]
["Corriente"]
[]
["Concepto","2020-06-30","2019-12-01"]
["Inversiones en Mercado Bursatil Local - Moneda Local Guaraníes",6041877127,0]
["Inversiones en Titulos del Sistema Financiero Local - Moneda Local Guaraníes",155000000,45000000]
["Inversiones en Mercado Bursatil Local - Moneda Extranjera Dólares",577200,0]
["Total",{"$f":"SUM($B$11:B13)","v":6197454327},{"$f":"SUM($C$11:C13)","v":45000000}]
[]
[]
["No corriente"]
[]
["Concepto","2020-06-30","2019-12-31"]
["Inversiones en Titulos del Sistema Financiero Local - Moneda Local Guaraníes ",210000000,320000000]
["Total",210000000,320000000]

{"sheet":"Nota 5","index":10,"n_rows":28,"n_cols":9,"rows_kept":28,"cut":false,"hidden":false,"merged":[[4,0,4,1],[4,5,4,8],[24,6,24,8],[25,6,25,8],[27,6,27,8],[8,2,8,3],[18,2,18,3],[6,5,7,5],[6,6,7,6],[6,7,6,8],[5,5,5,8],[23,5,23,8],[22,5,22,8],[26,6,26,8]]}
[{"$f":"Indice!C3","v":"PASFIN S.A.E.C.A."},null,null,null,null,"BG"]
[]
[]
["NOTA  5 – CARTERA DE CRÉDITOS"]
["(Cifras expresadas en guaraníes)",null,null,null,null,"ANEXO C"]
[null,null,null,null,null,"COMPOSICION DE LA CARTERA DE CRÉDITOS AL 30/06/2020"]
["Corriente",null,null,null,null,"SITUACION","MONTO EN G.","PREVISIONES"]
["La cartera de créditos a corto plazo se integra como sigue:",null,null,null,null,null,null,"IMPORTE EN G.","% PREVISIONES S/ CARTERA"]
[null,null,null,null,null,"A. Total Cartera no Vencida",263734405695,8255233609,3.1300000000000001E-2]
["Concepto",null,"2020-06-30","2019-12-31",null,"B. Total Cartera Vencida",127707678086,42395617691,0.33200000000000002]
["Deudores por ventas locales","Moneda Local Guaraníes",176841803028.97861,219374944052,null,"Composición Cartera Vencida"]
["Deudores por ventas locales","Moneda Extranjera Dólares",86076016624.021393,103618178542,null,"Normal",57673696400,4180244173,7.2499999999999995E-2]
["Menos: Intereses a Vencer",null,-18028726804,-8499918039,null,"En Gestión de Cobro A",43443454984,13596445985,0.313]
["Menos: Previsiones",null,-8880770263,-17860610742,null,"En Gestión de Cobro B",3302460594,1330861425,0.40300000000000002]
["Total",null,{"$f":"+SUM($C$11:C14)","v":236008322586},{"$f":"+SUM($D$11:D14)","v":296632593813},null,"En Gestión de Cobro Judicial",23288066108,23288066108,1]
[]
["No Corriente",null,null,null,null,"TOTAL DE LA CARTERA DE CREDITOS (A+B)",{"$f":"G9+G10","v":391442083781}]
["Las cartera de créditos a largo plazo se integra como sigue:"]
[null,null,null,null,null,"(-) TOTAL DE PREVISIONES",{"$f":"-H9-H10","v":-50650851300}]
["Concepto",null,"2020-06-30","2019-12-31"]
["Deudores por ventas locales","Moneda Local Guaraníes",119053806327.55,85777534899,null,"TOTAL  NETO DE LA CARTERA DE CRÉDITOS",{"$f":"G17+G19","v":340791232481}]
["Deudores por ventas locales","Moneda Extranjera Dólares",26902035993.450001,17346074412]
["Deudores en gestión judicial","Moneda Local Guaraníes",22108554241,6411554381.3788004,null,"OBSERVACIONES"]
["Deudores en gestión judicial","Moneda Extranjera Dólares",1179511867,88528179.621199995,null,"CRITERIOS DE CLASIFICACION UTILIZADOS"]
["Menos: Intereses a vencer",null,-22690917497,-31928991160,null,"Normal","De 1 a 90 días de atraso"]
["Menos Previsiones",null,-41770081037,-25777077578,null,"En Gestión de Cobro A","De 91 a 270 días de atraso"]
["Total",null,{"$f":"+SUM($C$21:C26)","v":104782909895},{"$f":"+SUM($D$21:D26)","v":51917623134},null,"En Gestión de Cobro B","Superiores a 270 días de atraso"]
[null,null,null,null,null,"En Gestión de Cobro Judicial","Superiores a 270 días de atraso judicializados"]

{"sheet":"Nota 6","index":11,"n_rows":25,"n_cols":4,"rows_kept":25,"cut":false,"hidden":false,"merged":[[4,0,4,1]]}
[{"$f":"Indice!C3","v":"PASFIN S.A.E.C.A."},null,null,"BG"]
[]
[]
["NOTA 6 - OTROS CRÉDITOS"]
["(Cifras expresadas en guaraníes)"]
["El rubro de otros créditos se compone como sigue:"]
[]
["Corriente"]
[]
["Concepto","2020-06-30","2019-12-31"]
["Cheques en garantía redescontados",4409927761,0]
["Cargos Diferidos",1250000002,0]
["Anticipo Impuesto a la Renta",735608861,735608861]
["Deudores varios",538584150,1463085597]
["Cheques Diferidos",400000000,761058250]
["Anticipos a proveedores",107093938,90599420]
["Garantía de Alquiler",59255436,56190003]
["Gastos pagados por adelantado",15491924,14991541]
["Total",{"$f":"SUM(B11:B18)","v":7515962072},{"$f":"SUM(C11:C18)","v":3121533672}]
[]
["No corriente"]
[]
["Concepto","2020-06-30","2019-12-31"]
["Fondo de Garantia Procard",38000000,38000000]
["Total",{"$f":"SUM(B24)","v":38000000},{"$f":"SUM(C24)","v":38000000}]

{"sheet":"Nota 7","index":12,"n_rows":15,"n_cols":4,"rows_kept":15,"cut":false,"hidden":false,"merged":[[6,1,6,2],[5,0,5,6],[3,0,3,2],[4,0,4,1]]}
[{"$f":"Indice!C3","v":"PASFIN S.A.E.C.A."},null,null,"BG"]
[]
[]
["NOTA 7 – INVENTARIOS"]
["(Cifras expresadas en guaraníes)"]
["Los bienes de cambio están compuestos de la siguiente manera:"]
[]
["Concepto","2020-06-30","2019-12-31"]
["Mercaderías"]
["Productos terminados"]
["Productos en proceso"]
["Materia prima"]
["(nuevas cuentas a incluir)"]
["(-) Previsión para desvalorización y deterioro de inventario"]
["Total ",{"$f":"SUM(B9:B12)","v":0},{"$f":"SUM(C9:C12)","v":0}]

{"sheet":"Nota 8","index":13,"n_rows":21,"n_cols":7,"rows_kept":21,"cut":false,"hidden":false,"merged":[[3,0,3,5],[11,3,11,4],[13,0,14,0],[13,1,14,1],[11,5,11,6],[13,3,14,3],[13,4,14,4],[13,5,14,5],[13,6,14,6],[11,0,12,0],[11,1,12,1],[11,2,12,2]]}
[{"$f":"Indice!C3","v":"PASFIN S.A.E.C.A."},null,null,"BG"]
[]
[]
["Nota 8 - INVERSIONES EN ASOCIADAS"]
["(Cifras expresadas en guaraníes)"]
["Las inversiones en sociedades donde no se ejerce control se describen a continuación"]
["Periodo","2020-06-30","2019-12-01"]
["Total Inversión",150000000,150000000]
[]
["a) Datos sobre la sociedad:"]
[]
["Nombre de Sociedad","RUC","Cantidad de acciones","Al 30/06/2020",null,"Al 31/12/2019"]
[null,null,null,"Total Patrimonio neto","Total del resultado","Total Patrimonio neto","Total del resultado"]
["Buró de Información Comercial S.A. (BIC S.A.)","80090066-9","2.500 acciones serie A",3394561122,214230041,3119055816,228809924]
[null,null,"1.630 acciones serie B"]
[]
[]
["b) Datos sobre la inversión:"]
[]
["Cantidad de acciones","Participación sobre los votos (%)","Total Inversión (en G.)","Participación sobre el Patrimonio Neto al 30/06/2020 (%)","Total valuación patrimonial proporcional al 30/06/2020","Resultado sobre inversiones al 30/06/2020"]
[150,3.8899999999999997E-2,150000000,{"$f":"C21/D14","v":4.4188333810770607E-2},{"$f":"D21*D14","v":150000000},{"$f":"E14*D21","v":9466468.5640030727}]

{"sheet":"Nota 9","index":14,"n_rows":24,"n_cols":13,"rows_kept":24,"cut":false,"hidden":false,"merged":[[3,0,3,12],[6,11,6,12],[6,10,7,10],[6,9,7,9],[6,8,7,8],[6,7,7,7],[6,6,7,6],[6,5,7,5],[6,4,7,4],[6,3,7,3],[6,2,7,2],[6,1,7,1],[6,0,7,0]]}
[{"$f":"Indice!C3","v":"PASFIN S.A.E.C.A."},null,"BG"]
[]
[]
["NOTA 9 - PROPIEDADES, PLANTA Y EQUIPO - NETO"]
["(Cifras expresadas en guaraníes)",null,null,null,null,null,null,null,null,-1]
[]
["Rubro","Costo histórico revaluado al inicio del año","Adquisiciones","Bajas","Revalúo del año","Valor de origen revaluado al final del año","Depreciación acumulada revaluada al inicio del año","Depreciación del año","Bajas de depreciaciones acumuladas","Revalúo depreciación acumulada del año","Depreciación acumulada revaluada al final del año","Valor neto contable"]
[null,null,null,null,null,null,null,null,null,null,null,"2020-06-30","2019-12-31"]
["Muebles y útiles",638418703,{"$f":"32740910+47003426","v":79744336},0,0,{"$f":"B9+C9-D9+E9","v":718163039},-66223300,-30467203,0,0,{"$f":"+G9+H9+I9+J9","v":-96690503},{"$f":"+F9+K9","v":621472536},572195403]
["Equipos informáticos",526766027,{"$f":"31676363+3318182","v":34994545},0,0,{"$f":"B10+C10-D10+E10","v":561760572},-229651102,-47925436,0,0,{"$f":"+G10+H10+I10+J10","v":-277576538},{"$f":"+F10+K10","v":284184034},297114925]
["Rodados",163619629,0,0,0,{"$f":"B11+C11-D11+E11","v":163619629},-73504974,-9987581,0,0,-83492555,80127074,90114655]
["Herramientas",286840,0,0,0,286840,-57368,-28684,0,0,-86052,200788,229472]
["Equipos de comunicación",54203388,0,0,0,54203388,-10666132,-5333066,0,0,{"$f":"+G13+H13+I13+J13","v":-15999198},38204190,43537256]
["Equipos de seguridad",256311832,4800000,0,0,261111832,-51262366,-25631183,0,0,-76893549,184218283,205049466]
["Otros bienes del activo fijo",67900000,0,0,0,67900000,0,0,0,0,0,67900000,67900000]
["Mejoras en propiedad de terceros",812141759,0,0,0,812141759,-162428352,-81214176,0,0,-243642528,568499231,649713407]
["Totales",{"$f":"SUM(B9:B16)","v":2519648178},{"$f":"SUM(C9:C16)","v":119538881},{"$f":"SUM(D9:D16)","v":0},0,{"$f":"SUM(F9:F16)","v":2639187059},{"$f":"SUM(G9:G16)","v":-593793594},-200587329,0,0,{"$f":"SUM(K9:K16)","v":-794380923},{"$f":"SUM(L9:L16)","v":1844806136},{"$f":"SUM(M9:M16)","v":1925854584}]
[]
["Observación:"]
["Incluir aclaraciones en los siguientes casos:"]
["1.      Cuando los bienes de uso tienen alguna restricción sobre su utilización, como por ejemplo cuando están garantizando obligaciones. En su caso también hacer referencia a la nota correspondiente."]
["2.      Cuando exista alguna previsión por desvalorización (“deterioro”), detallando la evolución de la misma en el transcurso del año."]
["3.      Si se están capitalizando intereses al costo de bienes de uso. En su caso deberá aclararse la tasa utilizada para la capitalización."]
["Ver adicionalmente Norma de Información Financiera N° 11 Propiedades, planta y equipo"]

{"sheet":"Nota 10","index":15,"n_rows":11,"n_cols":3,"rows_kept":11,"cut":false,"hidden":false,"merged":[[3,70,3,75],[3,76,3,81],[3,82,3,87],[3,88,3,93],[3,94,3,99],[3,100,3,105],[3,34,3,39],[3,40,3,45],[3,46,3,51],[3,52,3,57],[3,58,3,63],[3,64,3,69],[3,4,3,9],[3,10,3,15],[3,16,3,21],[3,22,3,27],[3,28,3,33],[3,286,3,291],[3,292,3,297],[3,298,3,303],[3,304,3,309],[3,310,3,315],[3,316,3,321],[3,250,3,255],[3,256,3,261],[3,262,3,267],[3,268,3,273],[3,274,3,279],[3,280,3,285],[3,214,3,219],[3,220,3,225],[3,226,3,231],[3,232,3,237],[3,238,3,243],[3,244,3,249],[3,178,3,183],[3,184,3,189],[3,190,3,195],[3,196,3,201],[3,202,3,207],[3,208,3,213],[3,142,3,147],[3,148,3,153],[3,154,3,159],[3,160,3,165],[3,166,3,171],[3,172,3,177],[3,106,3,111],[3,112,3,117],[3,118,3,123],[3,124,3,129],[3,130,3,135],[3,136,3,141],[3,502,3,507],[3,508,3,513],[3,514,3,519],[3,520,3,525],[3,526,3,531],[3,532,3,537],[3,466,3,471],[3,472,3,477],[3,478,3,483],[3,484,3,489],[3,490,3,495],[3,496,3,501],[3,430,3,435],[3,436,3,441],[3,442,3,447],[3,448,3,453],[3,454,3,459],[3,460,3,465],[3,394,3,399],[3,400,3,405],[3,406,3,411],[3,412,3,417],[3,418,3,423],[3,424,3,429],[3,358,3,363],[3,364,3,369],[3,370,3,375],[3,376,3,381],[3,382,3,387],[3,388,3,393],[3,322,3,327],[3,328,3,333],[3,334,3,339],[3,340,3,345],[3,346,3,351],[3,352,3,357],[3,718,3,723],[3,724,3,729],[3,730,3,735],[3,736,3,741],[3,742,3,747],[3,748,3,753],[3,682,3,687],[3,688,3,693],[3,694,3,699],[3,700,3,705],[3,706,3,711],[3,712,3,717],[3,646,3,651],[3,652,3,657],[3,658,3,663],[3,664,3,669],[3,670,3,675],[3,676,3,681],[3,610,3,615],[3,616,3,621],[3,622,3,627],[3,628,3,633],[3,634,3,639],[3,640,3,645],[3,574,3,579],[3,580,3,585],[3,586,3,591],[3,592,3,597],[3,598,3,603],[3,604,3,609],[3,538,3,543],[3,544,3,549],[3,550,3,555],[3,556,3,561],[3,562,3,567],[3,568,3,573],[3,934,3,939],[3,940,3,945],[3,946,3,951],[3,952,3,957],[3,958,3,963],[3,964,3,969],[3,898,3,903],[3,904,3,909],[3,910,3,915],[3,916,3,921],[3,922,3,927],[3,928,3,933],[3,862,3,867],[3,868,3,873],[3,874,3,879],[3,880,3,885],[3,886,3,891],[3,892,3,897],[3,826,3,831],[3,832,3,837],[3,838,3,843],[3,844,3,849],[3,850,3,855],[3,856,3,861],[3,790,3,795],[3,796,3,801],[3,802,3,807],[3,808,3,813],[3,814,3,819],[3,820,3,825],[3,754,3,759],[3,760,3,765],[3,766,3,771],[3,772,3,777],[3,778,3,783],[3,784,3,789],[3,1150,3,1155],[3,1156,3,1161],[3,1162,3,1167],[3,1168,3,1173],[3,1174,3,1179],[3,1180,3,1185],[3,1114,3,1119],[3,1120,3,1125],[3,1126,3,1131],[3,1132,3,1137],[3,1138,3,1143],[3,1144,3,1149],[3,1078,3,1083],[3,1084,3,1089],[3,1090,3,1095],[3,1096,3,1101],[3,1102,3,1107],[3,1108,3,1113],[3,1042,3,1047],[3,1048,3,1053],[3,1054,3,1059],[3,1060,3,1065],[3,1066,3,1071],[3,1072,3,1077],[3,1006,3,1011],[3,1012,3,1017],[3,1018,3,1023],[3,1024,3,1029],[3,1030,3,1035],[3,1036,3,1041],[3,970,3,975],[3,976,3,981],[3,982,3,987],[3,988,3,993],[3,994,3,999],[3,1000,3,1005],[3,1366,3,1371],[3,1372,3,1377],[3,1378,3,1383],[3,1384,3,1389],[3,1390,3,1395],[3,1396,3,1401],[3,1330,3,1335],[3,1336,3,1341],[3,1342,3,1347],[3,1348,3,1353],[3,1354,3,1359],[3,1360,3,1365],[3,1294,3,1299],[3,1300,3,1305],[3,1306,3,1311],[3,1312,3,1317],[3,1318,3,1323],[3,1324,3,1329],[3,1258,3,1263],[3,1264,3,1269],[3,1270,3,1275],[3,1276,3,1281],[3,1282,3,1287],[3,1288,3,1293],[3,1222,3,1227],[3,1228,3,1233],[3,1234,3,1239],[3,1240,3,1245],[3,1246,3,1251],[3,1252,3,1257],[3,1186,3,1191],[3,1192,3,1197],[3,1198,3,1203],[3,1204,3,1209],[3,1210,3,1215],[3,1216,3,1221],[3,1582,3,1587],[3,1588,3,1593],[3,1594,3,1599],[3,1600,3,1605],[3,1606,3,1611],[3,1612,3,1617],[3,1546,3,1551],[3,1552,3,1557],[3,1558,3,1563],[3,1564,3,1569],[3,1570,3,1575],[3,1576,3,1581],[3,1510,3,1515],[3,1516,3,1521],[3,1522,3,1527],[3,1528,3,1533],[3,1534,3,1539],[3,1540,3,1545],[3,1474,3,1479],[3,1480,3,1485],[3,1486,3,1491],[3,1492,3,1497],[3,1498,3,1503],[3,1504,3,1509],[3,1438,3,1443],[3,1444,3,1449],[3,1450,3,1455],[3,1456,3,1461],[3,1462,3,1467],[3,1468,3,1473],[3,1402,3,1407],[3,1408,3,1413],[3,1414,3,1419],[3,1420,3,1425],[3,1426,3,1431],[3,1432,3,1437],[3,1798,3,1803],[3,1804,3,1809],[3,1810,3,1815],[3,1816,3,1821],[3,1822,3,1827],[3,1828,3,1833],[3,1762,3,1767],[3,1768,3,1773],[3,1774,3,1779],[3,1780,3,1785],[3,1786,3,1791],[3,1792,3,1797],[3,1726,3,1731],[3,1732,3,1737],[3,1738,3,1743],[3,1744,3,1749],[3,1750,3,1755],[3,1756,3,1761],[3,1690,3,1695],[3,1696,3,1701],[3,1702,3,1707],[3,1708,3,1713],[3,1714,3,1719],[3,1720,3,1725],[3,1654,3,1659],[3,1660,3,1665],[3,1666,3,1671],[3,1672,3,1677],[3,1678,3,1683],[3,1684,3,1689],[3,1618,3,1623],[3,1624,3,1629],[3,1630,3,1635],[3,1636,3,1641],[3,1642,3,1647],[3,1648,3,1653],[3,2014,3,2019],[3,2020,3,2025],[3,2026,3,2031],[3,2032,3,2037],[3,2038,3,2043],[3,2044,3,2049],[3,1978,3,1983],[3,1984,3,1989],[3,1990,3,1995],[3,1996,3,2001],[3,2002,3,2007],[3,2008,3,2013],[3,1942,3,1947],[3,1948,3,1953],[3,1954,3,1959],[3,1960,3,1965],[3,1966,3,1971],[3,1972,3,1977],[3,1906,3,1911],[3,1912,3,1917],[3,1918,3,1923],[3,1924,3,1929],[3,1930,3,1935],[3,1936,3,1941],[3,1870,3,1875],[3,1876,3,1881],[3,1882,3,1887],[3,1888,3,1893],[3,1894,3,1899],[3,1900,3,1905],[3,1834,3,1839],[3,1840,3,1845],[3,1846,3,1851],[3,1852,3,1857],[3,1858,3,1863],[3,1864,3,1869],[3,2230,3,2235],[3,2236,3,2241],[3,2242,3,2247],[3,2248,3,2253],[3,2254,3,2259],[3,2260,3,2265],[3,2194,3,2199],[3,2200,3,2205],[3,2206,3,2211],[3,2212,3,2217],[3,2218,3,2223],[3,2224,3,2229],[3,2158,3,2163],[3,2164,3,2169],[3,2170,3,2175],[3,2176,3,2181],[3,2182,3,2187],[3,2188,3,2193],[3,2122,3,2127],[3,2128,3,2133],[3,2134,3,2139],[3,2140,3,2145],[3,2146,3,2151],[3,2152,3,2157],[3,2086,3,2091],[3,2092,3,2097],[3,2098,3,2103],[3,2104,3,2109],[3,2110,3,2115],[3,2116,3,2121],[3,2050,3,2055],[3,2056,3,2061],[3,2062,3,2067],[3,2068,3,2073],[3,2074,3,2079],[3,2080,3,2085],[3,2446,3,2451],[3,2452,3,2457],[3,2458,3,2463],[3,2464,3,2469],[3,2470,3,2475],[3,2476,3,2481],[3,2410,3,2415],[3,2416,3,2421],[3,2422,3,2427],[3,2428,3,2433],[3,2434,3,2439],[3,2440,3,2445],[3,2374,3,2379],[3,2380,3,2385],[3,2386,3,2391],[3,2392,3,2397],[3,2398,3,2403],[3,2404,3,2409],[3,2338,3,2343],[3,2344,3,2349],[3,2350,3,2355],[3,2356,3,2361],[3,2362,3,2367],[3,2368,3,2373],[3,2302,3,2307],[3,2308,3,2313],[3,2314,3,2319],[3,2320,3,2325],[3,2326,3,2331],[3,2332,3,2337],[3,2266,3,2271],[3,2272,3,2277],[3,2278,3,2283],[3,2284,3,2289],[3,2290,3,2295],[3,2296,3,2301],[3,2662,3,2667],[3,2668,3,2673],[3,2674,3,2679],[3,2680,3,2685],[3,2686,3,2691],[3,2692,3,2697],[3,2626,3,2631],[3,2632,3,2637],[3,2638,3,2643],[3,2644,3,2649],[3,2650,3,2655],[3,2656,3,2661],[3,2590,3,2595],[3,2596,3,2601],[3,2602,3,2607],[3,2608,3,2613],[3,2614,3,2619],[3,2620,3,2625],[3,2554,3,2559],[3,2560,3,2565],[3,2566,3,2571],[3,2572,3,2577],[3,2578,3,2583],[3,2584,3,2589],[3,2518,3,2523],[3,2524,3,2529],[3,2530,3,2535],[3,2536,3,2541],[3,2542,3,2547],[3,2548,3,2553],[3,2482,3,2487],[3,2488,3,2493],[3,2494,3,2499],[3,2500,3,2505],[3,2506,3,2511],[3,2512,3,2517],[3,2878,3,2883],[3,2884,3,2889],[3,2890,3,2895],[3,2896,3,2901],[3,2902,3,2907],[3,2908,3,2913],[3,2842,3,2847],[3,2848,3,2853],[3,2854,3,2859],[3,2860,3,2865],[3,2866,3,2871],[3,2872,3,2877],[3,2806,3,2811],[3,2812,3,2817],[3,2818,3,2823],[3,2824,3,2829],[3,2830,3,2835],[3,2836,3,2841],[3,2770,3,2775],[3,2776,3,2781],[3,2782,3,2787],[3,2788,3,2793],[3,2794,3,2799],[3,2800,3,2805],[3,2734,3,2739],[3,2740,3,2745],[3,2746,3,2751],[3,2752,3,2757],[3,2758,3,2763],[3,2764,3,2769],[3,2698,3,2703],[3,2704,3,2709],[3,2710,3,2715],[3,2716,3,2721],[3,2722,3,2727],[3,2728,3,2733],[3,3094,3,3099],[3,3100,3,3105],[3,3106,3,3111],[3,3112,3,3117],[3,3118,3,3123],[3,3124,3,3129],[3,3058,3,3063],[3,3064,3,3069],[3,3070,3,3075],[3,3076,3,3081],[3,3082,3,3087],[3,3088,3,3093],[3,3022,3,3027],[3,3028,3,3033],[3,3034,3,3039],[3,3040,3,3045],[3,3046,3,3051],[3,3052,3,3057],[3,2986,3,2991],[3,2992,3,2997],[3,2998,3,3003],[3,3004,3,3009],[3,3010,3,3015],[3,3016,3,3021],[3,2950,3,2955],[3,2956,3,2961],[3,2962,3,2967],[3,2968,3,2973],[3,2974,3,2979],[3,2980,3,2985],[3,2914,3,2919],[3,2920,3,2925],[3,2926,3,2931],[3,2932,3,2937],[3,2938,3,2943],[3,2944,3,2949],[3,3310,3,3315],[3,3316,3,3321],[3,3322,3,3327],[3,3328,3,3333],[3,3334,3,3339],[3,3340,3,3345],[3,3274,3,3279],[3,3280,3,3285],[3,3286,3,3291],[3,3292,3,3297],[3,3298,3,3303],[3,3304,3,3309],[3,3238,3,3243],[3,3244,3,3249],[3,3250,3,3255],[3,3256,3,3261],[3,3262,3,3267],[3,3268,3,3273],[3,3202,3,3207],[3,3208,3,3213],[3,3214,3,3219],[3,3220,3,3225],[3,3226,3,3231],[3,3232,3,3237],[3,3166,3,3171],[3,3172,3,3177],[3,3178,3,3183],[3,3184,3,3189],[3,3190,3,3195],[3,3196,3,3201],[3,3130,3,3135],[3,3136,3,3141],[3,3142,3,3147],[3,3148,3,3153],[3,3154,3,3159],[3,3160,3,3165],[3,3526,3,3531],[3,3532,3,3537],[3,3538,3,3543],[3,3544,3,3549],[3,3550,3,3555],[3,3556,3,3561],[3,3490,3,3495],[3,3496,3,3501],[3,3502,3,3507],[3,3508,3,3513],[3,3514,3,3519],[3,3520,3,3525],[3,3454,3,3459],[3,3460,3,3465],[3,3466,3,3471],[3,3472,3,3477],[3,3478,3,3483],[3,3484,3,3489],[3,3418,3,3423],[3,3424,3,3429],[3,3430,3,3435],[3,3436,3,3441],[3,3442,3,3447],[3,3448,3,3453],[3,3382,3,3387],[3,3388,3,3393],[3,3394,3,3399],[3,3400,3,3405],[3,3406,3,3411],[3,3412,3,3417],[3,3346,3,3351],[3,3352,3,3357],[3,3358,3,3363],[3,3364,3,3369],[3,3370,3,3375],[3,3376,3,3381],[3,3742,3,3747],[3,3748,3,3753],[3,3754,3,3759],[3,3760,3,3765],[3,3766,3,3771],[3,3772,3,3777],[3,3706,3,3711],[3,3712,3,3717],[3,3718,3,3723],[3,3724,3,3729],[3,3730,3,3735],[3,3736,3,3741],[3,3670,3,3675],[3,3676,3,3681],[3,3682,3,3687],[3,3688,3,3693],[3,3694,3,3699],[3,3700,3,3705],[3,3634,3,3639],[3,3640,3,3645],[3,3646,3,3651],[3,3652,3,3657],[3,3658,3,3663],[3,3664,3,3669],[3,3598,3,3603],[3,3604,3,3609],[3,3610,3,3615],[3,3616,3,3621],[3,3622,3,3627],[3,3628,3,3633],[3,3562,3,3567],[3,3568,3,3573],[3,3574,3,3579],[3,3580,3,3585],[3,3586,3,3591],[3,3592,3,3597],[3,3958,3,3963],[3,3964,3,3969],[3,3970,3,3975],[3,3976,3,3981],[3,3982,3,3987],[3,3988,3,3993],[3,3922,3,3927],[3,3928,3,3933],[3,3934,3,3939],[3,3940,3,3945],[3,3946,3,3951],[3,3952,3,3957],[3,3886,3,3891],[3,3892,3,3897],[3,3898,3,3903],[3,3904,3,3909],[3,3910,3,3915],[3,3916,3,3921],[3,3850,3,3855],[3,3856,3,3861],[3,3862,3,3867],[3,3868,3,3873],[3,3874,3,3879],[3,3880,3,3885],[3,3814,3,3819],[3,3820,3,3825],[3,3826,3,3831],[3,3832,3,3837],[3,3838,3,3843],[3,3844,3,3849],[3,3778,3,3783],[3,3784,3,3789],[3,3790,3,3795],[3,3796,3,3801],[3,3802,3,3807],[3,3808,3,3813],[3,4174,3,4179],[3,4180,3,4185],[3,4186,3,4191],[3,4192,3,4197],[3,4198,3,4203],[3,4204,3,4209],[3,4138,3,4143],[3,4144,3,4149],[3,4150,3,4155],[3,4156,3,4161],[3,4162,3,4167],[3,4168,3,4173],[3,4102,3,4107],[3,4108,3,4113],[3,4114,3,4119],[3,4120,3,4125],[3,4126,3,4131],[3,4132,3,4137],[3,4066,3,4071],[3,4072,3,4077],[3,4078,3,4083],[3,4084,3,4089],[3,4090,3,4095],[3,4096,3,4101],[3,4030,3,4035],[3,4036,3,4041],[3,4042,3,4047],[3,4048,3,4053],[3,4054,3,4059],[3,4060,3,4065],[3,3994,3,3999],[3,4000,3,4005],[3,4006,3,4011],[3,4012,3,4017],[3,4018,3,4023],[3,4024,3,4029],[3,4390,3,4395],[3,4396,3,4401],[3,4402,3,4407],[3,4408,3,4413],[3,4414,3,4419],[3,4420,3,4425],[3,4354,3,4359],[3,4360,3,4365],[3,4366,3,4371],[3,4372,3,4377],[3,4378,3,4383],[3,4384,3,4389],[3,4318,3,4323],[3,4324,3,4329],[3,4330,3,4335],[3,4336,3,4341],[3,4342,3,4347],[3,4348,3,4353],[3,4282,3,4287],[3,4288,3,4293],[3,4294,3,4299],[3,4300,3,4305],[3,4306,3,4311],[3,4312,3,4317],[3,4246,3,4251],[3,4252,3,4257],[3,4258,3,4263],[3,4264,3,4269],[3,4270,3,4275],[3,4276,3,4281],[3,4210,3,4215],[3,4216,3,4221],[3,4222,3,4227],[3,4228,3,4233],[3,4234,3,4239],[3,4240,3,4245],[3,4606,3,4611],[3,4612,3,4617],[3,4618,3,4623],[3,4624,3,4629],[3,4630,3,4635],[3,4636,3,4641],[3,4570,3,4575],[3,4576,3,4581],[3,4582,3,4587],[3,4588,3,4593],[3,4594,3,4599],[3,4600,3,4605],[3,4534,3,4539],[3,4540,3,4545],[3,4546,3,4551],[3,4552,3,4557],[3,4558,3,4563],[3,4564,3,4569],[3,4498,3,4503],[3,4504,3,4509],[3,4510,3,4515],[3,4516,3,4521],[3,4522,3,4527],[3,4528,3,4533],[3,4462,3,4467],[3,4468,3,4473],[3,4474,3,4479],[3,4480,3,4485],[3,4486,3,4491],[3,4492,3,4497],[3,4426,3,4431],[3,4432,3,4437],[3,4438,3,4443],[3,4444,3,4449],[3,4450,3,4455],[3,4456,3,4461],[3,4822,3,4827],[3,4828,3,4833],[3,4834,3,4839],[3,4840,3,4845],[3,4846,3,4851],[3,4852,3,4857],[3,4786,3,4791],[3,4792,3,4797],[3,4798,3,4803],[3,4804,3,4809],[3,4810,3,4815],[3,4816,3,4821],[3,4750,3,4755],[3,4756,3,4761],[3,4762,3,4767],[3,4768,3,4773],[3,4774,3,4779],[3,4780,3,4785],[3,4714,3,4719],[3,4720,3,4725],[3,4726,3,4731],[3,4732,3,4737],[3,4738,3,4743],[3,4744,3,4749],[3,4678,3,4683],[3,4684,3,4689],[3,4690,3,4695],[3,4696,3,4701],[3,4702,3,4707],[3,4708,3,4713],[3,4642,3,4647],[3,4648,3,4653],[3,4654,3,4659],[3,4660,3,4665],[3,4666,3,4671],[3,4672,3,4677],[3,5038,3,5043],[3,5044,3,5049],[3,5050,3,5055],[3,5056,3,5061],[3,5062,3,5067],[3,5068,3,5073],[3,5002,3,5007],[3,5008,3,5013],[3,5014,3,5019],[3,5020,3,5025],[3,5026,3,5031],[3,5032,3,5037],[3,4966,3,4971],[3,4972,3,4977],[3,4978,3,4983],[3,4984,3,4989],[3,4990,3,4995],[3,4996,3,5001],[3,4930,3,4935],[3,4936,3,4941],[3,4942,3,4947],[3,4948,3,4953],[3,4954,3,4959],[3,4960,3,4965],[3,4894,3,4899],[3,4900,3,4905],[3,4906,3,4911],[3,4912,3,4917],[3,4918,3,4923],[3,4924,3,4929],[3,4858,3,4863],[3,4864,3,4869],[3,4870,3,4875],[3,4876,3,4881],[3,4882,3,4887],[3,4888,3,4893],[3,5254,3,5259],[3,5260,3,5265],[3,5266,3,5271],[3,5272,3,5277],[3,5278,3,5283],[3,5284,3,5289],[3,5218,3,5223],[3,5224,3,5229],[3,5230,3,5235],[3,5236,3,5241],[3,5242,3,5247],[3,5248,3,5253],[3,5182,3,5187],[3,5188,3,5193],[3,5194,3,5199],[3,5200,3,5205],[3,5206,3,5211],[3,5212,3,5217],[3,5146,3,5151],[3,5152,3,5157],[3,5158,3,5163],[3,5164,3,5169],[3,5170,3,5175],[3,5176,3,5181],[3,5110,3,5115],[3,5116,3,5121],[3,5122,3,5127],[3,5128,3,5133],[3,5134,3,5139],[3,5140,3,5145],[3,5074,3,5079],[3,5080,3,5085],[3,5086,3,5091],[3,5092,3,5097],[3,5098,3,5103],[3,5104,3,5109],[3,5470,3,5475],[3,5476,3,5481],[3,5482,3,5487],[3,5488,3,5493],[3,5494,3,5499],[3,5500,3,5505],[3,5434,3,5439],[3,5440,3,5445],[3,5446,3,5451],[3,5452,3,5457],[3,5458,3,5463],[3,5464,3,5469],[3,5398,3,5403],[3,5404,3,5409],[3,5410,3,5415],[3,5416,3,5421],[3,5422,3,5427],[3,5428,3,5433],[3,5362,3,5367],[3,5368,3,5373],[3,5374,3,5379],[3,5380,3,5385],[3,5386,3,5391],[3,5392,3,5397],[3,5326,3,5331],[3,5332,3,5337],[3,5338,3,5343],[3,5344,3,5349],[3,5350,3,5355],[3,5356,3,5361],[3,5290,3,5295],[3,5296,3,5301],[3,5302,3,5307],[3,5308,3,5313],[3,5314,3,5319],[3,5320,3,5325],[3,5686,3,5691],[3,5692,3,5697],[3,5698,3,5703],[3,5704,3,5709],[3,5710,3,5715],[3,5716,3,5721],[3,5650,3,5655],[3,5656,3,5661],[3,5662,3,5667],[3,5668,3,5673],[3,5674,3,5679],[3,5680,3,5685],[3,5614,3,5619],[3,5620,3,5625],[3,5626,3,5631],[3,5632,3,5637],[3,5638,3,5643],[3,5644,3,5649],[3,5578,3,5583],[3,5584,3,5589],[3,5590,3,5595],[3,5596,3,5601],[3,5602,3,5607],[3,5608,3,5613],[3,5542,3,5547],[3,5548,3,5553],[3,5554,3,5559],[3,5560,3,5565],[3,5566,3,5571],[3,5572,3,5577],[3,5506,3,5511],[3,5512,3,5517],[3,5518,3,5523],[3,5524,3,5529],[3,5530,3,5535],[3,5536,3,5541],[3,5902,3,5907],[3,5908,3,5913],[3,5914,3,5919],[3,5920,3,5925],[3,5926,3,5931],[3,5932,3,5937],[3,5866,3,5871],[3,5872,3,5877],[3,5878,3,5883],[3,5884,3,5889],[3,5890,3,5895],[3,5896,3,5901],[3,5830,3,5835],[3,5836,3,5841],[3,5842,3,5847],[3,5848,3,5853],[3,5854,3,5859],[3,5860,3,5865],[3,5794,3,5799],[3,5800,3,5805],[3,5806,3,5811],[3,5812,3,5817],[3,5818,3,5823],[3,5824,3,5829],[3,5758,3,5763],[3,5764,3,5769],[3,5770,3,5775],[3,5776,3,5781],[3,5782,3,5787],[3,5788,3,5793],[3,5722,3,5727],[3,5728,3,5733],[3,5734,3,5739],[3,5740,3,5745],[3,5746,3,5751],[3,5752,3,5757],[3,6118,3,6123],[3,6124,3,6129],[3,6130,3,6135],[3,6136,3,6141],[3,6142,3,6147],[3,6148,3,6153],[3,6082,3,6087],[3,6088,3,6093],[3,6094,3,6099],[3,6100,3,6105],[3,6106,3,6111]],"merged_total":10921,"flags":["merged_cut"]}
[{"$f":"Indice!C3","v":"PASFIN S.A.E.C.A."},null,"BG"]
[]
[]
["NOTA 10 – ACTIVOS DISPONIBLES PARA LA VENTA"]
["(Cifras expresadas en guaraníes)"]
[]
["Inversiones","2020-06-30","2019-12-31"]
["Bienes muebles recibidos en recupero de créditos",1752236100,2254150782]
["Bienes inmuebles recibidos en recupero de créditos",20832405488,19505389585]
["Menos: Previsión sobre bienes inmuebles",-255601191,-255601191]
["Total",{"$f":"SUM(B8:B10)","v":22329040397},{"$f":"SUM(C8:C10)","v":21503939176}]

{"sheet":"Nota 11","index":16,"n_rows":10,"n_cols":6,"rows_kept":10,"cut":false,"hidden":false,"merged":[[3,0,3,3],[4,1,4,2]]}
[{"$f":"Indice!C3","v":"PASFIN S.A.E.C.A."},null,null,null,null,"BG"]
[]
[]
["NOTA 11 – ACTIVOS INTANGIBLES"]
["(Cifras expresadas en guaraníes)"]
[]
["Activos intangibles","2020-06-30","2019-12-31"]
["Licencias de Software",5101569946,4782012622]
["Menos: Amortización Acumulada",-1117093302,-541085127]
["Total",{"$f":"SUM(B8:B9)","v":3984476644},{"$f":"SUM(C8:C9)","v":4240927495}]

{"sheet":"Nota 12","index":17,"n_rows":11,"n_cols":5,"rows_kept":11,"cut":false,"hidden":false,"merged":[[4,1,4,2]]}
[{"$f":"Indice!C3","v":"PASFIN S.A.E.C.A."},null,null,null,"BG"]
[]
[]
["NOTA 12 – GOODWILL"]
["(Cifras expresadas en guaraníes)"]
[]
["Goodwill","2020-06-30","2019-12-31"]
[]
[]
[]
["Total ",{"$f":"SUM(B8:B10)","v":0},{"$f":"SUM(C8:C10)","v":0}]

{"sheet":"Nota 13","index":18,"n_rows":11,"n_cols":5,"rows_kept":11,"cut":false,"hidden":false,"merged":[]}
[{"$f":"Indice!C3","v":"PASFIN S.A.E.C.A."},null,"BG"]
[]
[]
["NOTA 13 – CUENTAS POR PAGAR COMERCIALES"]
["(Cifras expresadas en guaraníes)"]
["Las cuentas por pagar comerciales se componen como sigue:"]
[]
["Corriente","Simbología según ISO 4217","Indicación de Moneda","2020-06-30","2019-12-31"]
["Proveedores locales","PYG",{"$f":"IFERROR(VLOOKUP(B9,'Base de Monedas'!A:B,2,0),\"\")","v":"Guaraní"},697121272,1487070606]
["Proveedores locales","USD",{"$f":"IFERROR(VLOOKUP(B10,'Base de Monedas'!A:B,2,0),\"\")","v":"Dólar estadounidense"},55527492,118520143]
["Total",null,null,{"$f":"SUM($D$9:D10)","v":752648764},{"$f":"SUM($E$9:E10)","v":1605590749}]

{"sheet":"Nota 14","index":19,"n_rows":187,"n_cols":12,"rows_kept":187,"cut":false,"hidden":false,"merged":[[97,7,97,8]]}
["PASFIN SAECA",null,null,null,"BG",null,null,null,null,null,null,"BG"]
[]
[]
["NOTA 14 –  PRESTAMOS A CORTO Y LARGO PLAZO"]
["(Cifras expresadas en guaraníes)"]
[]
["Corrientes"]
[null,null,null,"2020-06-30",null,null,null,null,null,"2019-12-31"]
["Préstamos de Entidades Financieras Locales","Vencimiento","Símbolo de Moneda","Moneda","Importe","Tipo de Garantía",null,"Vencimiento","Símbolo de Moneda","Moneda","Importe","Tipo de Garantía"]
["Banco Rio S.A.E.C.A",0,0,0,0,0,null,2020,"USD","Dólar estadounidense",1422069000,"Prenda"]
["Banco Rio S.A.E.C.A",0,0,0,0,0,null,2020,"USD","Dólar estadounidense",1019083289,"Codeudoria"]
["Banco Rio S.A.E.C.A",0,0,0,0,0,null,2020,"USD","Dólar estadounidense",707512490,"Codeudoria"]
["Banco Rio S.A.E.C.A",0,0,0,0,0,null,2020,"USD","Dólar estadounidense",2262382500,"Prenda"]
["Banco Rio S.A.E.C.A",0,0,0,0,0,null,2020,"USD","Dólar estadounidense",4201567500,"Prenda"]
["Financiera Finexpar S.A.E.C.A",2020,"USD","Dólar estadounidense",3468219635,"Sola firma",null,2020,"USD","Dólar estadounidense",3286928659,"Sola firma"]
["Financiera Finexpar S.A.E.C.A",2020,"USD","Dólar estadounidense",3468219635,"Sola firma",null,2020,"USD","Dólar estadounidense",3286928659,"Sola firma"]
["Financiera Finexpar S.A.E.C.A",2020,"USD","Dólar estadounidense",6026578029,"Endoso solidario",null,2020,"USD","Dólar estadounidense",8831044111,"Endoso solidario"]
["Financiera Finexpar S.A.E.C.A",2020,"PYG","Guaraní",557500800,"Endoso solidario",null,2020,"PYG","Guaraní",4469370252,"Endoso solidario"]
["Financiera Finexpar S.A.E.C.A",2025,"PYG","Guaraní",112115493,"Prenda",null,0,0,0,0,0]
["Banco Interfisa S.A.E.C.A",2022,"PYG","Guaraní",1672625570,"Codeudoria",null,2022,"PYG","Guaraní",1666666666,"Codeudoria"]
["Banco Interfisa S.A.E.C.A",2020,"PYG","Guaraní",840072492,"Codeudoria",null,0,0,0,0,0]
["Fic S.A. de Finanzas",0,0,0,0,0,null,2020,"USD","Dólar estadounidense",1446087138,"Sola firma"]
["Fic S.A. de Finanzas",2020,"PYG","Guaraní",1399881800,"Sola firma",null,2020,"PYG","Guaraní",3555852083,"Sola firma"]
["Fic S.A. de Finanzas",2020,"USD","Dólar estadounidense",3835327340,"Sola firma",null,2020,"USD","Dólar estadounidense",3634846889,"Sola firma"]
["Fic S.A. de Finanzas",2020,"USD","Dólar estadounidense",2840725755,"Sola firma",null,2020,"USD","Dólar estadounidense",2692235175,"Sola firma"]
["Fic S.A. de Finanzas",2020,"USD","Dólar estadounidense",2263215263,"Sola firma",null,0,0,0,0,0]
["Banco Bancop S.A.",2021,"PYG","Guaraní",12460000,"Codeudoria",null,2020,"PYG","Guaraní",1537583332,"Codeudoria"]
["Banco Bancop S.A.",2020,"PYG","Guaraní",2630185000,"Codeudoria",null,0,0,0,0,0]
["Financiera El Comercio S.A.E.C.A",0,0,0,0,0,null,2020,"PYG","Guaraní",3073451427,"Sola firma"]
["Financiera Cefisa S.A.E.C.A",0,0,0,0,0,null,2020,"PYG","Guaraní",850073327,"Codeudoria"]
["Financiera Cefisa S.A.E.C.A",0,0,0,0,0,null,2020,"USD","Dólar estadounidense",3883197666,"Codeudoria"]
["Financiera Cefisa S.A.E.C.A",0,0,0,0,0,null,2020,"USD","Dólar estadounidense",3213005467,"Endoso solidario"]
["Financiera Cefisa S.A.E.C.A",2021,"USD","Dólar estadounidense",2039694360,"Codeudoria",null,0,0,0,0,0]
["Sudameris Bank S.A.E.C.A",0,0,0,0,0,null,2020,"PYG","Guaraní",263946375,"Codeudoria"]
["Sudameris Bank S.A.E.C.A",0,0,0,0,0,null,2020,"PYG","Guaraní",175964246,"Codeudoria"]
["Sudameris Bank S.A.E.C.A",0,0,0,0,0,null,2020,"PYG","Guaraní",348395709,"Codeudoria"]
["Sudameris Bank S.A.E.C.A",0,0,0,0,0,null,2020,"PYG","Guaraní",592272707,"Codeudoria"]
["Sudameris Bank S.A.E.C.A",0,0,0,0,0,null,2020,"USD","Dólar estadounidense",1260624802,"Codeudoria"]
[]
[]
[]
[]
[null,null,null,"2020-06-30",null,null,null,null,null,"2019-12-31"]
["Préstamos de Entidades Financieras Locales","Vencimiento","Símbolo de Moneda","Moneda","Importe","Tipo de Garantía",null,"Vencimiento","Símbolo de Moneda","Moneda","Importe","Tipo de Garantía"]
["Sudameris Bank S.A.E.C.A",0,0,0,0,0,null,2020,"USD","Dólar estadounidense",1061578967,"Codeudoria"]
["Sudameris Bank S.A.E.C.A",2020,"PYG","Guaraní",114403884,"Codeudoria",null,2020,"PYG","Guaraní",774066272,"Codeudoria"]
["Sudameris Bank S.A.E.C.A",2020,"PYG","Guaraní",73608693,"Codeudoria",null,2020,"PYG","Guaraní",498042637,"Codeudoria"]
["Sudameris Bank S.A.E.C.A",2020,"PYG","Guaraní",238038841,"Codeudoria",null,2020,"PYG","Guaraní",920757073,"Codeudoria"]
["Sudameris Bank S.A.E.C.A",2020,"PYG","Guaraní",155166063,"Codeudoria",null,2020,"PYG","Guaraní",600197204,"Codeudoria"]
["Sudameris Bank S.A.E.C.A",2020,"USD","Dólar estadounidense",244746429,"Codeudoria",null,2020,"USD","Dólar estadounidense",677616590,"Codeudoria"]
["Sudameris Bank S.A.E.C.A",2020,"USD","Dólar estadounidense",375987411,"Codeudoria",null,2020,"USD","Dólar estadounidense",1040976292,"Codeudoria"]
["Sudameris Bank S.A.E.C.A",2021,"USD","Dólar estadounidense",3369000280,"Codeudoria",null,0,0,0,0,0]
["Sudameris Bank S.A.E.C.A",2021,"USD","Dólar estadounidense",5182822158,"Prenda",null,0,0,0,0,0]
["Sudameris Bank S.A.E.C.A",2021,"USD","Dólar estadounidense",979345763,"Codeudoria",null,0,0,0,0,0]
["Sudameris Bank S.A.E.C.A",2021,"USD","Dólar estadounidense",1880353926,"Codeudoria",null,0,0,0,0,0]
["Sudameris Bank S.A.E.C.A",2021,"USD","dólar estadounidense",1665183171,"Codeudoria",null,0,0,0,0,0]
["Sudameris Bank S.A.E.C.A",2021,"USD","Dólar estadounidense",1295889300,"Codeudoria",null,0,0,0,0,0]
["Banco BBVA S.A.E.C.A",0,0,0,0,0,null,2020,"PYG","Guaraní",250000000,"Codeudoria"]
["Banco BBVA S.A.E.C.A",0,0,0,0,0,null,2020,"PYG","Guaraní",550000003,"Codeudoria"]
["Banco BBVA S.A.E.C.A",2020,"PYG","Guaraní",825000000,"Codeudoria",null,2020,"PYG","Guaraní",2200000000,"Codeudoria"]
["Banco BBVA S.A.E.C.A",2020,"PYG","Guaraní",500000000,"Codeudoria",null,2020,"PYG","Guaraní",900000000,"Codeudoria"]
["Banco BBVA S.A.E.C.A",2020,"PYG","Guaraní",470000002,"Codeudoria",null,2020,"PYG","Guaraní",783333334,"Codeudoria"]
["Banco BBVA S.A.E.C.A",2020,"PYG","Guaraní",466666665,"Codeudoria",null,2020,"PYG","Guaraní",733333333,"Codeudoria"]
["Banco BBVA S.A.E.C.A",2021,"PYG","Guaraní",1125000000,"Codeudoria",null,0,0,0,0,0]
["Banco BBVA S.A.E.C.A",2021,"PYG","Guaraní",562500000,"Codeudoria",null,0,0,0,0,0]
["Banco BBVA S.A.E.C.A",2021,"PYG","Guaraní",516666666,"Codeudoria",null,0,0,0,0,0]
["Banco BBVA S.A.E.C.A",2021,"PYG","Guaraní",1283333333,"Codeudoria",null,0,0,0,0,0]
["Banco Continental S.A.E.C.A",2021,"PYG","Guaraní",320918641,"Codeudoria",null,2020,"PYG","Guaraní",243538463,"Codeudoria"]
["Banco Basa",0,0,0,0,0,null,2020,"USD","Dólar estadounidense",3764824983,"Solidaria"]
["Sub Total",null,null,null,52811452398,null,null,null,null,null,72679354620]
[]
["Intereses préstamos entidades financieras a pagar"]
["Intereses a pagar gs",null,"PYG","Guaraní",2202635268,null,null,null,"PYG","Guaraní",1098524980]
["Intereses a pagar usd",null,"USD","Dólar estadounidense",1648456713,null,null,null,"USD","Dólar estadounidense",1696875047]
["(-) Intereses a Devengar",null,null,null,-2958602385,null,null,null,null,null,-3483330411]
["Sub Total",null,null,null,892489596,null,null,null,null,null,-687930384]
[]
["Total Préstamos con entidades financieras locales",null,null,null,53703941994,null,null,null,null,null,71991424236]
[]
[]
[]
[]
[]
[]
[null,null,null,"2020-06-30",null,null,null,null,null,"2019-12-31"]
["Préstamos de Entidades No Financieras Locales","Vencimiento","Símbolo de Moneda","Moneda","Importe","Tipo de Garantía",null,"Vencimiento","Símbolo de Moneda","Moneda","Importe","Tipo de Garantía"]
["Préstamos con entidades no financieras"]
["LCR S.A.E.C.A 1",2020,"PYG","Guaraní",2008181819,"Sola firma",null,null,null,null,0]
["LCR S.A.E.C.A 2",2020,"PYG","Guaraní",1508876712,"Sola firma",null,null,null,null,0]
[null,null,null,null,3517058531]
["Intereses prestamos con entidades no financieras a pagar"]
["Intereses a pagar",null,"PYG","Guaraní",170585305,null,null,null,null,null,0]
["(-) Intereses a Devengar ",null,null,null,-152110232,null,null,null,null,null,0]
["Sub Total",null,null,null,18475073,null,null,null,null,null,{"$f":"SUM(K92:K93)","v":0}]
[]
["Total Préstamos con entidades no financieras",null,null,null,3535533604]
[]
["Otros Préstamos",null,null,null,null,null,null,"Otros Préstamos"]
["Otros Prestamos Tomados No Socios ",2026,"PYG","Guaraní",5857588897,"Sola firma",null,2026,"PYG","Guaraní",8246259772,"Sola firma"]
["Otros Prestamos Tomados No Socios ",2027,"USD","Dólar estadounidense",5538501074,"Sola firma",null,2027,"USD","Dólar estadounidense",5649447440,"Sola firma"]
["Otros Prestamos Tomados No Socios ",2021,"PYG","Guaraní",10718000000,"Fideicomiso",null,2021,"PYG","Guaraní",8817000000,"Fideicomiso"]
["Otros Prestamos Tomados No Socios ",2021,"USD","Dólar estadounidense",9555478470,"Fideicomiso",null,2021,"USD","Dólar estadounidense",5151768150,"Fideicomiso"]
["Otros Prestamos Tomados Socios ",2023,"PYG","Guaraní",4460740274,"Sola firma",null,2023,"PYG","Guaraní",5280740274,"Sola firma"]
["Otros Prestamos Tomados Socios ",2022,"USD","Dólar estadounidense",3562091250,"Sola firma",null,2022,"USD","Dólar estadounidense",5009561250,"Sola firma"]
["Sub Total",null,null,null,39692399965,null,null,null,null,null,38154776886]
[]
["Intereses Otros Préstamos "]
["Intereses a pagar No Socios ",null,"PYG","Guaraní",8252094860,null,null,null,"PYG","Guaraní",9127608312]
["Intereses a pagar No Socios ",null,"USD","Dólar estadounidense",3150206439,null,null,null,"USD","Dólar estadounidense",3257944620]
["(-) Intereses a Devengar No Socios",null,null,"",-8924252923,null,null,null,null,null,-9965627267]
["Intereses a pagar Socios ",null,"PYG","Guaraní",999236636,null,null,null,"PYG","Guaraní",1542573176]
["Intereses a pagar Socios ",null,"USD","Dólar estadounidense",1244409208,null,null,null,"USD","Dólar estadounidense",1313445024]
["(-) Intereses a Devengar Socios",null,null,"",-2009383483,null,null,null,null,null,-2303273570]
["Sub Total",null,null,"",2712310737,null,null,null,null,null,2972670295]
["Préstamos de Entidades en el Exterior"]
["Micro Small & Medium Enterprises Bonds S.A.",2022,"PYG","Guaraní",8092568750]
["Sub Total",null,null,null,8092568750]
["Intereses préstamos entidades Financieras del Exterior a pagar"]
["Intereses a pagar",null,null,"Guaraní",9231800768,null,null,null,"PYG","Guaraní",9302641886]
["(-) Intereses a Devengar",null,null,"Guaraní",-8062362083,null,null,null,"PYG","Guaraní",-8096101330]
["Sub Total",null,null,null,1169438685,null,null,null,null,null,1206540556]
[]
["Total Otros Préstamos",null,null,null,51666718137,null,null,null,null,null,42333987737]
[null,null,null,""]
["Total Préstamos a Corto Plazo",null,null,"",108906193735,null,null,null,null,null,114325411973]
[]
["No Corrientes"]
[null,null,null,"2020-06-30",null,null,null,null,null,"2019-12-31"]
["Préstamos de Entidades Locales","Vencimiento","Símbolo de Moneda","Moneda","Importe","Tipo de garantía",null,"Vencimiento","Símbolo de Moneda","Moneda","Importe","Tipo de Garantía"]
["Banco Continental S.A.E.C.A",2021,"PYG","Guaraní",47185335,"Codeudoria",null,2021,"PYG","Guaraní",182364411,"Codeudoria"]
["Banco Interfisa S.A.E.C.A",2022,"PYG","Guaraní",2500000001,"Codeudoria",null,2022,"PYG","Guaraní",3333333334,"Codeudoria"]
["Financiera Cefisa S.A.E.C.A",2020,"USD","Dólar estadounidense",948285001,"Codeudoria",null,null,null,null,0]
["Financiera Finexpar S.A.E.C.A",2025,"PYG","Guaraní",6409502078,"Prenda",null,null,null,null,0]
["Agencia Financiera de Desarrollo",2025,"PYG","Guaraní",6250000000,"Sola Firma",null,null,null,null,0]
["Sub Total",null,null,null,16154972415,null,null,null,null,null,3515697745]
[]
["Intereses préstamos entidades financieras a pagar",null,null,"",null,null,null,null,null,""]
["Intereses a pagar",null,"PYG","Guaraní",2856577385,null,null,null,"PYG","Guaraní",591183932]
["Intereses a pagar",null,"USD","Dólar estadounidense",20827806,null,null,null,0,0,0]
["(-) Intereses a Devengar",null,"PYG","Guaraní",-3581233413,null,null,null,"PYG","Guaraní",-850252915]
["Sub Total",null,null,null,-703828222,null,null,null,null,null,-259068983]
[]
["Total Préstamos de Entidades Financieras Locales",null,null,null,15451144193,null,null,null,null,null,3256628762]
[]
["Otros Préstamos"]
["Otros Prestamos Tomados No Socios ",2026,"PYG","Guaraní",40899916496,"Sola firma",null,2026,"PYG","Guaraní",42206302614,"Sola firma"]
["Otros Prestamos Tomados No Socios ",2027,"USD","Dólar estadounidense",15580010942,"Sola firma",null,2027,"USD","Dólar estadounidense",13951154079,"Sola firma"]
["Otros Prestamos Tomados No Socios ",2025,"PYG","Guaraní",8801000000,"Fideicomiso",null,2025,"PYG","Guaraní",10452000000,"Fideicomiso"]
["Otros Prestamos Tomados No Socios ",2024,"USD","Dólar estadounidense",11417466780,"Fideicomiso",null,2024,"USD","Dólar estadounidense",14724878100,"Fideicomiso"]
["Otros Prestamos Tomados Socios ",2023,"PYG","Guaraní",4068500000,"Sola firma",null,2023,"PYG","Guaraní",5548500000,"Sola firma"]
["Otros Prestamos Tomados Socios ",2022,"USD","Dólar estadounidense",8415348244,"Sola firma",null,2022,"USD","Dólar estadounidense",7975460678,"Sola firma"]
["Sub Total",null,null,null,89182242462,null,null,null,null,null,94858295471]
[]
[]
[]
[]
[]
[]
[]
[]
[]
[]
[null,null,null,"2020-06-30",null,null,null,null,null,"2019-12-31"]
["Otros Préstamos","Vencimiento","Símbolo de Moneda","Moneda","Importe","Tipo de garantía",null,"Vencimiento","Símbolo de Moneda","Moneda","Importe","Tipo de Garantía"]
["Préstamos de Entidades en el Exterior",null,null,"",null,null,null,null,null,""]
["Frontera Capital B.V.",2024,"PYG","Guaraní",31482750000,"Sin garantia",null,2024,"PYG","Guaraní",31482750000,"Sin garantia"]
["Micro Small & Medium Enterprises Bonds S.A.",2022,"PYG","Guaraní",24277706250,"Sin garantia",null,2022,"PYG","Guaraní",32400000000,"Sin garantia"]
["Sub Total",null,null,"",55760456250,null,null,null,null,"",63882750000]
[]
["Intereses Otros Préstamos ",null,null,"",null,null,null,null,null,""]
["Intereses a pagar No Socios ",null,"PYG","Guaraní",16536405886,null,null,null,"PYG","Guaraní",18862139122]
["Intereses a pagar No Socios ",null,"USD","Dólar estadounidense",4615079988,null,null,null,"USD","Dólar estadounidense",5121847295]
["(-) Intereses a Devengar No Socios",null,null,"",-21120861931,null,null,null,null,"",-23937511431]
["Intereses a pagar Socios",null,"PYG","Guaraní",1074354250,null,null,null,"PYG","Guaraní",1524964400]
["Intereses a pagar Socios",null,"USD","Dólar estadounidense",1766039061,null,null,null,"USD","Dólar estadounidense",2235356333]
["(-) Intereses a Devengar Socios",null,null,null,-2840393311,null,null,null,null,null,-3760320733]
["Sub Total",null,null,null,30623943,null,null,null,null,null,46474986]
[]
["Intereses préstamos entidades Financieras del Exterior a pagar"]
["Intereses a pagar",null,"PYG","Guaraní",17731423695,null,null,null,"PYG","Guaraní",22292204681]
["(-) Intereses a Devengar",null,"PYG","Guaraní",-17731423697,null,null,null,"PYG","Guaraní",-22292204681]
["Sub Total",null,null,null,-2,null,null,null,null,null,0]
[]
["Total Otros Préstamos",null,null,null,144973322653,null,null,null,null,null,158787520457]
[]
["Total Préstamos a Largo Plazo",null,null,"",160424466846,null,null,null,null,"",162044149219]
[null,null,null,null,null,null,null,null,null,""]

{"sheet":"Nota 15","index":20,"n_rows":14,"n_cols":4,"rows_kept":14,"cut":false,"hidden":false,"merged":[[5,1,5,2]]}
[{"$f":"Indice!C3","v":"PASFIN S.A.E.C.A."},null,null,"BG"]
[]
[]
["NOTA 15 – PORCIÓN CORRIENTE DE LA DEUDA A LARGO PLAZO"]
["(Cifras expresadas en guaraníes)"]
[]
["Porción corriente de la deuda a largo plazo","2020-06-30","2019-12-31"]
["Cuentas por pagar comerciales"]
["Préstamos bancarios"]
["Bonos bursátiles"]
["Intereses bancarios a pagar"]
["Intereses bursatiles a pagar"]
["(nuevas cuentas a incluir)"]
["Total ",{"$f":"SUM($B$8:B13)","v":0},{"$f":"SUM($C$8:C13)","v":0}]

{"sheet":"Nota 16","index":21,"n_rows":10,"n_cols":3,"rows_kept":10,"cut":false,"hidden":false,"merged":[[5,1,5,2]]}
[{"$f":"Indice!C3","v":"PASFIN S.A.E.C.A."},null,"BG"]
[]
[]
["NOTA 16 – REMUNERACIONES Y CARGAS SOCIALES A PAGAR"]
["(Cifras expresadas en guaraníes)"]
[]
["Remuneraciones y cargas sociales a pagar","2020-06-30","2019-12-31"]
["Aportes y retenciones a pagar",269801406,64429974]
["Aguinaldos a pagar",101222145,23438]
["Total",{"$f":"SUM($B$8:B9)","v":371023551},{"$f":"SUM($C$8:C9)","v":64453412}]

{"sheet":"Nota 17","index":22,"n_rows":11,"n_cols":3,"rows_kept":11,"cut":false,"hidden":false,"merged":[[5,1,5,2]]}
[{"$f":"Indice!C3","v":"PASFIN S.A.E.C.A."},null,"BG"]
[]
[]
["NOTA 17 –  IMPUESTOS A PAGAR"]
["(Cifras expresadas en guaraníes)"]
[]
["Impuestos a pagar","2020-06-30","2019-12-31"]
["Dirección General de Recaudaciones - IVA a pagar",738898392,601448946]
["Impuesto a la renta a pagar",0,120632083]
["Retenciones de impuestos a pagar",0,89189108]
["Total",{"$f":"SUM($B$8:B10)","v":738898392},{"$f":"SUM($C$8:C10)","v":811270137}]

{"sheet":"Nota 18","index":23,"n_rows":11,"n_cols":4,"rows_kept":11,"cut":false,"hidden":false,"merged":[[3,0,3,3],[5,1,5,2]]}
[{"$f":"Indice!C3","v":"PASFIN S.A.E.C.A."},null,null,"BG"]
[]
[]
["NOTA 18 -  PROVISIONES"]
["(Cifras expresadas en guaraníes)"]
[]
["Provisiones","2020-06-30","2019-12-31"]
["Honorarios Profesionales a Pagar",6500000,0]
["Servicios Contratados a Pagar",2034446,0]
["Servicios Básicos a Pagar",963030,0]
["Total",{"$f":"SUM($B$8:B10)","v":9497476},{"$f":"SUM($C$8:C10)","v":0}]

{"sheet":"Nota 19","index":24,"n_rows":11,"n_cols":4,"rows_kept":11,"cut":false,"hidden":false,"merged":[[3,0,3,1]]}
[{"$f":"Indice!C3","v":"PASFIN S.A.E.C.A."},null,null,"BG"]
[]
["NOTA 19 – OTROS PASIVOS CORRIENTES Y NO CORRIENTES"]
["(Cifras expresadas en guaraníes)"]
[]
["Corriente","2020-06-30","2019-12-31"]
["Cheques en garantía redescontados ",4427246058,0]
["Operaciones pasivas a constituir",2120394373,243918500]
["Otros pasivos corrientes",424838063,36291374]
["Anticipos varios",38770773,175776999]
["Total ",{"$f":"SUM(B7:B10)","v":7011249267},{"$f":"SUM(C7:C10)","v":455986873}]

{"sheet":"Nota 20","index":25,"n_rows":13,"n_cols":4,"rows_kept":13,"cut":false,"hidden":false,"merged":[[3,0,3,3],[4,0,4,1]]}
[{"$f":"Indice!C3","v":"PASFIN S.A.E.C.A."},null,null,"BG"]
[]
[]
["NOTA 20 – CAPITAL INTEGRADO"]
["(Cifras expresadas en guaraníes)"]
[]
["Concepto","2020-06-30","2019-12-31"]
["Monto Capital Social",250000000000,250000000000]
["Monto Capital Integrado",107942000000,98910000000]
["Adelanto irrevocable a cuenta de integración de capital",10667945,0]
["Cantidad de Acciones",107942,98910]
["Valor Nominal de Acciones",1000000,1000000]
["Total Capital Integrado",{"$f":"+B9","v":107942000000},{"$f":"+C9","v":98910000000}]

{"sheet":" Nota 21","index":26,"n_rows":18,"n_cols":6,"rows_kept":18,"cut":false,"hidden":false,"merged":[[16,0,16,5],[17,0,17,5],[13,0,13,5],[3,0,3,5],[5,1,5,2],[4,0,4,1],[9,0,9,5],[10,0,10,5]]}
[{"$f":"Indice!C3","v":"PASFIN S.A.E.C.A."},null,null,null,null,"BG"]
[]
[]
["NOTA 21 – RESERVAS"]
["(Cifras expresadas en guaraníes)"]
[]
[null,"2020-06-30","2019-12-01"]
["a-  Reserva de revalúo",383681070,383681070]
["La cuenta está compuesta por:"]
["Reserva de revalúo fiscal: Al cierre del ejercicio aplicando el coeficiente de revalúo determinado por la Administración Tributaria."]
["Reserva de revalúo extraordinario: Valuación residual estraordinaria según valor tasación de bienes inmuebles recibidos en recupero de créditos."]
[]
["b- Reserva legal",3782180262,3782180262]
["En cumplimiento a lo establecido en el Art. 91° de la Ley 1034/83 del comerciante, la sociedad constituye una reserva legal anual a una tasa del 5% sobre la utilidad del ejercicio. Dicha reserva no deberá superar el 20% del capital suscripto."]
[]
["c- Reservas facultativas",9409093934,4100000000]
["Por Acta N° 18/2019 de Asamblea General de Accionistas llevada a cabo en fecha 24 de abril de 2019 fue aprobada la constitución de una reserva para cartera de inversiones por Gs. 4.100.000.000."]
["Por Acta N° 23/2020 de Asamblea General de Accionistas  llevada a cabo en fecha 28 de abril de 2020 fue aprobada la constitución de una reserva adicional por Gs. 5.309.093.934."]

{"sheet":"Nota 22","index":27,"n_rows":9,"n_cols":6,"rows_kept":9,"cut":false,"hidden":false,"merged":[[5,1,5,2],[4,0,4,1]]}
[{"$f":"Indice!C3","v":"PASFIN S.A.E.C.A."},null,null,null,null,"BG"]
[]
[]
["NOTA 22 –  DIFERENCIA TRANSITORIA POR CONVERSIÓN"]
["(Cifras expresadas en guaraníes)"]
[]
[null,"2020-06-30","2019-12-01"]
["Diferencia transitoria por conversión"]
["Total",{"$f":"SUM(B8)","v":0},{"$f":"SUM(C8)","v":0}]

{"sheet":"Nota 23","index":28,"n_rows":10,"n_cols":6,"rows_kept":10,"cut":false,"hidden":false,"merged":[[5,1,5,2],[4,0,4,1]]}
[{"$f":"Indice!C3","v":"PASFIN S.A.E.C.A."},null,null,null,null,"BG"]
[]
[]
["NOTA 23 –  RESULTADOS ACUMULADOS"]
["(Cifras expresadas en guaraníes)"]
[]
["Concepto","2020-06-30","2019-12-31"]
["Resultado de ejercicios anteriores",4170698,4170698]
["Resultado del ejercicio actual",-3398959481,14297856674]
["Totales",{"$f":"SUM($B$8:B9)","v":-3394788783},{"$f":"SUM($C$8:C9)","v":14302027372}]

{"sheet":"Nota 24","index":29,"n_rows":9,"n_cols":6,"rows_kept":9,"cut":false,"hidden":false,"merged":[[5,1,5,2],[4,0,4,1]]}
[{"$f":"Indice!C3","v":"PASFIN S.A.E.C.A."},null,null,null,null,"BG"]
[]
[]
["NOTA 24 –  INTERÉS MINORITARIO"]
["(Cifras expresadas en guaraníes)"]
[]
[null,"2020-06-30","2019-12-31"]
["Interés Minoritario"]
["Total",{"$f":"SUM(B8)","v":0},{"$f":"SUM(C8)","v":0}]

{"sheet":"Nota 25","index":30,"n_rows":15,"n_cols":5,"rows_kept":15,"cut":false,"hidden":false,"merged":[[6,1,6,2],[4,0,4,1]]}
[{"$f":"Indice!C3","v":"PASFIN S.A.E.C.A."},null,null,null,"ER"]
[]
[]
["NOTA 25 –  VENTAS"]
["(Cifras expresadas en guaraníes)"]
[]
[]
["Ventas","2020-06-30","2019-06-30"]
[]
["Ventas Locales"]
["Servicios financieros"]
["Ventas Contado",11351597928,17579982269]
["Ventas Crédito",26298745595,34275637620]
["Menos: Devoluciones y descuentos concedidos",-2778711921,-1215766855]
["Total",{"$f":"SUM($B$12:B14)","v":34871631602},{"$f":"SUM(C12:C14)","v":50639853034}]

{"sheet":"Nota 26","index":31,"n_rows":13,"n_cols":5,"rows_kept":13,"cut":false,"hidden":false,"merged":[[3,0,3,5],[5,1,5,2],[6,1,6,2],[4,0,4,1]]}
[{"$f":"Indice!C3","v":"PASFIN S.A.E.C.A."},null,null,null,"ER"]
[]
[]
["NOTA 26 - COSTO DE VENTAS"]
["(Cifras expresadas en guaraníes)"]
[]
[]
["Costo de ventas","2020-06-30","2019-06-30"]
["Costos financieros",20854492398,19834015274]
["Honorarios a Profesionales y Técnicos",1622930337,2033125314]
["Otras Retribuciones Personales",0,924036048]
["Menos: Descuentos obtenidos",-1208859651,-2794272150]
["Total costo de ventas",{"$f":"SUM($B$9:B12)","v":21268563084},{"$f":"SUM($C$9:C12)","v":19996904486}]

{"sheet":"Nota 27","index":32,"n_rows":46,"n_cols":7,"rows_kept":46,"cut":false,"hidden":false,"merged":[[8,0,9,0],[4,0,4,1],[4,2,4,3],[4,4,4,5],[4,6,4,7],[8,1,8,3],[8,4,8,6]]}
[{"$f":"[22]Indice!C1","v":"PASFIN S.A.E.C.A."},null,null,null,null,null,"ER"]
[]
[]
["NOTA 27 - GASTOS"]
["(Cifras expresadas en guaraníes)"]
[]
["El rubro está compuesto de la siguiente forma: "]
[]
["Concepto","2020-06-30",null,null,"2019-06-30"]
[null,"Gastos de Ventas","Gastos Administrativos","Total","Gastos de Ventas","Gastos Administrativos","Total"]
["Movilidad y viáticos",0,44255673,{"$f":"+C11+B11","v":44255673},0,37240372,{"$f":"+F11+E11","v":37240372}]
["Gastos de alquiler",0,396434811,{"$f":"+C12+B12","v":396434811},0,374639716,{"$f":"+F12+E12","v":374639716}]
["Computación y redes",0,192647913,192647913,0,23736380,23736380]
["Gastos por servicios",0,6770450,6770450,0,6533124,6533124]
["Honorarios profesionales y asesoramiento",0,479912379,479912379,0,1568386108,1568386108]
["Impuestos y tasas",0,431353461,431353461,0,135397629,135397629]
["Gastos de reparación y mantenimiento",0,142846833,142846833,0,124588424,124588424]
["Gastos del personal y capacitación",0,150444180,150444180,0,124925457,124925457]
["Seguros pagados",0,14683152,14683152,0,10914484,10914484]
["Otros gastos de operación",0,1637346807,1637346807,0,1733600444,1733600444]
["Remuneraciones de administradores, directores, síndicos y consejo de vigilancia",0,772850102,772850102,0,123867500,123867500]
["Sueldos y Jornales",673420684,1200839811,1874260495,507729047,1012860707,1520589754]
["Contribuciones Sociales",0,287433502,287433502,0,221881378,221881378]
["Gastos de Publicidad y Propaganda",73326807,0,73326807,190993080,null,190993080]
["Intereses, multas y recargos impositivos",0,50040443,50040443,0,70680191,70680191]
["Depreciación bienes de uso",0,200587329,200587329,0,0,0]
["Amortización activos intangibles",0,576008175,576008175,0,54225173,54225173]
["Previsiones",0,7877618393,7877618393,0,13719458017,13719458017]
["Donaciones",0,9770480,9770480,0,23318182,23318182]
["Totales",{"$f":"+SUM($B$11:B29)","v":746747491},{"$f":"SUM(C11:C29)","v":14471843894},{"$f":"SUM(D11:D29)","v":15218591385},{"$f":"SUM(E11:E29)","v":698722127},{"$f":"SUM(F11:F29)","v":19366253286},{"$f":"SUM(G11:G29)","v":20064975413}]
[]
[]
[]
[]
[]
[]
[]
[]
[]
[]
[]
[]
[]
[]
[null,null,null,{"$f":"SUM(D33:D43)","v":0}]
[null,null,null,{"$f":"+D45-D30","v":-15218591385}]

{"sheet":"Nota 28","index":33,"n_rows":21,"n_cols":5,"rows_kept":21,"cut":false,"hidden":false,"merged":[[5,1,5,2],[4,0,4,1]]}
[{"$f":"Indice!C3","v":"PASFIN S.A.E.C.A."},null,null,null,"ER"]
[]
[]
["NOTA 28 - OTROS INGRESOS Y GASTOS "]
["(Cifras expresadas en guaraníes)"]
[]
[]
["Otros ingresos","2020-06-30","2019-06-30"]
["Ingresos por valuación",14347798349,10688824127]
["Venta de Bienes recibidos en recup. De creditos",1446476914,832279749]
["Ingresos Diversos",108211479,112665739]
["Recupero de créditos",43215562,2862407590]
["Intereses ganados en bancos y financieras",20803635,25284975]
["Total",{"$f":"SUM($B$9:B13)","v":15966505939},{"$f":"SUM(C9:C13)","v":14521462180}]
[]
["Otros gastos","2020-06-30","2019-06-30"]
["Pérdida por valuación",13585214138,10273903635]
["Costo de venta de bienes ",1607599337,1000156364]
["Pérdida por quitas sobre créditos",1381694873,45415571]
["Gastos Diversos",6295271,35350]
["Total",{"$f":"SUM($B$17:B20)","v":16580803619},{"$f":"SUM(C17:C20)","v":11319510920}]

{"sheet":"Nota 29","index":34,"n_rows":9,"n_cols":5,"rows_kept":9,"cut":false,"hidden":false,"merged":[[4,0,4,1]]}
[{"$f":"Indice!C3","v":"PASFIN S.A.E.C.A."},null,null,null,"ER"]
[]
[]
["NOTA 29 - GASTOS FINANCIEROS"]
["(Cifras expresadas en guaraníes)"]
[]
["Gastos Financieros netos","2020-06-30","2019-06-30"]
["Intereses moratorios bancos y financieras",1169138934,849574714]
["Total gastos financieros",{"$f":"SUM($B8:B8)","v":1169138934},{"$f":"SUM($C8:C8)","v":849574714}]

{"sheet":"Nota 30","index":35,"n_rows":12,"n_cols":5,"rows_kept":12,"cut":false,"hidden":false,"merged":[[5,1,5,2],[4,0,4,1]]}
[{"$f":"Indice!C3","v":"PASFIN S.A.E.C.A."},null,null,null,"ER"]
[]
[]
["NOTA 30 - RESULTADO DE INVERSIONES EN ASOCIADAS"]
["(Cifras expresadas en guaraníes)"]
[]
[]
["Resultado de inversiones en asociadas","2020-06-30","2019-06-30"]
["(Detallar cuenta)"]
[]
[]
["Total",{"$f":"SUM($B9:B11)","v":0},{"$f":"SUM($C9:C11)","v":0}]

{"sheet":"Nota 31","index":36,"n_rows":12,"n_cols":5,"rows_kept":12,"cut":false,"hidden":false,"merged":[[4,0,4,1],[5,1,5,2]]}
[{"$f":"Indice!C3","v":"PASFIN S.A.E.C.A."},null,null,null,"ER"]
[]
[]
["NOTA 31 - RESULTADO PARTICIPACIÓN MINORITARIA"]
["(Cifras expresadas en guaraníes)"]
[]
[]
["Resultado participación minoritaria","2020-06-30","2019-06-30"]
["(Detallar cuenta)"]
[]
[]
["Total",{"$f":"SUM($B9:B11)","v":0},{"$f":"SUM($C9:C11)","v":0}]

{"sheet":"Nota 32","index":37,"n_rows":9,"n_cols":5,"rows_kept":9,"cut":false,"hidden":false,"merged":[[5,1,5,2],[4,0,4,1]]}
[{"$f":"Indice!C3","v":"PASFIN S.A.E.C.A."},null,null,null,"ER"]
[]
[]
["NOTA 32 - IMPUESTO A LA RENTA"]
["(Cifras expresadas en guaraníes)"]
[]
["Concepto","2020-06-30","2019-06-30"]
["Impuesto a la renta",0,1573623556]
["Total",{"$f":"SUM($B8:B8)","v":0},{"$f":"SUM($C8:C8)","v":1573623556}]

{"sheet":"Nota 33","index":38,"n_rows":10,"n_cols":5,"rows_kept":10,"cut":false,"hidden":false,"merged":[[4,0,4,1]]}
[{"$f":"Indice!C3","v":"PASFIN S.A.E.C.A."},null,null,null,"ER"]
[]
[]
["NOTA 33 - RESULTADO EXTRAORDINARIO NETO DE IMPUESTO A LA RENTA"]
["(Cifras expresadas en guaraníes)"]
[]
[null,"2020-06-30","2019-06-30"]
["Conceptos"]
["(Detallar)"]
["Total",{"$f":"SUM($B8:B9)","v":0},{"$f":"SUM($C8:C9)","v":0}]

{"sheet":"Nota 34","index":39,"n_rows":12,"n_cols":5,"rows_kept":12,"cut":false,"hidden":false,"merged":[[4,0,4,1]]}
[{"$f":"Indice!C3","v":"PASFIN S.A.E.C.A."},null,null,null,"ER"]
[]
[]
["NOTA 34 - RESULTADO SOBRE ACTIVIDADES DISCONTINUADAS NETO DE IMPUESTO A LA RENTA"]
["(Cifras expresadas en guaraníes)"]
[]
["Resultado sobre actividades discontinuadas neto de impuesto a la renta","2020-06-30","2019-06-30"]
[]
["(nueva cuenta a incluir)"]
["Subtotal"]
["- Impuesto a la renta"]
["Total",{"$f":"SUM($B8:B11)","v":0},{"$f":"SUM($C8:C11)","v":0}]

{"sheet":"Nota 35","index":40,"n_rows":12,"n_cols":3,"rows_kept":12,"cut":false,"hidden":false,"merged":[[3,0,3,6],[11,0,11,6],[4,0,4,1]]}
[{"$f":"Indice!C3","v":"PASFIN S.A.E.C.A."},null,"ER"]
[]
[]
["NOTA 35- UTILIDAD/PÉRDIDA NETA DEL AÑO Y POR ACCIÓN ORDINARIA"]
["(Cifras expresadas en guaraníes)"]
[]
["Concepto","2020-06-30","2019-06-30"]
["Cantidad de Acciones Ordinarias en Circulación",41800,41794]
["Utilidad/Pérdida Neta",-3398959481,11356726125]
["Utilidad/Pérdida Neta por Acción Ordinaria",{"$f":"IFERROR(B9/B8,0)","v":-81314.82011961723},{"$f":"IFERROR(C9/C8,0)","v":271731.01701201132}]
[]
["La Sociedad calcula la utilidad/pérdida neta por acción sobre la base de la utilidad/pérdida  del año y el total de acciones ordinarias integradas con valor nominal de G. 1.000.000 cada una. Las acciones ordinarias de voto simple tienen derecho a 1 voto, en tanto que las acciones ordinarias de voto múltiple tienen derecho a 5 votos."]

{"sheet":"Nota 36","index":41,"n_rows":19,"n_cols":5,"rows_kept":19,"cut":false,"hidden":false,"merged":[[3,0,3,4],[4,0,4,1]]}
[{"$f":"Indice!C3","v":"PASFIN S.A.E.C.A."},null,null,null,"Indice"]
[]
[]
["NOTA 36 - ACTIVOS GRAVADOS"]
["(Cifras expresadas en guaraníes)"]
[]
["Los siguientes bienes de propiedad de la Sociedad han sido hipotecados y prendados en garantía de obligaciones financieras."]
[]
[{"$f":"IFERROR(\"Al \"&DAY(Indice!B6)&\" de \"&VLOOKUP(MONTH(Indice!B6),Indice!S:T,2,0)&\" de \"&YEAR(Indice!B6-365),\"Al dia... de mes… de año 2XX1…\")","v":"Al 30 de Junio de 2019"}]
["Tipo de Activo","Datos  del activo gravado","Tipo de garantía","Importe (indicar   moneda)","A favor de"]
[]
[]
[]
[{"$f":"IFERROR(\"Al \"&DAY(Indice!B6)&\" de \"&VLOOKUP(MONTH(Indice!B6),Indice!S:T,2,0)&\" de \"&YEAR(Indice!B6-1),\"Al dia... de mes… de año 2XX2…\")","v":"Al 30 de Junio de 2020"}]
["Tipo de Activo","Datos  del activo gravado","Tipo de garantía","Importe (indicar   moneda)","A favor de"]
[]
[]
[]
["Observación: La sociedad revela en la Nota 14  los tipos de garantía por cada obligación financiera y no financiera."]

{"sheet":"Nota 37","index":42,"n_rows":7,"n_cols":5,"rows_kept":7,"cut":false,"hidden":false,"merged":[[4,0,4,8],[6,0,7,7]]}
[{"$f":"Indice!C3","v":"PASFIN S.A.E.C.A."},null,null,null,"Indice"]
[]
[]
["NOTA 37 - CONTINGENCIAS Y COMPROMISOS "]
[]
[]
[{"$f":"IFERROR(\"Al  \"&DAY(Indice!B6)&\" de \"&VLOOKUP(MONTH(Indice!B6),Indice!S:T,2,0)&\" de \"&YEAR(Indice!B6-1)&\" no existen situaciones contingentes, ni reclamos que pudieran resultar en la generación de obligaciones para la Sociedad adicionales a las que se presentan en estos estados financieros.\",\"Al … de …………... 20X2 no existen situaciones contingentes, ni reclamos que pudieran resultar en la generación de obligaciones para la Sociedad adicionales a las que se presentan en estos estados financieros.\")","v":"Al  30 de Junio de 2020 no existen situaciones contingentes, ni reclamos que pudieran resultar en la generación de obligaciones para la Sociedad adicionales a las que se presentan en estos estados financieros."}]

{"sheet":"Nota 38","index":43,"n_rows":44,"n_cols":6,"rows_kept":44,"cut":false,"hidden":false,"merged":[[5,0,5,6],[4,0,4,6],[19,1,19,2],[20,1,20,2],[10,1,10,2],[11,1,11,2],[12,1,12,2],[17,1,17,2],[18,1,18,2]]}
[{"$f":"[22]Indice!C1","v":"PASFIN S.A.E.C.A."},null,null,null,"Índice"]
[]
[]
["NOTA 38 - IMPUESTO DIFERIDO"]
["(Cifras expresadas en guaraníes)"]
[]
[]
["38.1","Componentes del impuesto a la renta reconocido en el estado de resultados"]
[]
[null,null,null,"2020-06-30",null,"2019-06-30"]
[null,"(*) Gasto por impuesto corriente",null,0,null,1573623556]
[null,"(Ingresos) / Gasto por origen y reversión de diferencias temporarias",null,0,null,0]
[null,"Gasto por el impuesto a la renta",null,{"$f":"SUM(D11:D12)","v":0},null,{"$f":"SUM(F11:F12)","v":1573623556}]
[]
["38.2","Conciliación del gasto por impuesto a la renta y la utilidad contable"]
[]
[null,null,null,"2020-06-30",null,"2019-06-30"]
[null,"Ganancia Contable",null,0,null,12930349681]
[null,"(*) Impuesto a la renta",null,0,null,1573623556]
[null,"Efecto fiscal de gastos que no cumplen con los requisitos de documentación",null,0,null,0]
[null,"Gasto fiscal",null,{"$f":"SUM(D19:D20)","v":0},null,{"$f":"SUM(F19:F20)","v":1573623556}]
[]
["38.3","Activos y pasivos por impuesto a la renta diferido"]
[]
[null,"Los activos correspondientes al impuesto a la renta diferido son atribuibles según el siguiente detalle:"]
[]
[null,null,null,"2020-06-30",null,"2019-12-01"]
[null,null,null,"Activo",null,"Activo"]
[null,"ACTIVO "]
[null,"Activo Corriente"]
[null,"Cartera de créditos ",null,2421856,null,2421856]
[null,"Activo No Corriente"]
[null,"Cartera de créditos ",null,423881,null,423881]
[null,"Activo por impuesto diferido",null,{"$f":"SUM(D31:D33)","v":2845737},null,{"$f":"SUM(F31:F33)","v":2845737}]
[]
[]
["38.4","Movimiento durante el año de las diferencias temporarias"]
[]
[null,null,null,"Saldos a Dic-19","Reconocido en Resultados","Saldos a Jun-20"]
[null,"Activo neto por impuesto diferido ",null,2845737,0,{"$f":"+D40+E40","v":2845737}]
[]
[]
[null,null,null,"Saldos a Dic-18","Reconocido en Resultados","Saldos a Jun-19"]
[null,"Activo neto por impuesto diferido ",null,4007174,0,{"$f":"+D44+E44","v":4007174}]

{"sheet":"Nota 39","index":44,"n_rows":8,"n_cols":5,"rows_kept":8,"cut":false,"hidden":false,"merged":[[5,0,5,8],[11,0,11,8],[7,0,7,8],[6,0,6,8]]}
[{"$f":"Indice!C3","v":"PASFIN S.A.E.C.A."},null,null,null,"Indice"]
[]
[]
[]
["NOTA 39 - HECHOS POSTERIORES"]
[]
["En fecha 21 de abril de 2020 la Sociedad ha firmado un acuerdo estratégico de fusión con las entidades CREDICENTRO S.A.E.C.A. y LCR S.A.E.C.A. "]
["En fecha 11 de mayo de 2020 se llevó a cabo la  Asamblea General Extraordinaria N° 24/2020  por la cual se aprueba el compromiso previo de fusión por absorción por parte de la firma CREDICENTRO S.A.E.C.A. en carácter de absorbente y PASFIN S.A.E.C.A y LCR S.A.E.C.A. en carácter de absorbidas como asimismo el Balance Especial de Fusión."]

{"sheet":"Nota 40","index":45,"n_rows":30,"n_cols":3,"rows_kept":30,"cut":false,"hidden":false,"merged":[[17,0,17,5],[4,0,4,2]]}
[{"$f":"Indice!C3","v":"PASFIN S.A.E.C.A."},null,"Indice"]
[]
[]
["NOTA 40 - SALDOS Y TRANSACCIONES CON PARTES RELACIONADAS"]
["(Cifras expresadas en guaraníes)"]
[]
["Conceptos","2020-06-30","2019-12-01"]
["ACTIVO"]
["Cartera de créditos",13606831875,11289171013]
["Otros créditos",46109337,60769479]
["Propiedades, planta y equipo/Bienes de uso, neto",21818182,0]
["Total Activo",{"$f":"SUM(B9:B11)","v":13674759394},{"$f":"SUM(C9:C11)","v":11349940492}]
["PASIVO"]
["Préstamos ",87439410195,87597362804]
["Cuentas por pagar comerciales",0,749744146]
["Total Pasivo",{"$f":"SUM(B14:B15)","v":87439410195},{"$f":"SUM(C14:C15)","v":88347106950}]
[]
[]
[]
[]
["INGRESOS","2020-06-30","2019-06-30"]
["Ventas",5584495900,10782920135]
["Otros ingresos",20025588,0]
["Total Ingresos",{"$f":"SUM(B22:B23)","v":5604521488},{"$f":"SUM(C22)","v":10782920135}]
[]
["EGRESOS"]
["Costo de ventas",7980828911,8557298400]
["Gastos administrativos",1635152121,624128314]
["Gastos financieros",1097788218,809596772]
["Total Egresos",{"$f":"SUM(B27:B29)","v":10713769250},{"$f":"SUM(C27:C29)","v":9991023486}]

{"sheet":"Base de Monedas","index":46,"n_rows":179,"n_cols":3,"rows_kept":179,"cut":false,"hidden":false,"merged":[]}
["PYG","Guaraní","Índice"]
["USD","Dólar estadounidense"]
["EUR","Euro"]
["AED","Dírham de los Emiratos Árabes Unidos"]
["AFN","Afgani"]
["ALL","Lek"]
["AMD","Dram armenio"]
["ANG","Florín antillano neerlandés"]
["AOA","Kwanza"]
["ARS","Peso argentino"]
["AUD","Dólar australiano"]
["AWG","Florín arubeño"]
["AZN","Manat azerbaiyano"]
["BAM","Marco convertible"]
["BBD","Dólar de Barbados"]
["BDT","Taka"]
["BGN","Lev búlgaro"]
["BHD","Dinar bareiní"]
["BIF","Franco de Burundi"]
["BMD","Dólar bermudeño"]
["BND","Dólar de Brunéi"]
["BOB","Boliviano"]
["BOV","MVDOL"]
["BRL","Real brasileño"]
["BSD","Dólar bahameño"]
["BTN","Ngultrum"]
["BWP","Pula"]
["BYN","Rublo bielorruso"]
["BZD","Dólar beliceño"]
["CAD","Dólar canadiense"]
["CDF","Franco congoleño"]
["CHE","Euro WIR"]
["CHF","Franco suizo"]
["CHW","Franco WIR"]
["CLF","Unidad de fomento"]
["CLP","Peso chileno"]
["CNY","Yuan chino"]
["COP","Peso colombiano"]
["COU","Unidad de valor real"]
["CRC","Colón costarricense"]
["CUC","Peso convertible"]
["CUP","Peso cubano"]
["CVE","Escudo caboverdiano"]
["CZK","Corona checa"]
["DJF","Franco yibutiano"]
["DKK","Corona danesa"]
["DOP","Peso dominicano"]
["DZD","Dinar argelino"]
["EGP","Libra egipcia"]
["ERN","Nakfa"]
["ETB","Birr etíope"]
["FJD","Dólar fiyiano"]
["FKP","Libra malvinense"]
["GBP","Libra esterlina"]
["GEL","Lari"]
["GHS","Cedi ghanés"]
["GIP","Libra de Gibraltar"]
["GMD","Dalasi"]
["GNF","Franco guineano"]
["GTQ","Quetzal"]
["GYD","Dólar guyanés"]
["HKD","Dólar de Hong Kong"]
["HNL","Lempira"]
["HRK","Kuna"]
["HTG","Gourde"]
["HUF","Forinto"]
["IDR","Rupia indonesia"]
["ILS","Nuevo shéquel israelí"]
["INR","Rupia india"]
["IQD","Dinar iraquí"]
["IRR","Rial iraní"]
["ISK","Corona islandesa"]
["JMD","Dólar jamaiquino"]
["JOD","Dinar jordano"]
["JPY","Yen"]
["KES","Chelín keniano"]
["KGS","Som"]
["KHR","Riel"]
["KMF","Franco comorense"]
["KPW","Won norcoreano"]
["KRW","Won"]
["KWD","Dinar kuwaití"]
["KYD","Dólar de las Islas Caimán"]
["KZT","Tenge"]
["LAK","Kip"]
["LBP","Libra libanesa"]
["LKR","Rupia de Sri Lanka"]
["LRD","Dólar liberiano"]
["LSL","Loti"]
["LYD","Dinar libio"]
["MAD","Dírham marroquí"]
["MDL","Leu moldavo"]
["MGA","Ariary malgache"]
["MKD","Denar"]
["MMK","Kyat"]
["MNT","Tugrik"]
["MOP","Pataca"]
["MRU","Uguiya"]
["MUR","Rupia de Mauricio"]
["MVR","Rufiyaa"]
["MWK","Kwacha"]
["MXN","Peso mexicano"]
["MXV","Unidad de Inversión (UDI) mexicana"]
["MYR","Ringgit malayo"]
["MZN","Metical mozambiqueño"]
["NAD","Dólar namibio"]
["NGN","Naira"]
["NIO","Córdoba"]
["NOK","Corona noruega"]
["NPR","Rupia nepalí"]
["NZD","Dólar neozelandés"]
["OMR","Rial omaní"]
["PAB","Balboa"]
["PEN","Sol"]
["PGK","Kina"]
["PHP","Peso filipino"]
["PKR","Rupia pakistaní"]
["PLN","Złoty"]
["QAR","Riyal qatarí"]
["RON","Leu rumano"]
["RSD","Dinar serbio"]
["RUB","Rublo ruso"]
["RWF","Franco ruandés"]
["SAR","Riyal saudí"]
["SBD","Dólar de las Islas Salomón"]
["SCR","Rupia seychelense"]
["SDG","Dinar sudanés"]
["SEK","Corona sueca"]
["SGD","Dólar de Singapur"]
["SHP","Libra de Santa Elena"]
["SLL","Leone"]
["SOS","Chelín somalí"]
["SRD","Dólar surinamés"]
["SSP","Libra sursudanesa"]
["STN","Dobra"]
["SVC","Colon Salvadoreño"]
["SYP","Libra siria"]
["SZL","Lilangeni"]
["THB","Baht"]
["TJS","Somoni tayiko"]
["TMT","Manat turcomano"]
["TND","Dinar tunecino"]
["TOP","Paʻanga"]
["TRY","Lira turca"]
["TTD","Dólar de Trinidad y Tobago"]
["TWD","Nuevo dólar taiwanés"]
["TZS","Chelín tanzano"]
["UAH","Grivna"]
["UGX","Chelín ugandés"]
["USN","Dólar estadounidense (Siguiente día)"]
["UYI","Peso en Unidades Indexadas (Uruguay)"]
["UYU","Peso uruguayo"]
["UYW","Unidad Previsional"]
["UZS","Som uzbeko"]
["VES7​","Bolívar soberano"]
["VND","Dong vietnamita"]
["VUV","Vatu"]
["WST","Tala"]
["XAF","Franco CFA de África Central"]
["XAG","Plata (una onza troy)"]
["XAU","Oro (una onza troy)"]
["XBA","Unidad compuesta europea (EURCO) (Unidad del mercados de bonos)"]
["XBB","Unidad Monetaria europea (E.M.U.-6) (Unidad del mercado de bonos)"]
["XBC","Unidad europea de cuenta 9 (E.U.A.-9) (Unidad del mercado de bonos)"]
["XBD","Unidad europea de cuenta 17 (E.U.A.-17) (Unidad del mercado de bonos)"]
["XCD","Dólar del Caribe Oriental"]
["XDR","Derechos especiales de giro"]
["XOF","Franco CFA de África Occidental"]
["XPD","Paladio (una onza troy)"]
["XPF","Franco CFP"]
["XPT","Platino (una onza troy)"]
["XSU","SUCRE"]
["XTS","Reservado para pruebas"]
["XUA","Unidad de cuenta BAD"]
["XXX","Sin divisa"]
["YER","Rial yemení"]
["ZAR","Rand"]
["ZMW","Kwacha zambiano"]
["ZWL","Dólar zimbabuense"]